atlas-dev mailing list archives

Site index · List index
Message view « Date » · « Thread »
Top « Date » · « Thread »
From Apache Jenkins Server <jenk...@builds.apache.org>
Subject Build failed in Jenkins: Atlas-0.8-IntegrationTests #213
Date Tue, 10 Jul 2018 23:23:37 GMT
See <https://builds.apache.org/job/Atlas-0.8-IntegrationTests/213/display/redirect?page=changes>

Changes:

[ssubramanian] ATLAS-1950: Import API: Improvement: Specify Supertypes in Import

------------------------------------------
[...truncated 541.34 KB...]
127.0.0.1 - - [10/Jul/2018:22:53:11 +0000] "GET /api/atlas/v2/search/dsl?offset=0&query=Table+is+Dimension&limit=10
HTTP/1.1" 200 - "-" "Java/1.8.0_172"
127.0.0.1 - - [10/Jul/2018:22:53:12 +0000] "GET /api/atlas/v2/search/dsl?offset=0&query=Column+where+Column+isa+PII&limit=10
HTTP/1.1" 200 - "-" "Java/1.8.0_172"
127.0.0.1 - - [10/Jul/2018:22:53:12 +0000] "GET /api/atlas/v2/search/dsl?offset=0&query=View+is+Dimension&limit=10
HTTP/1.1" 200 - "-" "Java/1.8.0_172"
127.0.0.1 - - [10/Jul/2018:22:53:13 +0000] "GET /api/atlas/v2/search/dsl?offset=0&query=Column+select+Column.name&limit=10
HTTP/1.1" 200 - "-" "Java/1.8.0_172"
127.0.0.1 - - [10/Jul/2018:22:53:14 +0000] "GET /api/atlas/v2/search/dsl?offset=0&query=Column+select+name&limit=10
HTTP/1.1" 200 - "-" "Java/1.8.0_172"
127.0.0.1 - - [10/Jul/2018:22:53:15 +0000] "GET /api/atlas/v2/search/dsl?offset=0&query=Column+where+Column.name%3D%22customer_id%22&limit=10
HTTP/1.1" 200 - "-" "Java/1.8.0_172"
127.0.0.1 - - [10/Jul/2018:22:53:16 +0000] "GET /api/atlas/v2/search/dsl?offset=0&query=from+Table+select+Table.name&limit=10
HTTP/1.1" 200 - "-" "Java/1.8.0_172"
127.0.0.1 - - [10/Jul/2018:22:53:17 +0000] "GET /api/atlas/v2/search/dsl?offset=0&query=DB+where+(name+%3D+%22Reporting%22)&limit=10
HTTP/1.1" 200 - "-" "Java/1.8.0_172"
127.0.0.1 - - [10/Jul/2018:22:53:18 +0000] "GET /api/atlas/v2/search/dsl?offset=0&query=DB+where+(name+%3D+%22Reporting%22)+select+name+as+_col_0,+owner+as+_col_1&limit=10
HTTP/1.1" 200 - "-" "Java/1.8.0_172"
127.0.0.1 - - [10/Jul/2018:22:53:19 +0000] "GET /api/atlas/v2/search/dsl?offset=0&query=DB+where+DB+is+JdbcAccess&limit=10
HTTP/1.1" 200 - "-" "Java/1.8.0_172"
127.0.0.1 - - [10/Jul/2018:22:53:20 +0000] "GET /api/atlas/v2/search/dsl?offset=0&query=DB+where+DB+has+name&limit=10
HTTP/1.1" 200 - "-" "Java/1.8.0_172"
127.0.0.1 - - [10/Jul/2018:22:53:20 +0000] "GET /api/atlas/v2/search/dsl?offset=0&query=DB+Table&limit=10
HTTP/1.1" 200 - "-" "Java/1.8.0_172"
127.0.0.1 - - [10/Jul/2018:22:53:21 +0000] "GET /api/atlas/v2/search/dsl?offset=0&query=DB+as+db1+Table+where+(db1.name+%3D+%22Reporting%22)&limit=10
HTTP/1.1" 200 - "-" "Java/1.8.0_172"
127.0.0.1 - - [10/Jul/2018:22:53:22 +0000] "GET /api/atlas/v2/search/dsl?offset=0&query=DB+where+(name+%3D+%22Reporting%22)+select+name+as+_col_0,+(createTime+%2B+1)+as+_col_1+&limit=10
HTTP/1.1" 200 - "-" "Java/1.8.0_172"
127.0.0.1 - - [10/Jul/2018:22:53:23 +0000] "GET /api/atlas/v2/search/dsl?offset=0&query=Dimension&limit=10
HTTP/1.1" 200 - "-" "Java/1.8.0_172"
127.0.0.1 - - [10/Jul/2018:22:53:24 +0000] "GET /api/atlas/v2/search/dsl?offset=0&query=JdbcAccess&limit=10
HTTP/1.1" 200 - "-" "Java/1.8.0_172"
127.0.0.1 - - [10/Jul/2018:22:53:25 +0000] "GET /api/atlas/v2/search/dsl?offset=0&query=ETL&limit=10
HTTP/1.1" 200 - "-" "Java/1.8.0_172"
127.0.0.1 - - [10/Jul/2018:22:53:26 +0000] "GET /api/atlas/v2/search/dsl?offset=0&query=Metric&limit=10
HTTP/1.1" 200 - "-" "Java/1.8.0_172"
127.0.0.1 - - [10/Jul/2018:22:53:26 +0000] "GET /api/atlas/v2/search/dsl?offset=0&query=PII&limit=10
HTTP/1.1" 200 - "-" "Java/1.8.0_172"
127.0.0.1 - - [10/Jul/2018:22:53:27 +0000] "GET /api/atlas/v2/search/dsl?offset=0&query=%60Log+Data%60&limit=10
HTTP/1.1" 200 - "-" "Java/1.8.0_172"
127.0.0.1 - - [10/Jul/2018:22:53:28 +0000] "GET /api/atlas/v2/search/dsl?offset=0&query=Table+where+name%3D%22sales_fact%22,+columns&limit=10
HTTP/1.1" 200 - "-" "Java/1.8.0_172"
127.0.0.1 - - [10/Jul/2018:22:53:29 +0000] "GET /api/atlas/v2/search/dsl?offset=0&query=Table+where+name%3D%22sales_fact%22,+columns+as+column+select+column.name,+column.dataType,+column.comment&limit=10
HTTP/1.1" 200 - "-" "Java/1.8.0_172"
127.0.0.1 - - [10/Jul/2018:22:53:30 +0000] "GET /api/atlas/v2/search/dsl?offset=0&query=from+DataSet&limit=10
HTTP/1.1" 200 - "-" "Java/1.8.0_172"
127.0.0.1 - - [10/Jul/2018:22:53:31 +0000] "GET /api/atlas/v2/search/dsl?offset=0&query=from+Process&limit=10
HTTP/1.1" 200 - "-" "Java/1.8.0_172"
127.0.0.1 - - [10/Jul/2018:22:53:32 +0000] "GET /api/atlas/v2/entity/uniqueAttribute/type/Table?attr:qualifiedName=sales_fact_daily_mv
HTTP/1.1" 200 - "-" "Java/1.8.0_172"
127.0.0.1 - - [10/Jul/2018:22:53:32 +0000] "GET /api/atlas/v2/lineage/d7f6dfa2-011a-40fd-98f4-e681c7781395?depth=0&direction=BOTH
HTTP/1.1" 200 - "-" "Java/1.8.0_172"
127.0.0.1 - - [10/Jul/2018:22:53:34 +0000] "GET /api/atlas/v2/entity/uniqueAttribute/type/DB?attr:name=Sales
HTTP/1.1" 200 - "-" "Java/1.8.0_172"
127.0.0.1 - - [10/Jul/2018:22:53:34 +0000] "GET /api/atlas/v2/entity/uniqueAttribute/type/Table?attr:qualifiedName=sales_fact
HTTP/1.1" 200 - "-" "Java/1.8.0_172"
127.0.0.1 - - [10/Jul/2018:22:53:34 +0000] "GET /api/atlas/v2/entity/uniqueAttribute/type/Table?attr:qualifiedName=time_dim
HTTP/1.1" 200 - "-" "Java/1.8.0_172"
127.0.0.1 - - [10/Jul/2018:22:53:34 +0000] "GET /api/atlas/v2/entity/uniqueAttribute/type/Table?attr:qualifiedName=sales_fact_daily_mv
HTTP/1.1" 200 - "-" "Java/1.8.0_172"
127.0.0.1 - - [10/Jul/2018:22:53:34 +0000] "GET /api/atlas/v2/entity/uniqueAttribute/type/Table?attr:qualifiedName=sales_fact_monthly_mv
HTTP/1.1" 200 - "-" "Java/1.8.0_172"
127.0.0.1 - - [10/Jul/2018:22:53:34 +0000] "GET /api/atlas/v2/entity/uniqueAttribute/type/LoadProcess?attr:qualifiedName=loadSalesDaily
HTTP/1.1" 200 - "-" "Java/1.8.0_172"
127.0.0.1 - - [10/Jul/2018:22:53:34 +0000] "GET /api/atlas/v2/entity/uniqueAttribute/type/LoadProcess?attr:qualifiedName=loadSalesMonthly
HTTP/1.1" 200 - "-" "Java/1.8.0_172"
127.0.0.1 - - [10/Jul/2018:22:53:34 +0000] "GET /api/atlas/v2/lineage/d7f6dfa2-011a-40fd-98f4-e681c7781395?depth=0&direction=BOTH
HTTP/1.1" 200 - "-" "Java/1.8.0_172"
127.0.0.1 - - [10/Jul/2018:22:53:36 +0000] "GET /api/atlas/v2/entity/uniqueAttribute/type/LoadProcess?attr:qualifiedName=loadSalesDaily
HTTP/1.1" 200 - "-" "Java/1.8.0_172"
127.0.0.1 - - [10/Jul/2018:22:53:36 +0000] "GET /api/atlas/v2/entity/uniqueAttribute/type/Table?attr:qualifiedName=sales_fact
HTTP/1.1" 200 - "-" "Java/1.8.0_172"
127.0.0.1 - - [10/Jul/2018:22:53:36 +0000] "GET /api/atlas/v2/entity/uniqueAttribute/type/Table?attr:qualifiedName=time_dim
HTTP/1.1" 200 - "-" "Java/1.8.0_172"
127.0.0.1 - - [10/Jul/2018:22:53:36 +0000] "GET /api/atlas/v2/entity/uniqueAttribute/type/Table?attr:qualifiedName=sales_fact_daily_mv
HTTP/1.1" 200 - "-" "Java/1.8.0_172"
127.0.0.1 - - [10/Jul/2018:22:53:36 +0000] "GET /api/atlas/v2/entity/uniqueAttribute/type/Table?attr:qualifiedName=sales_fact
HTTP/1.1" 200 - "-" "Java/1.8.0_172"
127.0.0.1 - - [10/Jul/2018:22:53:36 +0000] "GET /api/atlas/v2/entity/uniqueAttribute/type/DB?attr:name=Sales
HTTP/1.1" 200 - "-" "Java/1.8.0_172"
127.0.0.1 - - [10/Jul/2018:22:53:36 +0000] "GET /api/atlas/v2/entity/guid/0d9037a8-f251-449b-a025-324447a71b97/classifications
HTTP/1.1" 200 - "-" "Java/1.8.0_172"
127.0.0.1 - - [10/Jul/2018:22:53:36 +0000] "GET /api/atlas/v2/entity/uniqueAttribute/type/View?attr:qualifiedName=product_dim_view
HTTP/1.1" 200 - "-" "Java/1.8.0_172"
127.0.0.1 - - [10/Jul/2018:22:53:36 +0000] "GET /api/atlas/v2/entity/uniqueAttribute/type/Table?attr:qualifiedName=product_dim
HTTP/1.1" 200 - "-" "Java/1.8.0_172"
Jul 10, 2018 10:53:37 PM java.io.ObjectInputStream filterCheck
INFO: ObjectInputFilter REJECTED: null, array length: -1, nRefs: 1, depth: 1, bytes: 70, ex:
n/a
Jul 10, 2018 10:53:37 PM java.io.ObjectInputStream filterCheck
INFO: ObjectInputFilter REJECTED: null, array length: -1, nRefs: 1, depth: 1, bytes: 70, ex:
n/a
Jul 10, 2018 10:53:38 PM java.io.ObjectInputStream filterCheck
INFO: ObjectInputFilter REJECTED: null, array length: -1, nRefs: 1, depth: 1, bytes: 70, ex:
n/a
Jul 10, 2018 10:53:38 PM java.io.ObjectInputStream filterCheck
INFO: ObjectInputFilter REJECTED: null, array length: -1, nRefs: 1, depth: 1, bytes: 70, ex:
n/a
Tests run: 135, Failures: 4, Errors: 0, Skipped: 0, Time elapsed: 196.678 sec <<<
FAILURE! - in TestSuite
testEnterEmptyValues(org.apache.atlas.CredentialProviderUtilityIT)  Time elapsed: 0.799 sec
 <<< FAILURE!
java.io.IOException: Invalid secret key format
	at com.sun.crypto.provider.JceKeyStore.engineLoad(JceKeyStore.java:856)
	at java.security.KeyStore.load(KeyStore.java:1445)
	at org.apache.hadoop.security.alias.AbstractJavaKeyStoreProvider.<init>(AbstractJavaKeyStoreProvider.java:106)
	at org.apache.hadoop.security.alias.JavaKeyStoreProvider.<init>(JavaKeyStoreProvider.java:49)
	at org.apache.hadoop.security.alias.JavaKeyStoreProvider.<init>(JavaKeyStoreProvider.java:41)
	at org.apache.hadoop.security.alias.JavaKeyStoreProvider$Factory.createProvider(JavaKeyStoreProvider.java:100)
	at org.apache.hadoop.security.alias.CredentialProviderFactory.getProviders(CredentialProviderFactory.java:58)
	at org.apache.atlas.CredentialProviderUtilityIT.testEnterEmptyValues(CredentialProviderUtilityIT.java:138)

testEnterMismatchedValues(org.apache.atlas.CredentialProviderUtilityIT)  Time elapsed: 0.604
sec  <<< FAILURE!
java.io.IOException: Invalid secret key format
	at com.sun.crypto.provider.JceKeyStore.engineLoad(JceKeyStore.java:856)
	at java.security.KeyStore.load(KeyStore.java:1445)
	at org.apache.hadoop.security.alias.AbstractJavaKeyStoreProvider.<init>(AbstractJavaKeyStoreProvider.java:106)
	at org.apache.hadoop.security.alias.JavaKeyStoreProvider.<init>(JavaKeyStoreProvider.java:49)
	at org.apache.hadoop.security.alias.JavaKeyStoreProvider.<init>(JavaKeyStoreProvider.java:41)
	at org.apache.hadoop.security.alias.JavaKeyStoreProvider$Factory.createProvider(JavaKeyStoreProvider.java:100)
	at org.apache.hadoop.security.alias.CredentialProviderFactory.getProviders(CredentialProviderFactory.java:58)
	at org.apache.atlas.CredentialProviderUtilityIT.testEnterMismatchedValues(CredentialProviderUtilityIT.java:192)

testEnterValidValues(org.apache.atlas.CredentialProviderUtilityIT)  Time elapsed: 0.604 sec
 <<< FAILURE!
java.io.IOException: Invalid secret key format
	at com.sun.crypto.provider.JceKeyStore.engineLoad(JceKeyStore.java:856)
	at java.security.KeyStore.load(KeyStore.java:1445)
	at org.apache.hadoop.security.alias.AbstractJavaKeyStoreProvider.<init>(AbstractJavaKeyStoreProvider.java:106)
	at org.apache.hadoop.security.alias.JavaKeyStoreProvider.<init>(JavaKeyStoreProvider.java:49)
	at org.apache.hadoop.security.alias.JavaKeyStoreProvider.<init>(JavaKeyStoreProvider.java:41)
	at org.apache.hadoop.security.alias.JavaKeyStoreProvider$Factory.createProvider(JavaKeyStoreProvider.java:100)
	at org.apache.hadoop.security.alias.CredentialProviderFactory.getProviders(CredentialProviderFactory.java:58)
	at org.apache.atlas.CredentialProviderUtilityIT.testEnterValidValues(CredentialProviderUtilityIT.java:76)

testOverwriteValues(org.apache.atlas.CredentialProviderUtilityIT)  Time elapsed: 0.597 sec
 <<< FAILURE!
java.io.IOException: Invalid secret key format
	at com.sun.crypto.provider.JceKeyStore.engineLoad(JceKeyStore.java:856)
	at java.security.KeyStore.load(KeyStore.java:1445)
	at org.apache.hadoop.security.alias.AbstractJavaKeyStoreProvider.<init>(AbstractJavaKeyStoreProvider.java:106)
	at org.apache.hadoop.security.alias.JavaKeyStoreProvider.<init>(JavaKeyStoreProvider.java:49)
	at org.apache.hadoop.security.alias.JavaKeyStoreProvider.<init>(JavaKeyStoreProvider.java:41)
	at org.apache.hadoop.security.alias.JavaKeyStoreProvider$Factory.createProvider(JavaKeyStoreProvider.java:100)
	at org.apache.hadoop.security.alias.CredentialProviderFactory.getProviders(CredentialProviderFactory.java:58)
	at org.apache.atlas.util.CredentialProviderUtility.getCredentialProvider(CredentialProviderUtility.java:150)
	at org.apache.atlas.util.CredentialProviderUtility.main(CredentialProviderUtility.java:75)
	at org.apache.atlas.CredentialProviderUtilityIT.testOverwriteValues(CredentialProviderUtilityIT.java:251)


Results :

Failed tests: 
  CredentialProviderUtilityIT.testEnterEmptyValues:138 » IO Invalid secret key f...
  CredentialProviderUtilityIT.testEnterMismatchedValues:192 » IO Invalid secret ...
  CredentialProviderUtilityIT.testEnterValidValues:76 » IO Invalid secret key fo...
  CredentialProviderUtilityIT.testOverwriteValues:251 » IO Invalid secret key fo...

Tests run: 135, Failures: 4, Errors: 0, Skipped: 0

[INFO] 
[INFO] --- jetty-maven-plugin:9.2.12.v20150709:stop (stop-jetty) @ atlas-webapp ---
[INFO] Waiting 10 seconds for jetty to stop
[INFO] Stopped ServerConnector@592c67fa{HTTP/1.1}{0.0.0.0:31000}
[INFO] Closing Spring root WebApplicationContext
[INFO] Shutting down log4j
[INFO] Not cleaning cached beans: no such field javax.el.BeanELResolver.properties
[INFO] Stopped o.e.j.m.p.JettyWebAppContext@53ca504a{/,<https://builds.apache.org/job/Atlas-0.8-IntegrationTests/ws/webapp/target/atlas-webapp-0.8.3-SNAPSHOT/,UNAVAILABLE}{/home/jenkins/jenkins-slave/workspace/Atlas-0.8-IntegrationTests/webapp/target/atlas-webapp-0.8.3-SNAPSHOT.war}>
[INFO] Server reports itself as stopped
[INFO] 
[INFO] --- maven-source-plugin:2.4:jar-no-fork (attach-sources) @ atlas-webapp ---
[INFO] Building jar: <https://builds.apache.org/job/Atlas-0.8-IntegrationTests/ws/webapp/target/atlas-webapp-0.8.3-SNAPSHOT-sources.jar>
[INFO] 
[INFO] --- maven-source-plugin:2.4:test-jar-no-fork (attach-sources) @ atlas-webapp ---
[INFO] Building jar: <https://builds.apache.org/job/Atlas-0.8-IntegrationTests/ws/webapp/target/atlas-webapp-0.8.3-SNAPSHOT-test-sources.jar>
[INFO] 
[INFO] --- maven-failsafe-plugin:2.18.1:verify (verify) @ atlas-webapp ---
[INFO] Failsafe report directory: <https://builds.apache.org/job/Atlas-0.8-IntegrationTests/ws/webapp/target/failsafe-reports>
[INFO] ------------------------------------------------------------------------
[INFO] Reactor Summary:
[INFO] 
[INFO] Apache Atlas Server Build Tools .................... SUCCESS [  0.659 s]
[INFO] apache-atlas ....................................... SUCCESS [  4.699 s]
[INFO] Apache Atlas Integration ........................... SUCCESS [ 19.121 s]
[INFO] Apache Atlas Common ................................ SUCCESS [  8.114 s]
[INFO] Apache Atlas Typesystem ............................ SUCCESS [ 48.852 s]
[INFO] Apache Atlas Client ................................ SUCCESS [  0.790 s]
[INFO] atlas-client-common ................................ SUCCESS [  7.065 s]
[INFO] atlas-client-v1 .................................... SUCCESS [  7.633 s]
[INFO] Apache Atlas Server API ............................ SUCCESS [  6.140 s]
[INFO] Apache Atlas Notification .......................... SUCCESS [ 11.022 s]
[INFO] atlas-client-v2 .................................... SUCCESS [  5.621 s]
[INFO] Apache Atlas Graph Database Projects ............... SUCCESS [  0.505 s]
[INFO] Apache Atlas Graph Database API .................... SUCCESS [  5.134 s]
[INFO] Graph Database Common Code ......................... SUCCESS [  5.008 s]
[INFO] Apache Atlas Titan 1.0.0 GraphDB Impl .............. SUCCESS [ 38.418 s]
[INFO] Shaded version of Apache hbase client .............. SUCCESS [  8.152 s]
[INFO] Apache Atlas Titan 0.5.4 Graph DB Impl ............. SUCCESS [ 37.130 s]
[INFO] Apache Atlas Graph Database Implementation Dependencies SUCCESS [  0.630 s]
[INFO] Shaded version of Apache hbase server .............. SUCCESS [ 22.440 s]
[INFO] Apache Atlas Repository ............................ SUCCESS [01:18 min]
[INFO] Apache Atlas Authorization ......................... SUCCESS [  6.717 s]
[INFO] Apache Atlas Business Catalog ...................... SUCCESS [ 10.371 s]
[INFO] Apache Atlas UI .................................... SUCCESS [01:31 min]
[INFO] Apache Atlas Web Application ....................... FAILURE [04:55 min]
[INFO] Apache Atlas Documentation ......................... SKIPPED
[INFO] Apache Atlas FileSystem Model ...................... SKIPPED
[INFO] Apache Atlas Plugin Classloader .................... SKIPPED
[INFO] Apache Atlas Hive Bridge Shim ...................... SKIPPED
[INFO] Apache Atlas Hive Bridge ........................... SKIPPED
[INFO] Apache Atlas Falcon Bridge Shim .................... SKIPPED
[INFO] Apache Atlas Falcon Bridge ......................... SKIPPED
[INFO] Apache Atlas Sqoop Bridge Shim ..................... SKIPPED
[INFO] Apache Atlas Sqoop Bridge .......................... SKIPPED
[INFO] Apache Atlas Storm Bridge Shim ..................... SKIPPED
[INFO] Apache Atlas Storm Bridge .......................... SKIPPED
[INFO] Apache Atlas Hbase Bridge Shim ..................... SKIPPED
[INFO] Apache Atlas Hbase Bridge .......................... SKIPPED
[INFO] Apache Atlas Migration Exporter .................... SKIPPED
[INFO] Apache Atlas Distribution .......................... SKIPPED
[INFO] ------------------------------------------------------------------------
[INFO] BUILD FAILURE
[INFO] ------------------------------------------------------------------------
[INFO] Total time: 12:00 min
[INFO] Finished at: 2018-07-10T22:53:42Z
[INFO] Final Memory: 380M/2585M
[INFO] ------------------------------------------------------------------------
log4j:WARN No appenders could be found for logger (org.apache.zookeeper.ClientCnxn).
log4j:WARN Please initialize the log4j system properly.
log4j:WARN See http://logging.apache.org/log4j/1.2/faq.html#noconfig for more info.
[ERROR] Failed to execute goal org.apache.maven.plugins:maven-failsafe-plugin:2.18.1:verify
(verify) on project atlas-webapp: There are test failures.
[ERROR] 
[ERROR] Please refer to <https://builds.apache.org/job/Atlas-0.8-IntegrationTests/ws/webapp/target/failsafe-reports>
for the individual test results.
[ERROR] -> [Help 1]
[ERROR] 
[ERROR] To see the full stack trace of the errors, re-run Maven with the -e switch.
[ERROR] Re-run Maven using the -X switch to enable full debug logging.
[ERROR] 
[ERROR] For more information about the errors and possible solutions, please read the following
articles:
[ERROR] [Help 1] http://cwiki.apache.org/confluence/display/MAVEN/MojoFailureException
[ERROR] 
[ERROR] After correcting the problems, you can resume the build with the command
[ERROR]   mvn <goals> -rf :atlas-webapp
Build step 'Execute shell' marked build as failure
[CHECKSTYLE] Collecting checkstyle analysis files...
[CHECKSTYLE] Searching for all files in <https://builds.apache.org/job/Atlas-0.8-IntegrationTests/ws/>
that match the pattern **/target/checkstyle-result.xml
[CHECKSTYLE] Parsing 22 files in <https://builds.apache.org/job/Atlas-0.8-IntegrationTests/ws/>
[CHECKSTYLE] Successfully parsed file <https://builds.apache.org/job/Atlas-0.8-IntegrationTests/ws/authorization/target/checkstyle-result.xml>
with 471 unique warnings and 0 duplicates.
[CHECKSTYLE] Successfully parsed file <https://builds.apache.org/job/Atlas-0.8-IntegrationTests/ws/catalog/target/checkstyle-result.xml>
with 2608 unique warnings and 0 duplicates.
[CHECKSTYLE] Successfully parsed file <https://builds.apache.org/job/Atlas-0.8-IntegrationTests/ws/client/client-v1/target/checkstyle-result.xml>
with 3484 unique warnings and 0 duplicates.
[CHECKSTYLE] Successfully parsed file <https://builds.apache.org/job/Atlas-0.8-IntegrationTests/ws/client/client-v2/target/checkstyle-result.xml>
with 3814 unique warnings and 0 duplicates.
[CHECKSTYLE] Successfully parsed file <https://builds.apache.org/job/Atlas-0.8-IntegrationTests/ws/client/common/target/checkstyle-result.xml>
with 4304 unique warnings and 0 duplicates.
[CHECKSTYLE] Successfully parsed file <https://builds.apache.org/job/Atlas-0.8-IntegrationTests/ws/client/target/checkstyle-result.xml>
with 4304 unique warnings and 0 duplicates.
[CHECKSTYLE] Successfully parsed file <https://builds.apache.org/job/Atlas-0.8-IntegrationTests/ws/common/target/checkstyle-result.xml>
with 5263 unique warnings and 0 duplicates.
[CHECKSTYLE] Successfully parsed file <https://builds.apache.org/job/Atlas-0.8-IntegrationTests/ws/dashboardv2/target/checkstyle-result.xml>
with 5263 unique warnings and 0 duplicates.
[CHECKSTYLE] Successfully parsed file <https://builds.apache.org/job/Atlas-0.8-IntegrationTests/ws/graphdb/api/target/checkstyle-result.xml>
with 5536 unique warnings and 0 duplicates.
[CHECKSTYLE] Successfully parsed file <https://builds.apache.org/job/Atlas-0.8-IntegrationTests/ws/graphdb/common/target/checkstyle-result.xml>
with 5723 unique warnings and 0 duplicates.
[CHECKSTYLE] Successfully parsed file <https://builds.apache.org/job/Atlas-0.8-IntegrationTests/ws/graphdb/graphdb-impls/target/checkstyle-result.xml>
with 5723 unique warnings and 0 duplicates.
[CHECKSTYLE] Successfully parsed file <https://builds.apache.org/job/Atlas-0.8-IntegrationTests/ws/graphdb/target/checkstyle-result.xml>
with 5723 unique warnings and 0 duplicates.
[CHECKSTYLE] Successfully parsed file <https://builds.apache.org/job/Atlas-0.8-IntegrationTests/ws/graphdb/titan0/target/checkstyle-result.xml>
with 8178 unique warnings and 0 duplicates.
[CHECKSTYLE] Successfully parsed file <https://builds.apache.org/job/Atlas-0.8-IntegrationTests/ws/graphdb/titan1/target/checkstyle-result.xml>
with 9145 unique warnings and 0 duplicates.
[CHECKSTYLE] Successfully parsed file <https://builds.apache.org/job/Atlas-0.8-IntegrationTests/ws/intg/target/checkstyle-result.xml>
with 16069 unique warnings and 0 duplicates.
[CHECKSTYLE] Successfully parsed file <https://builds.apache.org/job/Atlas-0.8-IntegrationTests/ws/notification/target/checkstyle-result.xml>
with 17826 unique warnings and 0 duplicates.
[CHECKSTYLE] Successfully parsed file <https://builds.apache.org/job/Atlas-0.8-IntegrationTests/ws/repository/target/checkstyle-result.xml>
with 36907 unique warnings and 0 duplicates.
[CHECKSTYLE] Successfully parsed file <https://builds.apache.org/job/Atlas-0.8-IntegrationTests/ws/server-api/target/checkstyle-result.xml>
with 37297 unique warnings and 0 duplicates.
[CHECKSTYLE] Successfully parsed file <https://builds.apache.org/job/Atlas-0.8-IntegrationTests/ws/shaded/hbase-client-shaded/target/checkstyle-result.xml>
with 37297 unique warnings and 0 duplicates.
[CHECKSTYLE] Successfully parsed file <https://builds.apache.org/job/Atlas-0.8-IntegrationTests/ws/shaded/hbase-server-shaded/target/checkstyle-result.xml>
with 37297 unique warnings and 0 duplicates.
[CHECKSTYLE] Successfully parsed file <https://builds.apache.org/job/Atlas-0.8-IntegrationTests/ws/target/checkstyle-result.xml>
with 37297 unique warnings and 0 duplicates.
[CHECKSTYLE] Successfully parsed file <https://builds.apache.org/job/Atlas-0.8-IntegrationTests/ws/typesystem/target/checkstyle-result.xml>
with 41538 unique warnings and 0 duplicates.
<Git Blamer> Using GitBlamer to create author and commit information for all warnings.
<Git Blamer> GIT_COMMIT=d16324cb8c9cf0170f14b2187929ed0edd311bf0, workspace=<https://builds.apache.org/job/Atlas-0.8-IntegrationTests/ws/>
 > git rev-parse d16324cb8c9cf0170f14b2187929ed0edd311bf0^{commit} # timeout=10
[FINDBUGS] Collecting findbugs analysis files...
[FINDBUGS] Searching for all files in <https://builds.apache.org/job/Atlas-0.8-IntegrationTests/ws/>
that match the pattern **/target/findbugs.xml
[FINDBUGS] Parsing 15 files in <https://builds.apache.org/job/Atlas-0.8-IntegrationTests/ws/>
[FINDBUGS] Successfully parsed file <https://builds.apache.org/job/Atlas-0.8-IntegrationTests/ws/authorization/target/findbugs.xml>
with 0 unique warnings and 0 duplicates.
[FINDBUGS] Successfully parsed file <https://builds.apache.org/job/Atlas-0.8-IntegrationTests/ws/catalog/target/findbugs.xml>
with 0 unique warnings and 0 duplicates.
[FINDBUGS] Successfully parsed file <https://builds.apache.org/job/Atlas-0.8-IntegrationTests/ws/client/client-v1/target/findbugs.xml>
with 0 unique warnings and 0 duplicates.
[FINDBUGS] Successfully parsed file <https://builds.apache.org/job/Atlas-0.8-IntegrationTests/ws/client/client-v2/target/findbugs.xml>
with 0 unique warnings and 0 duplicates.
[FINDBUGS] Successfully parsed file <https://builds.apache.org/job/Atlas-0.8-IntegrationTests/ws/client/common/target/findbugs.xml>
with 0 unique warnings and 0 duplicates.
[FINDBUGS] Successfully parsed file <https://builds.apache.org/job/Atlas-0.8-IntegrationTests/ws/common/target/findbugs.xml>
with 0 unique warnings and 0 duplicates.
[FINDBUGS] Successfully parsed file <https://builds.apache.org/job/Atlas-0.8-IntegrationTests/ws/graphdb/api/target/findbugs.xml>
with 0 unique warnings and 0 duplicates.
[FINDBUGS] Successfully parsed file <https://builds.apache.org/job/Atlas-0.8-IntegrationTests/ws/graphdb/common/target/findbugs.xml>
with 0 unique warnings and 0 duplicates.
[FINDBUGS] Successfully parsed file <https://builds.apache.org/job/Atlas-0.8-IntegrationTests/ws/graphdb/titan0/target/findbugs.xml>
with 0 unique warnings and 0 duplicates.
[FINDBUGS] Successfully parsed file <https://builds.apache.org/job/Atlas-0.8-IntegrationTests/ws/graphdb/titan1/target/findbugs.xml>
with 0 unique warnings and 0 duplicates.
[FINDBUGS] Successfully parsed file <https://builds.apache.org/job/Atlas-0.8-IntegrationTests/ws/intg/target/findbugs.xml>
with 0 unique warnings and 0 duplicates.
[FINDBUGS] Successfully parsed file <https://builds.apache.org/job/Atlas-0.8-IntegrationTests/ws/notification/target/findbugs.xml>
with 0 unique warnings and 0 duplicates.
[FINDBUGS] Successfully parsed file <https://builds.apache.org/job/Atlas-0.8-IntegrationTests/ws/repository/target/findbugs.xml>
with 0 unique warnings and 0 duplicates.
[FINDBUGS] Successfully parsed file <https://builds.apache.org/job/Atlas-0.8-IntegrationTests/ws/server-api/target/findbugs.xml>
with 0 unique warnings and 0 duplicates.
[FINDBUGS] Successfully parsed file <https://builds.apache.org/job/Atlas-0.8-IntegrationTests/ws/typesystem/target/findbugs.xml>
with 0 unique warnings and 0 duplicates.
<Git Blamer> Using GitBlamer to create author and commit information for all warnings.
<Git Blamer> GIT_COMMIT=d16324cb8c9cf0170f14b2187929ed0edd311bf0, workspace=<https://builds.apache.org/job/Atlas-0.8-IntegrationTests/ws/>
Archiving artifacts
[Fast Archiver] No prior successful build to compare, so performing full copy of artifacts
TestNG Reports Processing: START
Looking for TestNG results report in workspace using pattern: **/target/surefire-reports/testng-results.xml,**/target/failsafe-reports/testng-results.xml
Saving reports...
Processing '/x1/jenkins/jenkins-home/jobs/Atlas-0.8-IntegrationTests/builds/213/testng/testng-results.xml'
2.962963% of tests failed, which exceeded threshold of 0%. Marking build as UNSTABLE
TestNG Reports Processing: FINISH

Mime
View raw message