atlas-dev mailing list archives

Site index · List index
Message view « Date » · « Thread »
Top « Date » · « Thread »
From Apache Jenkins Server <jenk...@builds.apache.org>
Subject Build failed in Jenkins: PreCommit-ATLAS-Build-Test #498-master-ATLAS-upgrade-guava-version-to-25.1-2.patch
Date Tue, 03 Jul 2018 07:00:36 GMT
See <https://builds.apache.org/job/PreCommit-ATLAS-Build-Test/498/display/redirect>

------------------------------------------
[...truncated 246.20 KB...]
[ERROR] 	at org.apache.atlas.repository.graph.GraphBackedSearchIndexer.commit(GraphBackedSearchIndexer.java:694)
[ERROR] 	at org.apache.atlas.repository.graph.GraphBackedSearchIndexer.initialize(GraphBackedSearchIndexer.java:290)
[ERROR] 	... 68 more
[ERROR] Caused by: org.janusgraph.core.JanusGraphException: Could not commit transaction due
to exception during persistence
[ERROR] 	at org.janusgraph.graphdb.transaction.StandardJanusGraphTx.commit(StandardJanusGraphTx.java:1385)
[ERROR] 	at org.janusgraph.graphdb.database.management.ManagementSystem.commit(ManagementSystem.java:237)
[ERROR] 	at org.apache.atlas.repository.graphdb.janus.AtlasJanusGraphManagement.commit(AtlasJanusGraphManagement.java:130)
[ERROR] 	at org.apache.atlas.repository.graph.GraphBackedSearchIndexer.commit(GraphBackedSearchIndexer.java:689)
[ERROR] 	... 69 more
[ERROR] Caused by: org.janusgraph.core.JanusGraphException: Unexpected exception
[ERROR] 	at org.janusgraph.graphdb.database.StandardJanusGraph.commit(StandardJanusGraph.java:806)
[ERROR] 	at org.janusgraph.graphdb.transaction.StandardJanusGraphTx.commit(StandardJanusGraphTx.java:1374)
[ERROR] 	... 72 more
[ERROR] Caused by: java.lang.NoClassDefFoundError: com/carrotsearch/hppc/LongHashSet
[ERROR] 	at org.janusgraph.graphdb.database.EdgeSerializer.writeRelation(EdgeSerializer.java:303)
[ERROR] 	at org.janusgraph.graphdb.database.StandardJanusGraph.prepareCommit(StandardJanusGraph.java:592)
[ERROR] 	at org.janusgraph.graphdb.database.StandardJanusGraph.commit(StandardJanusGraph.java:721)
[ERROR] 	... 73 more
[ERROR] Caused by: java.lang.ClassNotFoundException: com.carrotsearch.hppc.LongHashSet
[ERROR] 	at java.net.URLClassLoader.findClass(URLClassLoader.java:381)
[ERROR] 	at java.lang.ClassLoader.loadClass(ClassLoader.java:424)
[ERROR] 	at sun.misc.Launcher$AppClassLoader.loadClass(Launcher.java:349)
[ERROR] 	at java.lang.ClassLoader.loadClass(ClassLoader.java:357)
[ERROR] 	... 76 more
[ERROR] 
[ERROR] 2) Error injecting constructor, org.apache.atlas.repository.RepositoryException: org.apache.atlas.repository.IndexException:
Index commit failed 
[ERROR]   at org.apache.atlas.repository.graph.GraphBackedSearchIndexer.<init>(GraphBackedSearchIndexer.java:111)
[ERROR]   while locating org.apache.atlas.repository.graph.GraphBackedSearchIndexer
[ERROR]   at org.apache.atlas.TestModules$TestOnlyModule.configure(TestModules.java:143)
[ERROR]   while locating org.apache.atlas.listener.TypeDefChangeListener annotated with @com.google.inject.multibindings.Element(setName=,uniqueId=2,
type=MULTIBINDER, keyType=)
[ERROR] Caused by: org.apache.atlas.repository.RepositoryException: org.apache.atlas.repository.IndexException:
Index commit failed 
[ERROR] 	at org.apache.atlas.repository.graph.GraphBackedSearchIndexer.initialize(GraphBackedSearchIndexer.java:297)
[ERROR] 	at org.apache.atlas.repository.graph.GraphBackedSearchIndexer.<init>(GraphBackedSearchIndexer.java:120)
[ERROR] 	at org.apache.atlas.repository.graph.GraphBackedSearchIndexer.<init>(GraphBackedSearchIndexer.java:111)
[ERROR] 	at org.apache.atlas.repository.graph.GraphBackedSearchIndexer$$FastClassByGuice$$c9ab13ce.newInstance(<generated>)
[ERROR] 	at com.google.inject.internal.DefaultConstructionProxyFactory$FastClassProxy.newInstance(DefaultConstructionProxyFactory.java:89)
[ERROR] 	at com.google.inject.internal.ConstructorInjector.provision(ConstructorInjector.java:111)
[ERROR] 	at com.google.inject.internal.ConstructorInjector.construct(ConstructorInjector.java:90)
[ERROR] 	at com.google.inject.internal.ConstructorBindingImpl$Factory.get(ConstructorBindingImpl.java:268)
[ERROR] 	at com.google.inject.internal.FactoryProxy.get(FactoryProxy.java:56)
[ERROR] 	at com.google.inject.internal.ProviderToInternalFactoryAdapter$1.call(ProviderToInternalFactoryAdapter.java:46)
[ERROR] 	at com.google.inject.internal.InjectorImpl.callInContext(InjectorImpl.java:1092)
[ERROR] 	at com.google.inject.internal.ProviderToInternalFactoryAdapter.get(ProviderToInternalFactoryAdapter.java:40)
[ERROR] 	at com.google.inject.internal.SingletonScope$1.get(SingletonScope.java:194)
[ERROR] 	at com.google.inject.internal.InternalFactoryToProviderAdapter.get(InternalFactoryToProviderAdapter.java:41)
[ERROR] 	at com.google.inject.internal.InternalInjectorCreator$1.call(InternalInjectorCreator.java:205)
[ERROR] 	at com.google.inject.internal.InternalInjectorCreator$1.call(InternalInjectorCreator.java:199)
[ERROR] 	at com.google.inject.internal.InjectorImpl.callInContext(InjectorImpl.java:1085)
[ERROR] 	at com.google.inject.internal.InternalInjectorCreator.loadEagerSingletons(InternalInjectorCreator.java:199)
[ERROR] 	at com.google.inject.internal.InternalInjectorCreator.injectDynamically(InternalInjectorCreator.java:180)
[ERROR] 	at com.google.inject.internal.InternalInjectorCreator.build(InternalInjectorCreator.java:110)
[ERROR] 	at com.google.inject.internal.InjectorImpl.createChildInjector(InjectorImpl.java:232)
[ERROR] 	at org.testng.TestRunner.getInjector(TestRunner.java:1626)
[ERROR] 	at org.testng.internal.ClassImpl.getInstanceFromGuice(ClassImpl.java:132)
[ERROR] 	at org.testng.internal.ClassImpl.getDefaultInstance(ClassImpl.java:112)
[ERROR] 	at org.testng.internal.ClassImpl.getInstances(ClassImpl.java:183)
[ERROR] 	at org.testng.internal.TestNGClassFinder.<init>(TestNGClassFinder.java:128)
[ERROR] 	at org.testng.TestRunner.initMethods(TestRunner.java:413)
[ERROR] 	at org.testng.TestRunner.init(TestRunner.java:239)
[ERROR] 	at org.testng.TestRunner.init(TestRunner.java:209)
[ERROR] 	at org.testng.TestRunner.<init>(TestRunner.java:157)
[ERROR] 	at org.testng.SuiteRunner$DefaultTestRunnerFactory.newTestRunner(SuiteRunner.java:546)
[ERROR] 	at org.testng.SuiteRunner.init(SuiteRunner.java:159)
[ERROR] 	at org.testng.SuiteRunner.<init>(SuiteRunner.java:113)
[ERROR] 	at org.testng.TestNG.createSuiteRunner(TestNG.java:1274)
[ERROR] 	at org.testng.TestNG.createSuiteRunners(TestNG.java:1261)
[ERROR] 	at org.testng.TestNG.runSuitesLocally(TestNG.java:1115)
[ERROR] 	at org.testng.TestNG.run(TestNG.java:1032)
[ERROR] 	at org.apache.maven.surefire.testng.TestNGExecutor.run(TestNGExecutor.java:115)
[ERROR] 	at org.apache.maven.surefire.testng.TestNGDirectoryTestSuite.executeSingleClass(TestNGDirectoryTestSuite.java:129)
[ERROR] 	at org.apache.maven.surefire.testng.TestNGDirectoryTestSuite.execute(TestNGDirectoryTestSuite.java:113)
[ERROR] 	at org.apache.maven.surefire.testng.TestNGProvider.invoke(TestNGProvider.java:111)
[ERROR] 	at org.apache.maven.surefire.booter.ForkedBooter.invokeProviderInSameClassLoader(ForkedBooter.java:203)
[ERROR] 	at org.apache.maven.surefire.booter.ForkedBooter.runSuitesInProcess(ForkedBooter.java:155)
[ERROR] 	at org.apache.maven.surefire.booter.ForkedBooter.main(ForkedBooter.java:103)
[ERROR] Caused by: org.apache.atlas.repository.IndexException: Index commit failed 
[ERROR] 	at org.apache.atlas.repository.graph.GraphBackedSearchIndexer.commit(GraphBackedSearchIndexer.java:694)
[ERROR] 	at org.apache.atlas.repository.graph.GraphBackedSearchIndexer.initialize(GraphBackedSearchIndexer.java:290)
[ERROR] 	... 43 more
[ERROR] Caused by: org.janusgraph.core.JanusGraphException: Could not commit transaction due
to exception during persistence
[ERROR] 	at org.janusgraph.graphdb.transaction.StandardJanusGraphTx.commit(StandardJanusGraphTx.java:1385)
[ERROR] 	at org.janusgraph.graphdb.database.management.ManagementSystem.commit(ManagementSystem.java:237)
[ERROR] 	at org.apache.atlas.repository.graphdb.janus.AtlasJanusGraphManagement.commit(AtlasJanusGraphManagement.java:130)
[ERROR] 	at org.apache.atlas.repository.graph.GraphBackedSearchIndexer.commit(GraphBackedSearchIndexer.java:689)
[ERROR] 	... 44 more
[ERROR] Caused by: org.janusgraph.core.JanusGraphException: Unexpected exception
[ERROR] 	at org.janusgraph.graphdb.database.StandardJanusGraph.commit(StandardJanusGraph.java:806)
[ERROR] 	at org.janusgraph.graphdb.transaction.StandardJanusGraphTx.commit(StandardJanusGraphTx.java:1374)
[ERROR] 	... 47 more
[ERROR] Caused by: java.lang.NoClassDefFoundError: com/carrotsearch/hppc/LongHashSet
[ERROR] 	at org.janusgraph.graphdb.database.EdgeSerializer.writeRelation(EdgeSerializer.java:303)
[ERROR] 	at org.janusgraph.graphdb.database.StandardJanusGraph.prepareCommit(StandardJanusGraph.java:592)
[ERROR] 	at org.janusgraph.graphdb.database.StandardJanusGraph.commit(StandardJanusGraph.java:721)
[ERROR] 	... 48 more
[ERROR] 
[ERROR] 3) Error injecting constructor, org.apache.atlas.repository.RepositoryException: org.apache.atlas.repository.IndexException:
Index commit failed 
[ERROR]   at org.apache.atlas.repository.graph.GraphBackedSearchIndexer.<init>(GraphBackedSearchIndexer.java:111)
[ERROR]   while locating org.apache.atlas.repository.graph.GraphBackedSearchIndexer
[ERROR]     for the 3rd parameter of org.apache.atlas.discovery.EntityDiscoveryService.<init>(EntityDiscoveryService.java:107)
[ERROR]   while locating org.apache.atlas.discovery.EntityDiscoveryService
[ERROR]   at org.apache.atlas.TestModules$TestOnlyModule.configure(TestModules.java:151)
[ERROR]   while locating org.apache.atlas.discovery.AtlasDiscoveryService
[ERROR] Caused by: org.apache.atlas.repository.RepositoryException: org.apache.atlas.repository.IndexException:
Index commit failed 
[ERROR] 	at org.apache.atlas.repository.graph.GraphBackedSearchIndexer.initialize(GraphBackedSearchIndexer.java:297)
[ERROR] 	at org.apache.atlas.repository.graph.GraphBackedSearchIndexer.<init>(GraphBackedSearchIndexer.java:120)
[ERROR] 	at org.apache.atlas.repository.graph.GraphBackedSearchIndexer.<init>(GraphBackedSearchIndexer.java:111)
[ERROR] 	at org.apache.atlas.repository.graph.GraphBackedSearchIndexer$$FastClassByGuice$$c9ab13ce.newInstance(<generated>)
[ERROR] 	at com.google.inject.internal.DefaultConstructionProxyFactory$FastClassProxy.newInstance(DefaultConstructionProxyFactory.java:89)
[ERROR] 	at com.google.inject.internal.ConstructorInjector.provision(ConstructorInjector.java:111)
[ERROR] 	at com.google.inject.internal.ConstructorInjector.construct(ConstructorInjector.java:90)
[ERROR] 	at com.google.inject.internal.ConstructorBindingImpl$Factory.get(ConstructorBindingImpl.java:268)
[ERROR] 	at com.google.inject.internal.SingleParameterInjector.inject(SingleParameterInjector.java:38)
[ERROR] 	at com.google.inject.internal.SingleParameterInjector.getAll(SingleParameterInjector.java:62)
[ERROR] 	at com.google.inject.internal.ConstructorInjector.provision(ConstructorInjector.java:110)
[ERROR] 	at com.google.inject.internal.ConstructorInjector.construct(ConstructorInjector.java:90)
[ERROR] 	at com.google.inject.internal.ConstructorBindingImpl$Factory.get(ConstructorBindingImpl.java:268)
[ERROR] 	at com.google.inject.internal.FactoryProxy.get(FactoryProxy.java:56)
[ERROR] 	at com.google.inject.internal.ProviderToInternalFactoryAdapter$1.call(ProviderToInternalFactoryAdapter.java:46)
[ERROR] 	at com.google.inject.internal.InjectorImpl.callInContext(InjectorImpl.java:1092)
[ERROR] 	at com.google.inject.internal.ProviderToInternalFactoryAdapter.get(ProviderToInternalFactoryAdapter.java:40)
[ERROR] 	at com.google.inject.internal.SingletonScope$1.get(SingletonScope.java:194)
[ERROR] 	at com.google.inject.internal.InternalFactoryToProviderAdapter.get(InternalFactoryToProviderAdapter.java:41)
[ERROR] 	at com.google.inject.internal.InternalInjectorCreator$1.call(InternalInjectorCreator.java:205)
[ERROR] 	at com.google.inject.internal.InternalInjectorCreator$1.call(InternalInjectorCreator.java:199)
[ERROR] 	at com.google.inject.internal.InjectorImpl.callInContext(InjectorImpl.java:1085)
[ERROR] 	at com.google.inject.internal.InternalInjectorCreator.loadEagerSingletons(InternalInjectorCreator.java:199)
[ERROR] 	at com.google.inject.internal.InternalInjectorCreator.injectDynamically(InternalInjectorCreator.java:180)
[ERROR] 	at com.google.inject.internal.InternalInjectorCreator.build(InternalInjectorCreator.java:110)
[ERROR] 	at com.google.inject.internal.InjectorImpl.createChildInjector(InjectorImpl.java:232)
[ERROR] 	at org.testng.TestRunner.getInjector(TestRunner.java:1626)
[ERROR] 	at org.testng.internal.ClassImpl.getInstanceFromGuice(ClassImpl.java:132)
[ERROR] 	at org.testng.internal.ClassImpl.getDefaultInstance(ClassImpl.java:112)
[ERROR] 	at org.testng.internal.ClassImpl.getInstances(ClassImpl.java:183)
[ERROR] 	at org.testng.internal.TestNGClassFinder.<init>(TestNGClassFinder.java:128)
[ERROR] 	at org.testng.TestRunner.initMethods(TestRunner.java:413)
[ERROR] 	at org.testng.TestRunner.init(TestRunner.java:239)
[ERROR] 	at org.testng.TestRunner.init(TestRunner.java:209)
[ERROR] 	at org.testng.TestRunner.<init>(TestRunner.java:157)
[ERROR] 	at org.testng.SuiteRunner$DefaultTestRunnerFactory.newTestRunner(SuiteRunner.java:546)
[ERROR] 	at org.testng.SuiteRunner.init(SuiteRunner.java:159)
[ERROR] 	at org.testng.SuiteRunner.<init>(SuiteRunner.java:113)
[ERROR] 	at org.testng.TestNG.createSuiteRunner(TestNG.java:1274)
[ERROR] 	at org.testng.TestNG.createSuiteRunners(TestNG.java:1261)
[ERROR] 	at org.testng.TestNG.runSuitesLocally(TestNG.java:1115)
[ERROR] 	at org.testng.TestNG.run(TestNG.java:1032)
[ERROR] 	at org.apache.maven.surefire.testng.TestNGExecutor.run(TestNGExecutor.java:115)
[ERROR] 	at org.apache.maven.surefire.testng.TestNGDirectoryTestSuite.executeSingleClass(TestNGDirectoryTestSuite.java:129)
[ERROR] 	at org.apache.maven.surefire.testng.TestNGDirectoryTestSuite.execute(TestNGDirectoryTestSuite.java:113)
[ERROR] 	at org.apache.maven.surefire.testng.TestNGProvider.invoke(TestNGProvider.java:111)
[ERROR] 	at org.apache.maven.surefire.booter.ForkedBooter.invokeProviderInSameClassLoader(ForkedBooter.java:203)
[ERROR] 	at org.apache.maven.surefire.booter.ForkedBooter.runSuitesInProcess(ForkedBooter.java:155)
[ERROR] 	at org.apache.maven.surefire.booter.ForkedBooter.main(ForkedBooter.java:103)
[ERROR] Caused by: org.apache.atlas.repository.IndexException: Index commit failed 
[ERROR] 	at org.apache.atlas.repository.graph.GraphBackedSearchIndexer.commit(GraphBackedSearchIndexer.java:694)
[ERROR] 	at org.apache.atlas.repository.graph.GraphBackedSearchIndexer.initialize(GraphBackedSearchIndexer.java:290)
[ERROR] 	... 48 more
[ERROR] Caused by: org.janusgraph.core.JanusGraphException: Could not commit transaction due
to exception during persistence
[ERROR] 	at org.janusgraph.graphdb.transaction.StandardJanusGraphTx.commit(StandardJanusGraphTx.java:1385)
[ERROR] 	at org.janusgraph.graphdb.database.management.ManagementSystem.commit(ManagementSystem.java:237)
[ERROR] 	at org.apache.atlas.repository.graphdb.janus.AtlasJanusGraphManagement.commit(AtlasJanusGraphManagement.java:130)
[ERROR] 	at org.apache.atlas.repository.graph.GraphBackedSearchIndexer.commit(GraphBackedSearchIndexer.java:689)
[ERROR] 	... 49 more
[ERROR] Caused by: org.janusgraph.core.JanusGraphException: Unexpected exception
[ERROR] 	at org.janusgraph.graphdb.database.StandardJanusGraph.commit(StandardJanusGraph.java:806)
[ERROR] 	at org.janusgraph.graphdb.transaction.StandardJanusGraphTx.commit(StandardJanusGraphTx.java:1374)
[ERROR] 	... 52 more
[ERROR] Caused by: java.lang.NoClassDefFoundError: com/carrotsearch/hppc/LongHashSet
[ERROR] 	at org.janusgraph.graphdb.database.EdgeSerializer.writeRelation(EdgeSerializer.java:303)
[ERROR] 	at org.janusgraph.graphdb.database.StandardJanusGraph.prepareCommit(StandardJanusGraph.java:592)
[ERROR] 	at org.janusgraph.graphdb.database.StandardJanusGraph.commit(StandardJanusGraph.java:721)
[ERROR] 	... 53 more
[ERROR] 
[ERROR] 3 errors
[ERROR] 	at com.google.inject.internal.Errors.throwCreationExceptionIfErrorsExist(Errors.java:470)
[ERROR] 	at com.google.inject.internal.InternalInjectorCreator.injectDynamically(InternalInjectorCreator.java:184)
[ERROR] 	at com.google.inject.internal.InternalInjectorCreator.build(InternalInjectorCreator.java:110)
[ERROR] 	at com.google.inject.internal.InjectorImpl.createChildInjector(InjectorImpl.java:232)
[ERROR] 	at org.testng.TestRunner.getInjector(TestRunner.java:1626)
[ERROR] 	at org.testng.internal.ClassImpl.getInstanceFromGuice(ClassImpl.java:132)
[ERROR] 	at org.testng.internal.ClassImpl.getDefaultInstance(ClassImpl.java:112)
[ERROR] 	at org.testng.internal.ClassImpl.getInstances(ClassImpl.java:183)
[ERROR] 	at org.testng.internal.TestNGClassFinder.<init>(TestNGClassFinder.java:128)
[ERROR] 	at org.testng.TestRunner.initMethods(TestRunner.java:413)
[ERROR] 	at org.testng.TestRunner.init(TestRunner.java:239)
[ERROR] 	at org.testng.TestRunner.init(TestRunner.java:209)
[ERROR] 	at org.testng.TestRunner.<init>(TestRunner.java:157)
[ERROR] 	at org.testng.SuiteRunner$DefaultTestRunnerFactory.newTestRunner(SuiteRunner.java:546)
[ERROR] 	at org.testng.SuiteRunner.init(SuiteRunner.java:159)
[ERROR] 	at org.testng.SuiteRunner.<init>(SuiteRunner.java:113)
[ERROR] 	at org.testng.TestNG.createSuiteRunner(TestNG.java:1274)
[ERROR] 	at org.testng.TestNG.createSuiteRunners(TestNG.java:1261)
[ERROR] 	at org.testng.TestNG.runSuitesLocally(TestNG.java:1115)
[ERROR] 	at org.testng.TestNG.run(TestNG.java:1032)
[ERROR] 	at org.apache.maven.surefire.testng.TestNGExecutor.run(TestNGExecutor.java:115)
[ERROR] 	at org.apache.maven.surefire.testng.TestNGDirectoryTestSuite.executeSingleClass(TestNGDirectoryTestSuite.java:129)
[ERROR] 	at org.apache.maven.surefire.testng.TestNGDirectoryTestSuite.execute(TestNGDirectoryTestSuite.java:113)
[ERROR] 	at org.apache.maven.surefire.testng.TestNGProvider.invoke(TestNGProvider.java:111)
[ERROR] 	at org.apache.maven.surefire.booter.ForkedBooter.invokeProviderInSameClassLoader(ForkedBooter.java:203)
[ERROR] 	at org.apache.maven.surefire.booter.ForkedBooter.runSuitesInProcess(ForkedBooter.java:155)
[ERROR] 	at org.apache.maven.surefire.booter.ForkedBooter.main(ForkedBooter.java:103)
[ERROR] -> [Help 1]
[ERROR] 
[ERROR] To see the full stack trace of the errors, re-run Maven with the -e switch.
[ERROR] Re-run Maven using the -X switch to enable full debug logging.
[ERROR] 
[ERROR] For more information about the errors and possible solutions, please read the following
articles:
[ERROR] [Help 1] http://cwiki.apache.org/confluence/display/MAVEN/MojoFailureException
[ERROR] 
[ERROR] After correcting the problems, you can resume the build with the command
[ERROR]   mvn <goals> -rf :atlas-repository




{color:red}-1 overall{color}.  

    {color:green}+1 @author{color}.  The patch does not contain any @author tags.

Console output: https://builds.apache.org/job/PreCommit-ATLAS-Build-Test/498//console

This message is automatically generated.


======================================================================
======================================================================
    Adding comment to Jira.
======================================================================
======================================================================




======================================================================
======================================================================
    Finished build.
======================================================================
======================================================================


+ EXIT_CODE=1
+ '[' -d <https://builds.apache.org/job/PreCommit-ATLAS-Build-Test/ws/../atlas_patchprocess_11199>
']'
+ '[' -d <https://builds.apache.org/job/PreCommit-ATLAS-Build-Test/ws/atlas_patchprocess_11199>
']'
+ mv <https://builds.apache.org/job/PreCommit-ATLAS-Build-Test/ws/atlas_patchprocess_11199>
<https://builds.apache.org/job/PreCommit-ATLAS-Build-Test/ws/patchprocess>
+ rm -f <https://builds.apache.org/job/PreCommit-ATLAS-Build-Test/ws/../atlas_patchprocess_11199>
+ exit 1
Build step 'Execute shell' marked build as failure
Set build name.
New build name is '#498-master-ATLAS-upgrade-guava-version-to-25.1-2.patch'
Archiving artifacts

Mime
View raw message