atlas-dev mailing list archives

Site index · List index
Message view « Date » · « Thread »
Top « Date » · « Thread »
From Apache Jenkins Server <jenk...@builds.apache.org>
Subject Build failed in Jenkins: Atlas-0.8-IntegrationTests #208
Date Tue, 05 Jun 2018 15:54:57 GMT
See <https://builds.apache.org/job/Atlas-0.8-IntegrationTests/208/display/redirect?page=changes>

Changes:

[madhan] ATLAS-2732: updated import-hive.sh/import-hbase.sh to handle kerberos

------------------------------------------
[...truncated 538.06 KB...]
127.0.0.1 - - [05/Jun/2018:15:50:18 +0000] "GET /api/atlas/entities/14ccc9f2-a86a-4b78-abfc-a65cb1e0bd55/audit?count=10
HTTP/1.1" 200 - "-" "Java/1.8.0_172"
127.0.0.1 - - [05/Jun/2018:15:50:18 +0000] "POST /api/atlas/v2/entity HTTP/1.1" 200 - "-"
"Java/1.8.0_172"
127.0.0.1 - - [05/Jun/2018:15:50:18 +0000] "POST /api/atlas/v2/entity HTTP/1.1" 200 - "-"
"Java/1.8.0_172"
127.0.0.1 - - [05/Jun/2018:15:50:18 +0000] "GET /api/atlas/v2/types/typedef/name/bjjcT0VOAC
HTTP/1.1" 404 - "-" "Java/1.8.0_172"
127.0.0.1 - - [05/Jun/2018:15:50:18 +0000] "POST /api/atlas/v2/types/typedefs HTTP/1.1" 200
- "-" "Java/1.8.0_172"
127.0.0.1 - - [05/Jun/2018:15:50:18 +0000] "POST /api/atlas/v2/entity HTTP/1.1" 200 - "-"
"Java/1.8.0_172"
127.0.0.1 - - [05/Jun/2018:15:50:18 +0000] "GET /api/atlas/v2/entity/guid/e45bc4d8-0eca-4015-8b6a-308e67d25080
HTTP/1.1" 200 - "-" "Java/1.8.0_172"
127.0.0.1 - - [05/Jun/2018:15:50:18 +0000] "GET /api/atlas/v2/entity/guid/7d0f787e-aa84-44d5-8927-c4e68bf2b32d
HTTP/1.1" 200 - "-" "Java/1.8.0_172"
127.0.0.1 - - [05/Jun/2018:15:50:18 +0000] "POST /api/atlas/v2/entity HTTP/1.1" 200 - "-"
"Java/1.8.0_172"
127.0.0.1 - - [05/Jun/2018:15:50:18 +0000] "GET /api/atlas/v2/entity/guid/7d0f787e-aa84-44d5-8927-c4e68bf2b32d
HTTP/1.1" 200 - "-" "Java/1.8.0_172"
127.0.0.1 - - [05/Jun/2018:15:50:18 +0000] "GET /api/atlas/v2/entity/guid/7d0f787e-aa84-44d5-8927-c4e68bf2b32d
HTTP/1.1" 200 - "-" "Java/1.8.0_172"
127.0.0.1 - - [05/Jun/2018:15:50:18 +0000] "POST /api/atlas/v2/entity HTTP/1.1" 200 - "-"
"Java/1.8.0_172"
127.0.0.1 - - [05/Jun/2018:15:50:18 +0000] "GET /api/atlas/v2/entity/guid/7d0f787e-aa84-44d5-8927-c4e68bf2b32d
HTTP/1.1" 200 - "-" "Java/1.8.0_172"
127.0.0.1 - - [05/Jun/2018:15:50:18 +0000] "GET /api/atlas/v2/entity/guid/7d0f787e-aa84-44d5-8927-c4e68bf2b32d
HTTP/1.1" 200 - "-" "Java/1.8.0_172"
127.0.0.1 - - [05/Jun/2018:15:50:18 +0000] "POST /api/atlas/v2/entity HTTP/1.1" 200 - "-"
"Java/1.8.0_172"
127.0.0.1 - - [05/Jun/2018:15:50:19 +0000] "GET /api/atlas/v2/entity/guid/7d0f787e-aa84-44d5-8927-c4e68bf2b32d
HTTP/1.1" 200 - "-" "Java/1.8.0_172"
127.0.0.1 - - [05/Jun/2018:15:50:19 +0000] "GET /api/atlas/v2/types/typedef/name/PII_TraitEilzYuATVM
HTTP/1.1" 404 - "-" "Java/1.8.0_172"
127.0.0.1 - - [05/Jun/2018:15:50:19 +0000] "POST /api/atlas/v2/types/typedefs HTTP/1.1" 200
- "-" "Java/1.8.0_172"
127.0.0.1 - - [05/Jun/2018:15:50:19 +0000] "DELETE /api/atlas/v2/entity/guid/7d0f787e-aa84-44d5-8927-c4e68bf2b32d/classification/PII_TraitEilzYuATVM
HTTP/1.1" 404 - "-" "Java/1.8.0_172"
127.0.0.1 - - [05/Jun/2018:15:50:19 +0000] "GET /api/atlas/v2/types/typedef/name/PII_TraitOHYNKp0imO
HTTP/1.1" 404 - "-" "Java/1.8.0_172"
127.0.0.1 - - [05/Jun/2018:15:50:19 +0000] "POST /api/atlas/v2/types/typedefs HTTP/1.1" 200
- "-" "Java/1.8.0_172"
127.0.0.1 - - [05/Jun/2018:15:50:19 +0000] "GET /api/atlas/v2/types/classificationdef/name/PII_TraitOHYNKp0imO
HTTP/1.1" 200 - "-" "Java/1.8.0_172"
127.0.0.1 - - [05/Jun/2018:15:50:19 +0000] "POST /api/atlas/v2/entity/guid/7d0f787e-aa84-44d5-8927-c4e68bf2b32d/classifications
HTTP/1.1" 204 - "-" "Java/1.8.0_172"
127.0.0.1 - - [05/Jun/2018:15:50:19 +0000] "GET /api/atlas/v2/entity/guid/7d0f787e-aa84-44d5-8927-c4e68bf2b32d/classifications
HTTP/1.1" 200 - "-" "Java/1.8.0_172"
127.0.0.1 - - [05/Jun/2018:15:50:19 +0000] "GET /api/atlas/v2/entity/guid/7d0f787e-aa84-44d5-8927-c4e68bf2b32d/classifications
HTTP/1.1" 200 - "-" "Java/1.8.0_172"
127.0.0.1 - - [05/Jun/2018:15:50:19 +0000] "POST /api/atlas/v2/entity HTTP/1.1" 200 - "-"
"Java/1.8.0_172"
127.0.0.1 - - [05/Jun/2018:15:50:19 +0000] "GET /api/atlas/v2/entity/guid/7d0f787e-aa84-44d5-8927-c4e68bf2b32d
HTTP/1.1" 200 - "-" "Java/1.8.0_172"
127.0.0.1 - - [05/Jun/2018:15:50:19 +0000] "PUT /api/atlas/v2/entity/uniqueAttribute/type/hive_table_v2?attr:qualifiedName=tablekptm4v3u0T
HTTP/1.1" 200 - "-" "Java/1.8.0_172"
127.0.0.1 - - [05/Jun/2018:15:50:19 +0000] "GET /api/atlas/v2/entity/guid/7d0f787e-aa84-44d5-8927-c4e68bf2b32d
HTTP/1.1" 200 - "-" "Java/1.8.0_172"
127.0.0.1 - - [05/Jun/2018:15:50:19 +0000] "GET /api/atlas/v2/types/typedef/name/PII_TraitrIzSz6flR3
HTTP/1.1" 404 - "-" "Java/1.8.0_172"
127.0.0.1 - - [05/Jun/2018:15:50:19 +0000] "POST /api/atlas/v2/types/typedefs HTTP/1.1" 200
- "-" "Java/1.8.0_172"
127.0.0.1 - - [05/Jun/2018:15:50:19 +0000] "POST /api/atlas/v2/entity/guid/7d0f787e-aa84-44d5-8927-c4e68bf2b32d/classifications
HTTP/1.1" 204 - "-" "Java/1.8.0_172"
127.0.0.1 - - [05/Jun/2018:15:50:20 +0000] "GET /api/atlas/entities/7d0f787e-aa84-44d5-8927-c4e68bf2b32d/audit?count=100
HTTP/1.1" 200 - "-" "Java/1.8.0_172"
127.0.0.1 - - [05/Jun/2018:15:50:20 +0000] "GET /api/atlas/v2/types/typedef/name/PII_TraitA5nlcTBHEI
HTTP/1.1" 404 - "-" "Java/1.8.0_172"
127.0.0.1 - - [05/Jun/2018:15:50:20 +0000] "POST /api/atlas/v2/types/typedefs HTTP/1.1" 200
- "-" "Java/1.8.0_172"
127.0.0.1 - - [05/Jun/2018:15:50:20 +0000] "POST /api/atlas/v2/entity/guid/7d0f787e-aa84-44d5-8927-c4e68bf2b32d/classifications
HTTP/1.1" 204 - "-" "Java/1.8.0_172"
127.0.0.1 - - [05/Jun/2018:15:50:20 +0000] "GET /api/atlas/v2/entity/guid/7d0f787e-aa84-44d5-8927-c4e68bf2b32d
HTTP/1.1" 200 - "-" "Java/1.8.0_172"
127.0.0.1 - - [05/Jun/2018:15:50:20 +0000] "DELETE /api/atlas/v2/entity/guid/7d0f787e-aa84-44d5-8927-c4e68bf2b32d/classification/PII_TraitrIzSz6flR3
HTTP/1.1" 204 - "-" "Java/1.8.0_172"
127.0.0.1 - - [05/Jun/2018:15:50:20 +0000] "GET /api/atlas/entities/7d0f787e-aa84-44d5-8927-c4e68bf2b32d/audit?count=100
HTTP/1.1" 200 - "-" "Java/1.8.0_172"
Tests run: 135, Failures: 5, Errors: 0, Skipped: 1, Time elapsed: 176.68 sec <<<
FAILURE! - in TestSuite
testEnterEmptyValues(org.apache.atlas.CredentialProviderUtilityIT)  Time elapsed: 0.629 sec
 <<< FAILURE!
java.io.IOException: Invalid secret key format
	at com.sun.crypto.provider.JceKeyStore.engineLoad(JceKeyStore.java:856)
	at java.security.KeyStore.load(KeyStore.java:1445)
	at org.apache.hadoop.security.alias.AbstractJavaKeyStoreProvider.<init>(AbstractJavaKeyStoreProvider.java:106)
	at org.apache.hadoop.security.alias.JavaKeyStoreProvider.<init>(JavaKeyStoreProvider.java:49)
	at org.apache.hadoop.security.alias.JavaKeyStoreProvider.<init>(JavaKeyStoreProvider.java:41)
	at org.apache.hadoop.security.alias.JavaKeyStoreProvider$Factory.createProvider(JavaKeyStoreProvider.java:100)
	at org.apache.hadoop.security.alias.CredentialProviderFactory.getProviders(CredentialProviderFactory.java:58)
	at org.apache.atlas.CredentialProviderUtilityIT.testEnterEmptyValues(CredentialProviderUtilityIT.java:138)

testEnterMismatchedValues(org.apache.atlas.CredentialProviderUtilityIT)  Time elapsed: 0.49
sec  <<< FAILURE!
java.io.IOException: Invalid secret key format
	at com.sun.crypto.provider.JceKeyStore.engineLoad(JceKeyStore.java:856)
	at java.security.KeyStore.load(KeyStore.java:1445)
	at org.apache.hadoop.security.alias.AbstractJavaKeyStoreProvider.<init>(AbstractJavaKeyStoreProvider.java:106)
	at org.apache.hadoop.security.alias.JavaKeyStoreProvider.<init>(JavaKeyStoreProvider.java:49)
	at org.apache.hadoop.security.alias.JavaKeyStoreProvider.<init>(JavaKeyStoreProvider.java:41)
	at org.apache.hadoop.security.alias.JavaKeyStoreProvider$Factory.createProvider(JavaKeyStoreProvider.java:100)
	at org.apache.hadoop.security.alias.CredentialProviderFactory.getProviders(CredentialProviderFactory.java:58)
	at org.apache.atlas.CredentialProviderUtilityIT.testEnterMismatchedValues(CredentialProviderUtilityIT.java:192)

testEnterValidValues(org.apache.atlas.CredentialProviderUtilityIT)  Time elapsed: 0.479 sec
 <<< FAILURE!
java.io.IOException: Invalid secret key format
	at com.sun.crypto.provider.JceKeyStore.engineLoad(JceKeyStore.java:856)
	at java.security.KeyStore.load(KeyStore.java:1445)
	at org.apache.hadoop.security.alias.AbstractJavaKeyStoreProvider.<init>(AbstractJavaKeyStoreProvider.java:106)
	at org.apache.hadoop.security.alias.JavaKeyStoreProvider.<init>(JavaKeyStoreProvider.java:49)
	at org.apache.hadoop.security.alias.JavaKeyStoreProvider.<init>(JavaKeyStoreProvider.java:41)
	at org.apache.hadoop.security.alias.JavaKeyStoreProvider$Factory.createProvider(JavaKeyStoreProvider.java:100)
	at org.apache.hadoop.security.alias.CredentialProviderFactory.getProviders(CredentialProviderFactory.java:58)
	at org.apache.atlas.CredentialProviderUtilityIT.testEnterValidValues(CredentialProviderUtilityIT.java:76)

testOverwriteValues(org.apache.atlas.CredentialProviderUtilityIT)  Time elapsed: 0.47 sec
 <<< FAILURE!
java.io.IOException: Invalid secret key format
	at com.sun.crypto.provider.JceKeyStore.engineLoad(JceKeyStore.java:856)
	at java.security.KeyStore.load(KeyStore.java:1445)
	at org.apache.hadoop.security.alias.AbstractJavaKeyStoreProvider.<init>(AbstractJavaKeyStoreProvider.java:106)
	at org.apache.hadoop.security.alias.JavaKeyStoreProvider.<init>(JavaKeyStoreProvider.java:49)
	at org.apache.hadoop.security.alias.JavaKeyStoreProvider.<init>(JavaKeyStoreProvider.java:41)
	at org.apache.hadoop.security.alias.JavaKeyStoreProvider$Factory.createProvider(JavaKeyStoreProvider.java:100)
	at org.apache.hadoop.security.alias.CredentialProviderFactory.getProviders(CredentialProviderFactory.java:58)
	at org.apache.atlas.util.CredentialProviderUtility.getCredentialProvider(CredentialProviderUtility.java:150)
	at org.apache.atlas.util.CredentialProviderUtility.main(CredentialProviderUtility.java:75)
	at org.apache.atlas.CredentialProviderUtilityIT.testOverwriteValues(CredentialProviderUtilityIT.java:251)

testCreate(org.apache.atlas.web.integration.TypedefsJerseyResourceIT)  Time elapsed: 0.166
sec  <<< FAILURE!
org.apache.atlas.AtlasServiceException: Metadata service API org.apache.atlas.AtlasBaseClient$API@852f2f8
failed with status 404 (Not Found) Response Body ({"errorCode":"ATLAS-404-00-001","errorMessage":"Given
typename fetl was invalid"})
	at org.apache.atlas.AtlasBaseClient.callAPIWithResource(AtlasBaseClient.java:387)
	at org.apache.atlas.AtlasBaseClient.callAPIWithResource(AtlasBaseClient.java:320)
	at org.apache.atlas.AtlasBaseClient.callAPI(AtlasBaseClient.java:236)
	at org.apache.atlas.AtlasClientV2.getTypeDefByName(AtlasClientV2.java:409)
	at org.apache.atlas.AtlasClientV2.getClassificationDefByName(AtlasClientV2.java:158)
	at org.apache.atlas.web.integration.TypedefsJerseyResourceIT.testCreate(TypedefsJerseyResourceIT.java:95)


Results :

Failed tests: 
  CredentialProviderUtilityIT.testEnterEmptyValues:138 » IO Invalid secret key f...
  CredentialProviderUtilityIT.testEnterMismatchedValues:192 » IO Invalid secret ...
  CredentialProviderUtilityIT.testEnterValidValues:76 » IO Invalid secret key fo...
  CredentialProviderUtilityIT.testOverwriteValues:251 » IO Invalid secret key fo...
  TypedefsJerseyResourceIT.testCreate:95 » AtlasService Metadata service API org...

Tests run: 135, Failures: 5, Errors: 0, Skipped: 1

[INFO] 
[INFO] --- jetty-maven-plugin:9.2.12.v20150709:stop (stop-jetty) @ atlas-webapp ---
[INFO] Waiting 10 seconds for jetty to stop
[INFO] Stopped ServerConnector@1386ee0e{HTTP/1.1}{0.0.0.0:31000}
[INFO] Closing Spring root WebApplicationContext
[INFO] Shutting down log4j
[INFO] Not cleaning cached beans: no such field javax.el.BeanELResolver.properties
[INFO] Stopped o.e.j.m.p.JettyWebAppContext@7f5e91f3{/,<https://builds.apache.org/job/Atlas-0.8-IntegrationTests/ws/webapp/target/atlas-webapp-0.8.3-SNAPSHOT/,UNAVAILABLE}{/home/jenkins/jenkins-slave/workspace/Atlas-0.8-IntegrationTests/webapp/target/atlas-webapp-0.8.3-SNAPSHOT.war}>
[INFO] Server reports itself as stopped
[INFO] 
[INFO] --- maven-source-plugin:2.4:jar-no-fork (attach-sources) @ atlas-webapp ---
[INFO] Building jar: <https://builds.apache.org/job/Atlas-0.8-IntegrationTests/ws/webapp/target/atlas-webapp-0.8.3-SNAPSHOT-sources.jar>
[INFO] 
[INFO] --- maven-source-plugin:2.4:test-jar-no-fork (attach-sources) @ atlas-webapp ---
[INFO] Building jar: <https://builds.apache.org/job/Atlas-0.8-IntegrationTests/ws/webapp/target/atlas-webapp-0.8.3-SNAPSHOT-test-sources.jar>
[INFO] 
[INFO] --- maven-failsafe-plugin:2.18.1:verify (verify) @ atlas-webapp ---
[INFO] Failsafe report directory: <https://builds.apache.org/job/Atlas-0.8-IntegrationTests/ws/webapp/target/failsafe-reports>
[INFO] ------------------------------------------------------------------------
[INFO] Reactor Summary:
[INFO] 
[INFO] Apache Atlas Server Build Tools .................... SUCCESS [  0.862 s]
[INFO] apache-atlas ....................................... SUCCESS [  4.724 s]
[INFO] Apache Atlas Integration ........................... SUCCESS [ 18.602 s]
[INFO] Apache Atlas Common ................................ SUCCESS [  7.635 s]
[INFO] Apache Atlas Typesystem ............................ SUCCESS [ 45.776 s]
[INFO] Apache Atlas Client ................................ SUCCESS [  0.593 s]
[INFO] atlas-client-common ................................ SUCCESS [  6.877 s]
[INFO] atlas-client-v1 .................................... SUCCESS [  7.015 s]
[INFO] Apache Atlas Server API ............................ SUCCESS [  5.779 s]
[INFO] Apache Atlas Notification .......................... SUCCESS [ 10.239 s]
[INFO] atlas-client-v2 .................................... SUCCESS [  5.649 s]
[INFO] Apache Atlas Graph Database Projects ............... SUCCESS [  0.498 s]
[INFO] Apache Atlas Graph Database API .................... SUCCESS [  4.870 s]
[INFO] Graph Database Common Code ......................... SUCCESS [  4.813 s]
[INFO] Apache Atlas Titan 1.0.0 GraphDB Impl .............. SUCCESS [ 35.008 s]
[INFO] Shaded version of Apache hbase client .............. SUCCESS [  7.350 s]
[INFO] Apache Atlas Titan 0.5.4 Graph DB Impl ............. SUCCESS [ 34.950 s]
[INFO] Apache Atlas Graph Database Implementation Dependencies SUCCESS [  0.713 s]
[INFO] Shaded version of Apache hbase server .............. SUCCESS [ 20.808 s]
[INFO] Apache Atlas Repository ............................ SUCCESS [01:13 min]
[INFO] Apache Atlas Authorization ......................... SUCCESS [  6.569 s]
[INFO] Apache Atlas Business Catalog ...................... SUCCESS [  9.397 s]
[INFO] Apache Atlas UI .................................... SUCCESS [01:20 min]
[INFO] Apache Atlas Web Application ....................... FAILURE [04:24 min]
[INFO] Apache Atlas Documentation ......................... SKIPPED
[INFO] Apache Atlas FileSystem Model ...................... SKIPPED
[INFO] Apache Atlas Plugin Classloader .................... SKIPPED
[INFO] Apache Atlas Hive Bridge Shim ...................... SKIPPED
[INFO] Apache Atlas Hive Bridge ........................... SKIPPED
[INFO] Apache Atlas Falcon Bridge Shim .................... SKIPPED
[INFO] Apache Atlas Falcon Bridge ......................... SKIPPED
[INFO] Apache Atlas Sqoop Bridge Shim ..................... SKIPPED
[INFO] Apache Atlas Sqoop Bridge .......................... SKIPPED
[INFO] Apache Atlas Storm Bridge Shim ..................... SKIPPED
[INFO] Apache Atlas Storm Bridge .......................... SKIPPED
[INFO] Apache Atlas Hbase Bridge Shim ..................... SKIPPED
[INFO] Apache Atlas Hbase Bridge .......................... SKIPPED
[INFO] Apache Atlas Migration Exporter .................... SKIPPED
[INFO] Apache Atlas Distribution .......................... SKIPPED
[INFO] ------------------------------------------------------------------------
[INFO] BUILD FAILURE
[INFO] ------------------------------------------------------------------------
[INFO] Total time: 10:59 min
[INFO] Finished at: 2018-06-05T15:50:24Z
[INFO] Final Memory: 375M/3973M
[INFO] ------------------------------------------------------------------------
log4j:WARN No appenders could be found for logger (org.apache.zookeeper.ClientCnxn).
log4j:WARN Please initialize the log4j system properly.
log4j:WARN See http://logging.apache.org/log4j/1.2/faq.html#noconfig for more info.
[ERROR] Failed to execute goal org.apache.maven.plugins:maven-failsafe-plugin:2.18.1:verify
(verify) on project atlas-webapp: There are test failures.
[ERROR] 
[ERROR] Please refer to <https://builds.apache.org/job/Atlas-0.8-IntegrationTests/ws/webapp/target/failsafe-reports>
for the individual test results.
[ERROR] -> [Help 1]
[ERROR] 
[ERROR] To see the full stack trace of the errors, re-run Maven with the -e switch.
[ERROR] Re-run Maven using the -X switch to enable full debug logging.
[ERROR] 
[ERROR] For more information about the errors and possible solutions, please read the following
articles:
[ERROR] [Help 1] http://cwiki.apache.org/confluence/display/MAVEN/MojoFailureException
[ERROR] 
[ERROR] After correcting the problems, you can resume the build with the command
[ERROR]   mvn <goals> -rf :atlas-webapp
Build step 'Execute shell' marked build as failure
[CHECKSTYLE] Collecting checkstyle analysis files...
[CHECKSTYLE] Searching for all files in <https://builds.apache.org/job/Atlas-0.8-IntegrationTests/ws/>
that match the pattern **/target/checkstyle-result.xml
[CHECKSTYLE] Parsing 22 files in <https://builds.apache.org/job/Atlas-0.8-IntegrationTests/ws/>
[CHECKSTYLE] Successfully parsed file <https://builds.apache.org/job/Atlas-0.8-IntegrationTests/ws/authorization/target/checkstyle-result.xml>
with 471 unique warnings and 0 duplicates.
[CHECKSTYLE] Successfully parsed file <https://builds.apache.org/job/Atlas-0.8-IntegrationTests/ws/catalog/target/checkstyle-result.xml>
with 2608 unique warnings and 0 duplicates.
[CHECKSTYLE] Successfully parsed file <https://builds.apache.org/job/Atlas-0.8-IntegrationTests/ws/client/client-v1/target/checkstyle-result.xml>
with 3484 unique warnings and 0 duplicates.
[CHECKSTYLE] Successfully parsed file <https://builds.apache.org/job/Atlas-0.8-IntegrationTests/ws/client/client-v2/target/checkstyle-result.xml>
with 3814 unique warnings and 0 duplicates.
[CHECKSTYLE] Successfully parsed file <https://builds.apache.org/job/Atlas-0.8-IntegrationTests/ws/client/common/target/checkstyle-result.xml>
with 4304 unique warnings and 0 duplicates.
[CHECKSTYLE] Successfully parsed file <https://builds.apache.org/job/Atlas-0.8-IntegrationTests/ws/client/target/checkstyle-result.xml>
with 4304 unique warnings and 0 duplicates.
[CHECKSTYLE] Successfully parsed file <https://builds.apache.org/job/Atlas-0.8-IntegrationTests/ws/common/target/checkstyle-result.xml>
with 5263 unique warnings and 0 duplicates.
[CHECKSTYLE] Successfully parsed file <https://builds.apache.org/job/Atlas-0.8-IntegrationTests/ws/dashboardv2/target/checkstyle-result.xml>
with 5263 unique warnings and 0 duplicates.
[CHECKSTYLE] Successfully parsed file <https://builds.apache.org/job/Atlas-0.8-IntegrationTests/ws/graphdb/api/target/checkstyle-result.xml>
with 5536 unique warnings and 0 duplicates.
[CHECKSTYLE] Successfully parsed file <https://builds.apache.org/job/Atlas-0.8-IntegrationTests/ws/graphdb/common/target/checkstyle-result.xml>
with 5723 unique warnings and 0 duplicates.
[CHECKSTYLE] Successfully parsed file <https://builds.apache.org/job/Atlas-0.8-IntegrationTests/ws/graphdb/graphdb-impls/target/checkstyle-result.xml>
with 5723 unique warnings and 0 duplicates.
[CHECKSTYLE] Successfully parsed file <https://builds.apache.org/job/Atlas-0.8-IntegrationTests/ws/graphdb/target/checkstyle-result.xml>
with 5723 unique warnings and 0 duplicates.
[CHECKSTYLE] Successfully parsed file <https://builds.apache.org/job/Atlas-0.8-IntegrationTests/ws/graphdb/titan0/target/checkstyle-result.xml>
with 8178 unique warnings and 0 duplicates.
[CHECKSTYLE] Successfully parsed file <https://builds.apache.org/job/Atlas-0.8-IntegrationTests/ws/graphdb/titan1/target/checkstyle-result.xml>
with 9145 unique warnings and 0 duplicates.
[CHECKSTYLE] Successfully parsed file <https://builds.apache.org/job/Atlas-0.8-IntegrationTests/ws/intg/target/checkstyle-result.xml>
with 16069 unique warnings and 0 duplicates.
[CHECKSTYLE] Successfully parsed file <https://builds.apache.org/job/Atlas-0.8-IntegrationTests/ws/notification/target/checkstyle-result.xml>
with 17826 unique warnings and 0 duplicates.
[CHECKSTYLE] Successfully parsed file <https://builds.apache.org/job/Atlas-0.8-IntegrationTests/ws/repository/target/checkstyle-result.xml>
with 36863 unique warnings and 0 duplicates.
[CHECKSTYLE] Successfully parsed file <https://builds.apache.org/job/Atlas-0.8-IntegrationTests/ws/server-api/target/checkstyle-result.xml>
with 37253 unique warnings and 0 duplicates.
[CHECKSTYLE] Successfully parsed file <https://builds.apache.org/job/Atlas-0.8-IntegrationTests/ws/shaded/hbase-client-shaded/target/checkstyle-result.xml>
with 37253 unique warnings and 0 duplicates.
[CHECKSTYLE] Successfully parsed file <https://builds.apache.org/job/Atlas-0.8-IntegrationTests/ws/shaded/hbase-server-shaded/target/checkstyle-result.xml>
with 37253 unique warnings and 0 duplicates.
[CHECKSTYLE] Successfully parsed file <https://builds.apache.org/job/Atlas-0.8-IntegrationTests/ws/target/checkstyle-result.xml>
with 37253 unique warnings and 0 duplicates.
[CHECKSTYLE] Successfully parsed file <https://builds.apache.org/job/Atlas-0.8-IntegrationTests/ws/typesystem/target/checkstyle-result.xml>
with 41494 unique warnings and 0 duplicates.
<Git Blamer> Using GitBlamer to create author and commit information for all warnings.
<Git Blamer> GIT_COMMIT=61e03d4075cc98fe94ed82b7bf7cc14924062bcf, workspace=<https://builds.apache.org/job/Atlas-0.8-IntegrationTests/ws/>
 > git rev-parse 61e03d4075cc98fe94ed82b7bf7cc14924062bcf^{commit} # timeout=10
<Git Blamer> Skipping file <https://builds.apache.org/job/Atlas-0.8-IntegrationTests/ws/repository/src/main/java/org/apache/atlas/discovery/SearchIndexer.java,>
no result found.
<Git Blamer> Skipping file <https://builds.apache.org/job/Atlas-0.8-IntegrationTests/ws/catalog/src/main/java/org/apache/atlas/catalog/projection/Relation.java,>
no result found.
[FINDBUGS] Collecting findbugs analysis files...
[FINDBUGS] Searching for all files in <https://builds.apache.org/job/Atlas-0.8-IntegrationTests/ws/>
that match the pattern **/target/findbugs.xml
[FINDBUGS] Parsing 15 files in <https://builds.apache.org/job/Atlas-0.8-IntegrationTests/ws/>
[FINDBUGS] Successfully parsed file <https://builds.apache.org/job/Atlas-0.8-IntegrationTests/ws/authorization/target/findbugs.xml>
with 0 unique warnings and 0 duplicates.
[FINDBUGS] Successfully parsed file <https://builds.apache.org/job/Atlas-0.8-IntegrationTests/ws/catalog/target/findbugs.xml>
with 0 unique warnings and 0 duplicates.
[FINDBUGS] Successfully parsed file <https://builds.apache.org/job/Atlas-0.8-IntegrationTests/ws/client/client-v1/target/findbugs.xml>
with 0 unique warnings and 0 duplicates.
[FINDBUGS] Successfully parsed file <https://builds.apache.org/job/Atlas-0.8-IntegrationTests/ws/client/client-v2/target/findbugs.xml>
with 0 unique warnings and 0 duplicates.
[FINDBUGS] Successfully parsed file <https://builds.apache.org/job/Atlas-0.8-IntegrationTests/ws/client/common/target/findbugs.xml>
with 0 unique warnings and 0 duplicates.
[FINDBUGS] Successfully parsed file <https://builds.apache.org/job/Atlas-0.8-IntegrationTests/ws/common/target/findbugs.xml>
with 0 unique warnings and 0 duplicates.
[FINDBUGS] Successfully parsed file <https://builds.apache.org/job/Atlas-0.8-IntegrationTests/ws/graphdb/api/target/findbugs.xml>
with 0 unique warnings and 0 duplicates.
[FINDBUGS] Successfully parsed file <https://builds.apache.org/job/Atlas-0.8-IntegrationTests/ws/graphdb/common/target/findbugs.xml>
with 0 unique warnings and 0 duplicates.
[FINDBUGS] Successfully parsed file <https://builds.apache.org/job/Atlas-0.8-IntegrationTests/ws/graphdb/titan0/target/findbugs.xml>
with 0 unique warnings and 0 duplicates.
[FINDBUGS] Successfully parsed file <https://builds.apache.org/job/Atlas-0.8-IntegrationTests/ws/graphdb/titan1/target/findbugs.xml>
with 0 unique warnings and 0 duplicates.
[FINDBUGS] Successfully parsed file <https://builds.apache.org/job/Atlas-0.8-IntegrationTests/ws/intg/target/findbugs.xml>
with 0 unique warnings and 0 duplicates.
[FINDBUGS] Successfully parsed file <https://builds.apache.org/job/Atlas-0.8-IntegrationTests/ws/notification/target/findbugs.xml>
with 0 unique warnings and 0 duplicates.
[FINDBUGS] Successfully parsed file <https://builds.apache.org/job/Atlas-0.8-IntegrationTests/ws/repository/target/findbugs.xml>
with 0 unique warnings and 0 duplicates.
[FINDBUGS] Successfully parsed file <https://builds.apache.org/job/Atlas-0.8-IntegrationTests/ws/server-api/target/findbugs.xml>
with 0 unique warnings and 0 duplicates.
[FINDBUGS] Successfully parsed file <https://builds.apache.org/job/Atlas-0.8-IntegrationTests/ws/typesystem/target/findbugs.xml>
with 0 unique warnings and 0 duplicates.
<Git Blamer> Using GitBlamer to create author and commit information for all warnings.
<Git Blamer> GIT_COMMIT=61e03d4075cc98fe94ed82b7bf7cc14924062bcf, workspace=<https://builds.apache.org/job/Atlas-0.8-IntegrationTests/ws/>
Archiving artifacts
[Fast Archiver] No prior successful build to compare, so performing full copy of artifacts
TestNG Reports Processing: START
Looking for TestNG results report in workspace using pattern: **/target/surefire-reports/testng-results.xml,**/target/failsafe-reports/testng-results.xml
Saving reports...
Processing '/x1/jenkins/jenkins-home/jobs/Atlas-0.8-IntegrationTests/builds/208/testng/testng-results.xml'
3.703704% of tests failed, which exceeded threshold of 0%. Marking build as UNSTABLE
TestNG Reports Processing: FINISH

Mime
View raw message