atlas-dev mailing list archives

Site index · List index
Message view « Date » · « Thread »
Top « Date » · « Thread »
From Apache Jenkins Server <jenk...@builds.apache.org>
Subject Build failed in Jenkins: Atlas-1.0-AllTests #369
Date Wed, 27 Jun 2018 13:16:58 GMT
See <https://builds.apache.org/job/Atlas-1.0-AllTests/369/display/redirect>

------------------------------------------
[...truncated 747.43 KB...]
	at org.apache.atlas.hive.HiveITBase.assertEntityIsRegistered(HiveITBase.java:206)
	at org.apache.atlas.hive.hook.HiveHookIT.assertProcessIsRegistered(HiveHookIT.java:1859)
	at org.apache.atlas.hive.hook.HiveHookIT.testLoadLocalPathIntoPartition(HiveHookIT.java:469)

testTraitsPreservedOnColumnRename(org.apache.atlas.hive.hook.HiveHookIT)  Time elapsed: 459.18
sec  <<< FAILURE!
java.lang.AssertionError: Assertions failed. Failing after waiting for timeout 80000 msecs
	at org.apache.atlas.AtlasBaseClient.callAPIWithResource(AtlasBaseClient.java:395)
	at org.apache.atlas.AtlasBaseClient.callAPIWithResource(AtlasBaseClient.java:323)
	at org.apache.atlas.AtlasBaseClient.callAPI(AtlasBaseClient.java:228)
	at org.apache.atlas.AtlasClientV2.getEntityByAttribute(AtlasClientV2.java:264)
	at org.apache.atlas.hive.HiveITBase$1.evaluate(HiveITBase.java:209)
	at org.apache.atlas.hive.HiveITBase.waitFor(HiveITBase.java:266)
	at org.apache.atlas.hive.HiveITBase.assertEntityIsRegistered(HiveITBase.java:206)
	at org.apache.atlas.hive.hook.HiveHookIT.assertColumnIsRegistered(HiveHookIT.java:288)
	at org.apache.atlas.hive.hook.HiveHookIT.assertColumnIsRegistered(HiveHookIT.java:282)
	at org.apache.atlas.hive.hook.HiveHookIT.testTraitsPreservedOnColumnRename(HiveHookIT.java:1356)

testTruncateTable(org.apache.atlas.hive.hook.HiveHookIT)  Time elapsed: 459.189 sec  <<<
FAILURE!
java.lang.AssertionError: Assertions failed. Failing after waiting for timeout 80000 msecs
	at org.apache.atlas.AtlasBaseClient.callAPIWithResource(AtlasBaseClient.java:395)
	at org.apache.atlas.AtlasBaseClient.callAPIWithResource(AtlasBaseClient.java:323)
	at org.apache.atlas.AtlasBaseClient.callAPI(AtlasBaseClient.java:228)
	at org.apache.atlas.AtlasClientV2.getEntityByAttribute(AtlasClientV2.java:264)
	at org.apache.atlas.hive.HiveITBase$1.evaluate(HiveITBase.java:209)
	at org.apache.atlas.hive.HiveITBase.waitFor(HiveITBase.java:266)
	at org.apache.atlas.hive.HiveITBase.assertEntityIsRegistered(HiveITBase.java:206)
	at org.apache.atlas.hive.HiveITBase.assertTableIsRegistered(HiveITBase.java:200)
	at org.apache.atlas.hive.HiveITBase.assertTableIsRegistered(HiveITBase.java:194)
	at org.apache.atlas.hive.hook.HiveHookIT.testTruncateTable(HiveHookIT.java:1287)

testUpdateProcess(org.apache.atlas.hive.hook.HiveHookIT)  Time elapsed: 460.92 sec  <<<
FAILURE!
java.lang.AssertionError: Assertions failed. Failing after waiting for timeout 80000 msecs
	at org.apache.atlas.AtlasBaseClient.callAPIWithResource(AtlasBaseClient.java:395)
	at org.apache.atlas.AtlasBaseClient.callAPIWithResource(AtlasBaseClient.java:323)
	at org.apache.atlas.AtlasBaseClient.callAPI(AtlasBaseClient.java:228)
	at org.apache.atlas.AtlasClientV2.getEntityByAttribute(AtlasClientV2.java:264)
	at org.apache.atlas.hive.HiveITBase$1.evaluate(HiveITBase.java:209)
	at org.apache.atlas.hive.HiveITBase.waitFor(HiveITBase.java:266)
	at org.apache.atlas.hive.HiveITBase.assertEntityIsRegistered(HiveITBase.java:206)
	at org.apache.atlas.hive.hook.HiveHookIT.assertProcessIsRegistered(HiveHookIT.java:1889)
	at org.apache.atlas.hive.hook.HiveHookIT.validateProcess(HiveHookIT.java:519)
	at org.apache.atlas.hive.hook.HiveHookIT.validateProcess(HiveHookIT.java:529)
	at org.apache.atlas.hive.hook.HiveHookIT.testUpdateProcess(HiveHookIT.java:618)


Results :

Failed tests: 
  HiveMetastoreBridgeIT.testCreateTableAndImport:42->HiveITBase.assertDatabaseIsRegistered:307->HiveITBase.assertDatabaseIsRegistered:313->HiveITBase.assertEntityIsRegistered:206->HiveITBase.waitFor:270
Assertions failed. Failing after waiting for timeout 80000 msecs
  HiveMetastoreBridgeIT.testImportCreatedTable:81->HiveITBase.assertDatabaseIsRegistered:307->HiveITBase.assertDatabaseIsRegistered:313->HiveITBase.assertEntityIsRegistered:206->HiveITBase.waitFor:270
Assertions failed. Failing after waiting for timeout 80000 msecs
  HiveHookIT.testAlterDBOwner:1705->HiveITBase.assertDatabaseIsRegistered:307->HiveITBase.assertDatabaseIsRegistered:313->HiveITBase.assertEntityIsRegistered:206->HiveITBase.waitFor:270
Assertions failed. Failing after waiting for timeout 80000 msecs
  HiveHookIT.testAlterDBProperties:1726->testAlterProperties:1749->verifyEntityProperties:1797->HiveITBase.assertDatabaseIsRegistered:313->HiveITBase.assertEntityIsRegistered:206->HiveITBase.waitFor:270
Assertions failed. Failing after waiting for timeout 80000 msecs
  HiveHookIT.testAlterTableAddColumn:1029->assertColumnIsRegistered:282->assertColumnIsRegistered:288->HiveITBase.assertEntityIsRegistered:206->HiveITBase.waitFor:270
Assertions failed. Failing after waiting for timeout 80000 msecs
  HiveHookIT.testAlterTableBucketingClusterSort:1458->runBucketSortQuery:1471->assertTableIsRegistered:1968->HiveITBase.assertTableIsRegistered:200->HiveITBase.assertEntityIsRegistered:206->HiveITBase.waitFor:270
Assertions failed. Failing after waiting for timeout 80000 msecs
  HiveHookIT.testAlterTableChangeColumn:1065->assertColumnIsNotRegistered:300->assertEntityIsNotRegistered:1972->HiveITBase.waitFor:270
Assertions failed. Failing after waiting for timeout 80000 msecs
  HiveHookIT.testAlterTableFileFormat:1421->assertTableIsRegistered:1968->HiveITBase.assertTableIsRegistered:200->HiveITBase.assertEntityIsRegistered:206->HiveITBase.waitFor:270
Assertions failed. Failing after waiting for timeout 80000 msecs
  HiveHookIT.testAlterTableLocation:1397->assertTableIsRegistered:1968->HiveITBase.assertTableIsRegistered:200->HiveITBase.assertEntityIsRegistered:206->HiveITBase.waitFor:270
Assertions failed. Failing after waiting for timeout 80000 msecs
  HiveHookIT.testAlterTablePartitionColumnType:1309->assertColumnIsRegistered:288->HiveITBase.assertEntityIsRegistered:206->HiveITBase.waitFor:270
Assertions failed. Failing after waiting for timeout 80000 msecs
  HiveHookIT.testAlterTableProperties:1734->testAlterProperties:1749->verifyEntityProperties:1789->assertTableIsRegistered:1968->HiveITBase.assertTableIsRegistered:200->HiveITBase.assertEntityIsRegistered:206->HiveITBase.waitFor:270
Assertions failed. Failing after waiting for timeout 80000 msecs
  HiveHookIT.testAlterTableRename:938->HiveITBase.assertTableIsRegistered:194->HiveITBase.assertTableIsRegistered:200->HiveITBase.assertEntityIsRegistered:206->HiveITBase.waitFor:270
Assertions failed. Failing after waiting for timeout 80000 msecs
  HiveHookIT.testAlterTableRenameAliasRegistered:916->HiveITBase.assertTableIsRegistered:194->HiveITBase.assertTableIsRegistered:200->HiveITBase.assertEntityIsRegistered:206->HiveITBase.waitFor:270
Assertions failed. Failing after waiting for timeout 80000 msecs
  HiveHookIT.testAlterTableSerde:1512->runSerdePropsQuery:1682->verifyTableSdProperties:1808->assertTableIsRegistered:1968->HiveITBase.assertTableIsRegistered:200->HiveITBase.assertEntityIsRegistered:206->HiveITBase.waitFor:270
Assertions failed. Failing after waiting for timeout 80000 msecs
  HiveHookIT.testAlterTableWithoutHookConf:1334->assertTableIsNotRegistered:1958->assertEntityIsNotRegistered:1972->HiveITBase.waitFor:270
Assertions failed. Failing after waiting for timeout 80000 msecs
  HiveHookIT.testAlterViewAsSelect:396->HiveITBase.assertTableIsRegistered:194->HiveITBase.assertTableIsRegistered:200->HiveITBase.assertEntityIsRegistered:206->HiveITBase.waitFor:270
Assertions failed. Failing after waiting for timeout 80000 msecs
  HiveHookIT.testAlterViewProperties:1783->testAlterProperties:1749->verifyEntityProperties:1789->assertTableIsRegistered:1968->HiveITBase.assertTableIsRegistered:200->HiveITBase.assertEntityIsRegistered:206->HiveITBase.waitFor:270
Assertions failed. Failing after waiting for timeout 80000 msecs
  HiveHookIT.testAlterViewRename:1384->HiveITBase.assertTableIsRegistered:194->HiveITBase.assertTableIsRegistered:200->HiveITBase.assertEntityIsRegistered:206->HiveITBase.waitFor:270
Assertions failed. Failing after waiting for timeout 80000 msecs
  HiveHookIT.testCTAS:314->assertProcessIsRegistered:1859->HiveITBase.assertEntityIsRegistered:206->HiveITBase.waitFor:270
Assertions failed. Failing after waiting for timeout 80000 msecs
  HiveHookIT.testCreateDatabase:82->HiveITBase.assertDatabaseIsRegistered:307->HiveITBase.assertDatabaseIsRegistered:313->HiveITBase.assertEntityIsRegistered:206->HiveITBase.waitFor:270
Assertions failed. Failing after waiting for timeout 80000 msecs
  HiveHookIT.testCreateTable:111->HiveITBase.assertTableIsRegistered:194->HiveITBase.assertTableIsRegistered:200->HiveITBase.assertEntityIsRegistered:206->HiveITBase.waitFor:270
Assertions failed. Failing after waiting for timeout 80000 msecs
  HiveHookIT.testCreateView:383->assertProcessIsRegistered:1859->HiveITBase.assertEntityIsRegistered:206->HiveITBase.waitFor:270
Assertions failed. Failing after waiting for timeout 80000 msecs
  HiveHookIT.testDropAndRecreateCTASOutput:347->HiveITBase.assertTableIsRegistered:194->HiveITBase.assertTableIsRegistered:200->HiveITBase.assertEntityIsRegistered:206->HiveITBase.waitFor:270
Assertions failed. Failing after waiting for timeout 80000 msecs
  HiveHookIT.testDropDatabaseWithCascade:1575->assertColumnIsNotRegistered:300->assertEntityIsNotRegistered:1972->HiveITBase.waitFor:270
Assertions failed. Failing after waiting for timeout 80000 msecs
  HiveHookIT.testDropDatabaseWithoutCascade:1602->assertTableIsNotRegistered:1958->assertEntityIsNotRegistered:1972->HiveITBase.waitFor:270
Assertions failed. Failing after waiting for timeout 80000 msecs
  HiveHookIT.testDropNonExistingDB:1629->assertDBIsNotRegistered:1964->assertEntityIsNotRegistered:1972->HiveITBase.waitFor:270
Assertions failed. Failing after waiting for timeout 80000 msecs
  HiveHookIT.testDropNonExistingTable:1644->assertTableIsNotRegistered:1958->assertEntityIsNotRegistered:1972->HiveITBase.waitFor:270
Assertions failed. Failing after waiting for timeout 80000 msecs
  HiveHookIT.testDropTable:1525->HiveITBase.assertTableIsRegistered:194->HiveITBase.assertTableIsRegistered:200->HiveITBase.assertEntityIsRegistered:206->HiveITBase.waitFor:270
Assertions failed. Failing after waiting for timeout 80000 msecs
  HiveHookIT.testDropView:1663->HiveITBase.assertTableIsRegistered:194->HiveITBase.assertTableIsRegistered:200->HiveITBase.assertEntityIsRegistered:206->HiveITBase.waitFor:270
Assertions failed. Failing after waiting for timeout 80000 msecs
  HiveHookIT.testEmptyStringAsValue:336->HiveITBase.assertTableIsRegistered:194->HiveITBase.assertTableIsRegistered:200->HiveITBase.assertEntityIsRegistered:206->HiveITBase.waitFor:270
Assertions failed. Failing after waiting for timeout 80000 msecs
  HiveHookIT.testExportImportPartitionedTable:820->HiveITBase.assertTableIsRegistered:194->HiveITBase.assertTableIsRegistered:200->HiveITBase.assertEntityIsRegistered:206->HiveITBase.waitFor:270
Assertions failed. Failing after waiting for timeout 80000 msecs
  HiveHookIT.testExportImportUnPartitionedTable:767->HiveITBase.assertTableIsRegistered:194->HiveITBase.assertTableIsRegistered:200->HiveITBase.assertEntityIsRegistered:206->HiveITBase.waitFor:270
Assertions failed. Failing after waiting for timeout 80000 msecs
  HiveHookIT.testIgnoreSelect:903->assertProcessIsNotRegistered:1939->assertEntityIsNotRegistered:1972->HiveITBase.waitFor:270
Assertions failed. Failing after waiting for timeout 80000 msecs
  HiveHookIT.testInsertIntoDFSDirPartitioned:676->validateProcess:519->assertProcessIsRegistered:1889->HiveITBase.assertEntityIsRegistered:206->HiveITBase.waitFor:270
Assertions failed. Failing after waiting for timeout 80000 msecs
  HiveHookIT.testInsertIntoLocalDir:599->validateProcess:529->validateProcess:519->assertProcessIsRegistered:1889->HiveITBase.assertEntityIsRegistered:206->HiveITBase.waitFor:270
Assertions failed. Failing after waiting for timeout 80000 msecs
  HiveHookIT.testInsertIntoPartition:755->validateProcess:519->assertProcessIsRegistered:1889->HiveITBase.assertEntityIsRegistered:206->HiveITBase.waitFor:270
Assertions failed. Failing after waiting for timeout 80000 msecs
  HiveHookIT.testInsertIntoTable:538->HiveITBase.assertTableIsRegistered:194->HiveITBase.assertTableIsRegistered:200->HiveITBase.assertEntityIsRegistered:206->HiveITBase.waitFor:270
Assertions failed. Failing after waiting for timeout 80000 msecs
  HiveHookIT.testLineage:1997->HiveITBase.assertTableIsRegistered:194->HiveITBase.assertTableIsRegistered:200->HiveITBase.assertEntityIsRegistered:206->HiveITBase.waitFor:270
Assertions failed. Failing after waiting for timeout 80000 msecs
  HiveHookIT.testLoadDFSPathPartitioned:476->HiveITBase.assertTableIsRegistered:194->HiveITBase.assertTableIsRegistered:200->HiveITBase.assertEntityIsRegistered:206->HiveITBase.waitFor:270
Assertions failed. Failing after waiting for timeout 80000 msecs
  HiveHookIT.testLoadLocalPath:458->assertProcessIsRegistered:1859->HiveITBase.assertEntityIsRegistered:206->HiveITBase.waitFor:270
Assertions failed. Failing after waiting for timeout 80000 msecs
  HiveHookIT.testLoadLocalPathIntoPartition:469->assertProcessIsRegistered:1859->HiveITBase.assertEntityIsRegistered:206->HiveITBase.waitFor:270
Assertions failed. Failing after waiting for timeout 80000 msecs
  HiveHookIT.testTraitsPreservedOnColumnRename:1356->assertColumnIsRegistered:282->assertColumnIsRegistered:288->HiveITBase.assertEntityIsRegistered:206->HiveITBase.waitFor:270
Assertions failed. Failing after waiting for timeout 80000 msecs
  HiveHookIT.testTruncateTable:1287->HiveITBase.assertTableIsRegistered:194->HiveITBase.assertTableIsRegistered:200->HiveITBase.assertEntityIsRegistered:206->HiveITBase.waitFor:270
Assertions failed. Failing after waiting for timeout 80000 msecs
  HiveHookIT.testUpdateProcess:618->validateProcess:529->validateProcess:519->assertProcessIsRegistered:1889->HiveITBase.assertEntityIsRegistered:206->HiveITBase.waitFor:270
Assertions failed. Failing after waiting for timeout 80000 msecs

Tests run: 45, Failures: 44, Errors: 0, Skipped: 0

[INFO] 
[INFO] --- jetty-maven-plugin:9.3.14.v20161028:stop (stop-jetty) @ hive-bridge ---
[INFO] Waiting 10 seconds for jetty to stop
[INFO] Stopped ServerConnector@6077971b{HTTP/1.1,[http/1.1]}{0.0.0.0:31000}
[INFO] Closing Spring root WebApplicationContext
[INFO] Shutting down log4j
[INFO] Stopped o.e.j.m.p.JettyWebAppContext@16de0372{/,file://<https://builds.apache.org/job/Atlas-1.0-AllTests/ws/webapp/target/atlas-webapp-1.1.0-SNAPSHOT/,UNAVAILABLE}{/home/jenkins/jenkins-slave/workspace/Atlas-1.0-AllTests/webapp/target/atlas-webapp-1.1.0-SNAPSHOT.war}>
[INFO] Server reports itself as stopped
[INFO] 
[INFO] --- maven-source-plugin:2.4:jar-no-fork (attach-sources) @ hive-bridge ---
[INFO] Building jar: <https://builds.apache.org/job/Atlas-1.0-AllTests/ws/addons/hive-bridge/target/hive-bridge-1.1.0-SNAPSHOT-sources.jar>
[INFO] 
[INFO] --- maven-source-plugin:2.4:test-jar-no-fork (attach-sources) @ hive-bridge ---
[INFO] Building jar: <https://builds.apache.org/job/Atlas-1.0-AllTests/ws/addons/hive-bridge/target/hive-bridge-1.1.0-SNAPSHOT-test-sources.jar>
[INFO] 
[INFO] --- maven-failsafe-plugin:2.18.1:verify (verify) @ hive-bridge ---
[INFO] Failsafe report directory: <https://builds.apache.org/job/Atlas-1.0-AllTests/ws/addons/hive-bridge/target/failsafe-reports>
[INFO] ------------------------------------------------------------------------
[INFO] Reactor Summary:
[INFO] 
[INFO] Apache Atlas Server Build Tools .................... SUCCESS [  0.887 s]
[INFO] apache-atlas ....................................... SUCCESS [  5.736 s]
[INFO] Apache Atlas Test Utility Tools .................... SUCCESS [ 12.378 s]
[INFO] Apache Atlas Integration ........................... SUCCESS [01:09 min]
[INFO] Apache Atlas Common ................................ SUCCESS [ 13.554 s]
[INFO] Apache Atlas Client ................................ SUCCESS [  0.780 s]
[INFO] atlas-client-common ................................ SUCCESS [  8.654 s]
[INFO] atlas-client-v1 .................................... SUCCESS [ 10.093 s]
[INFO] Apache Atlas Server API ............................ SUCCESS [  6.346 s]
[INFO] Apache Atlas Notification .......................... SUCCESS [ 28.016 s]
[INFO] atlas-client-v2 .................................... SUCCESS [  6.756 s]
[INFO] Apache Atlas Graph Database Projects ............... SUCCESS [  0.532 s]
[INFO] Apache Atlas Graph Database API .................... SUCCESS [  5.484 s]
[INFO] Graph Database Common Code ......................... SUCCESS [  5.771 s]
[INFO] Apache Atlas JanusGraph DB Impl .................... SUCCESS [02:37 min]
[INFO] Apache Atlas Graph Database Implementation Dependencies SUCCESS [  2.600 s]
[INFO] Shaded version of Apache hbase client .............. SUCCESS [  8.520 s]
[INFO] Shaded version of Apache hbase server .............. SUCCESS [ 21.916 s]
[INFO] Apache Atlas Authorization ......................... SUCCESS [  8.665 s]
[INFO] Apache Atlas Repository ............................ SUCCESS [04:04 min]
[INFO] Apache Atlas UI .................................... SUCCESS [01:56 min]
[INFO] Apache Atlas Web Application ....................... SUCCESS [09:55 min]
[INFO] Apache Atlas Documentation ......................... SUCCESS [  4.837 s]
[INFO] Apache Atlas FileSystem Model ...................... SUCCESS [  3.649 s]
[INFO] Apache Atlas Plugin Classloader .................... SUCCESS [  7.555 s]
[INFO] Apache Atlas Hive Bridge Shim ...................... SUCCESS [  8.088 s]
[INFO] Apache Atlas Hive Bridge ........................... FAILURE [  05:48 h]
[INFO] Apache Atlas Falcon Bridge Shim .................... SKIPPED
[INFO] Apache Atlas Falcon Bridge ......................... SKIPPED
[INFO] Apache Atlas Sqoop Bridge Shim ..................... SKIPPED
[INFO] Apache Atlas Sqoop Bridge .......................... SKIPPED
[INFO] Apache Atlas Storm Bridge Shim ..................... SKIPPED
[INFO] Apache Atlas Storm Bridge .......................... SKIPPED
[INFO] Apache Atlas Hbase Bridge Shim ..................... SKIPPED
[INFO] Apache Atlas Hbase Bridge .......................... SKIPPED
[INFO] Apache Atlas Kafka Bridge .......................... SKIPPED
[INFO] Apache Atlas Distribution .......................... SKIPPED
[INFO] ------------------------------------------------------------------------
[INFO] BUILD FAILURE
[INFO] ------------------------------------------------------------------------
[INFO] Total time: 06:11 h
[INFO] Finished at: 2018-06-27T12:51:21Z
[INFO] Final Memory: 429M/2377M
[INFO] ------------------------------------------------------------------------
[ERROR] Failed to execute goal org.apache.maven.plugins:maven-failsafe-plugin:2.18.1:verify
(verify) on project hive-bridge: There are test failures.
[ERROR] 
[ERROR] Please refer to <https://builds.apache.org/job/Atlas-1.0-AllTests/ws/addons/hive-bridge/target/failsafe-reports>
for the individual test results.
[ERROR] -> [Help 1]
[ERROR] 
[ERROR] To see the full stack trace of the errors, re-run Maven with the -e switch.
[ERROR] Re-run Maven using the -X switch to enable full debug logging.
[ERROR] 
[ERROR] For more information about the errors and possible solutions, please read the following
articles:
[ERROR] [Help 1] http://cwiki.apache.org/confluence/display/MAVEN/MojoFailureException
[ERROR] 
[ERROR] After correcting the problems, you can resume the build with the command
[ERROR]   mvn <goals> -rf :hive-bridge
log4j:WARN No appenders could be found for logger (org.apache.zookeeper.server.NIOServerCnxnFactory).
log4j:WARN Please initialize the log4j system properly.
log4j:WARN See http://logging.apache.org/log4j/1.2/faq.html#noconfig for more info.
Build step 'Execute shell' marked build as failure
[CHECKSTYLE] Collecting checkstyle analysis files...
[CHECKSTYLE] Searching for all files in <https://builds.apache.org/job/Atlas-1.0-AllTests/ws/>
that match the pattern **/target/checkstyle-result.xml
[CHECKSTYLE] Parsing 25 files in <https://builds.apache.org/job/Atlas-1.0-AllTests/ws/>
[CHECKSTYLE] Successfully parsed file <https://builds.apache.org/job/Atlas-1.0-AllTests/ws/addons/hdfs-model/target/checkstyle-result.xml>
with 0 unique warnings and 0 duplicates.
[CHECKSTYLE] Successfully parsed file <https://builds.apache.org/job/Atlas-1.0-AllTests/ws/addons/hive-bridge-shim/target/checkstyle-result.xml>
with 15 unique warnings and 0 duplicates.
[CHECKSTYLE] Successfully parsed file <https://builds.apache.org/job/Atlas-1.0-AllTests/ws/authorization/target/checkstyle-result.xml>
with 712 unique warnings and 0 duplicates.
[CHECKSTYLE] Successfully parsed file <https://builds.apache.org/job/Atlas-1.0-AllTests/ws/client/client-v1/target/checkstyle-result.xml>
with 1601 unique warnings and 0 duplicates.
[CHECKSTYLE] Successfully parsed file <https://builds.apache.org/job/Atlas-1.0-AllTests/ws/client/client-v2/target/checkstyle-result.xml>
with 1960 unique warnings and 0 duplicates.
[CHECKSTYLE] Successfully parsed file <https://builds.apache.org/job/Atlas-1.0-AllTests/ws/client/common/target/checkstyle-result.xml>
with 2451 unique warnings and 0 duplicates.
[CHECKSTYLE] Successfully parsed file <https://builds.apache.org/job/Atlas-1.0-AllTests/ws/client/target/checkstyle-result.xml>
with 2451 unique warnings and 0 duplicates.
[CHECKSTYLE] Successfully parsed file <https://builds.apache.org/job/Atlas-1.0-AllTests/ws/common/target/checkstyle-result.xml>
with 3510 unique warnings and 0 duplicates.
[CHECKSTYLE] Successfully parsed file <https://builds.apache.org/job/Atlas-1.0-AllTests/ws/dashboardv2/target/checkstyle-result.xml>
with 3510 unique warnings and 0 duplicates.
[CHECKSTYLE] Successfully parsed file <https://builds.apache.org/job/Atlas-1.0-AllTests/ws/docs/target/checkstyle-result.xml>
with 3510 unique warnings and 0 duplicates.
[CHECKSTYLE] Successfully parsed file <https://builds.apache.org/job/Atlas-1.0-AllTests/ws/graphdb/api/target/checkstyle-result.xml>
with 3812 unique warnings and 0 duplicates.
[CHECKSTYLE] Successfully parsed file <https://builds.apache.org/job/Atlas-1.0-AllTests/ws/graphdb/common/target/checkstyle-result.xml>
with 4038 unique warnings and 0 duplicates.
[CHECKSTYLE] Successfully parsed file <https://builds.apache.org/job/Atlas-1.0-AllTests/ws/graphdb/graphdb-impls/target/checkstyle-result.xml>
with 4038 unique warnings and 0 duplicates.
[CHECKSTYLE] Successfully parsed file <https://builds.apache.org/job/Atlas-1.0-AllTests/ws/graphdb/janus/target/checkstyle-result.xml>
with 6360 unique warnings and 0 duplicates.
[CHECKSTYLE] Successfully parsed file <https://builds.apache.org/job/Atlas-1.0-AllTests/ws/graphdb/target/checkstyle-result.xml>
with 6360 unique warnings and 0 duplicates.
[CHECKSTYLE] Successfully parsed file <https://builds.apache.org/job/Atlas-1.0-AllTests/ws/intg/target/checkstyle-result.xml>
with 18363 unique warnings and 0 duplicates.
[CHECKSTYLE] Successfully parsed file <https://builds.apache.org/job/Atlas-1.0-AllTests/ws/notification/target/checkstyle-result.xml>
with 19600 unique warnings and 0 duplicates.
[CHECKSTYLE] Successfully parsed file <https://builds.apache.org/job/Atlas-1.0-AllTests/ws/plugin-classloader/target/checkstyle-result.xml>
with 19713 unique warnings and 0 duplicates.
[CHECKSTYLE] Successfully parsed file <https://builds.apache.org/job/Atlas-1.0-AllTests/ws/repository/target/checkstyle-result.xml>
with 38640 unique warnings and 0 duplicates.
[CHECKSTYLE] Successfully parsed file <https://builds.apache.org/job/Atlas-1.0-AllTests/ws/server-api/target/checkstyle-result.xml>
with 38808 unique warnings and 0 duplicates.
[CHECKSTYLE] Successfully parsed file <https://builds.apache.org/job/Atlas-1.0-AllTests/ws/shaded/hbase-client-shaded/target/checkstyle-result.xml>
with 38808 unique warnings and 0 duplicates.
[CHECKSTYLE] Successfully parsed file <https://builds.apache.org/job/Atlas-1.0-AllTests/ws/shaded/hbase-server-shaded/target/checkstyle-result.xml>
with 38808 unique warnings and 0 duplicates.
[CHECKSTYLE] Successfully parsed file <https://builds.apache.org/job/Atlas-1.0-AllTests/ws/target/checkstyle-result.xml>
with 38808 unique warnings and 0 duplicates.
[CHECKSTYLE] Successfully parsed file <https://builds.apache.org/job/Atlas-1.0-AllTests/ws/test-tools/target/checkstyle-result.xml>
with 38846 unique warnings and 0 duplicates.
[CHECKSTYLE] Successfully parsed file <https://builds.apache.org/job/Atlas-1.0-AllTests/ws/webapp/target/checkstyle-result.xml>
with 47192 unique warnings and 0 duplicates.
<Git Blamer> Using GitBlamer to create author and commit information for all warnings.
<Git Blamer> GIT_COMMIT=51dcce487a393c206e63ed4bf336cd9c09e41303, workspace=<https://builds.apache.org/job/Atlas-1.0-AllTests/ws/>
 > git rev-parse 51dcce487a393c206e63ed4bf336cd9c09e41303^{commit} # timeout=10
[CHECKSTYLE] Computing warning deltas based on reference build #368
[FINDBUGS] Collecting findbugs analysis files...
[FINDBUGS] Searching for all files in <https://builds.apache.org/job/Atlas-1.0-AllTests/ws/>
that match the pattern **/target/findbugs.xml
[FINDBUGS] Parsing 16 files in <https://builds.apache.org/job/Atlas-1.0-AllTests/ws/>
[FINDBUGS] Successfully parsed file <https://builds.apache.org/job/Atlas-1.0-AllTests/ws/addons/hive-bridge-shim/target/findbugs.xml>
with 0 unique warnings and 0 duplicates.
[FINDBUGS] Successfully parsed file <https://builds.apache.org/job/Atlas-1.0-AllTests/ws/authorization/target/findbugs.xml>
with 0 unique warnings and 0 duplicates.
[FINDBUGS] Successfully parsed file <https://builds.apache.org/job/Atlas-1.0-AllTests/ws/client/client-v1/target/findbugs.xml>
with 0 unique warnings and 0 duplicates.
[FINDBUGS] Successfully parsed file <https://builds.apache.org/job/Atlas-1.0-AllTests/ws/client/client-v2/target/findbugs.xml>
with 0 unique warnings and 0 duplicates.
[FINDBUGS] Successfully parsed file <https://builds.apache.org/job/Atlas-1.0-AllTests/ws/client/common/target/findbugs.xml>
with 0 unique warnings and 0 duplicates.
[FINDBUGS] Successfully parsed file <https://builds.apache.org/job/Atlas-1.0-AllTests/ws/common/target/findbugs.xml>
with 0 unique warnings and 0 duplicates.
[FINDBUGS] Successfully parsed file <https://builds.apache.org/job/Atlas-1.0-AllTests/ws/graphdb/api/target/findbugs.xml>
with 0 unique warnings and 0 duplicates.
[FINDBUGS] Successfully parsed file <https://builds.apache.org/job/Atlas-1.0-AllTests/ws/graphdb/common/target/findbugs.xml>
with 0 unique warnings and 0 duplicates.
[FINDBUGS] Successfully parsed file <https://builds.apache.org/job/Atlas-1.0-AllTests/ws/graphdb/janus/target/findbugs.xml>
with 0 unique warnings and 0 duplicates.
[FINDBUGS] Successfully parsed file <https://builds.apache.org/job/Atlas-1.0-AllTests/ws/intg/target/findbugs.xml>
with 0 unique warnings and 0 duplicates.
[FINDBUGS] Successfully parsed file <https://builds.apache.org/job/Atlas-1.0-AllTests/ws/notification/target/findbugs.xml>
with 0 unique warnings and 0 duplicates.
[FINDBUGS] Successfully parsed file <https://builds.apache.org/job/Atlas-1.0-AllTests/ws/plugin-classloader/target/findbugs.xml>
with 0 unique warnings and 0 duplicates.
[FINDBUGS] Successfully parsed file <https://builds.apache.org/job/Atlas-1.0-AllTests/ws/repository/target/findbugs.xml>
with 0 unique warnings and 0 duplicates.
[FINDBUGS] Successfully parsed file <https://builds.apache.org/job/Atlas-1.0-AllTests/ws/server-api/target/findbugs.xml>
with 0 unique warnings and 0 duplicates.
[FINDBUGS] Successfully parsed file <https://builds.apache.org/job/Atlas-1.0-AllTests/ws/test-tools/target/findbugs.xml>
with 0 unique warnings and 0 duplicates.
[FINDBUGS] Successfully parsed file <https://builds.apache.org/job/Atlas-1.0-AllTests/ws/webapp/target/findbugs.xml>
with 0 unique warnings and 0 duplicates.
<Git Blamer> Using GitBlamer to create author and commit information for all warnings.
<Git Blamer> GIT_COMMIT=51dcce487a393c206e63ed4bf336cd9c09e41303, workspace=<https://builds.apache.org/job/Atlas-1.0-AllTests/ws/>
[FINDBUGS] Computing warning deltas based on reference build #368
Archiving artifacts
[Fast Archiver] Compressed 409.83 MB of artifacts by 34.5% relative to #368
TestNG Reports Processing: START
Looking for TestNG results report in workspace using pattern: **/target/surefire-reports/testng-results.xml,**/target/failsafe-reports/testng-results.xml
Saving reports...
Processing '/x1/jenkins/jenkins-home/jobs/Atlas-1.0-AllTests/builds/369/testng/testng-results-1.xml'
Processing '/x1/jenkins/jenkins-home/jobs/Atlas-1.0-AllTests/builds/369/testng/testng-results-10.xml'
Processing '/x1/jenkins/jenkins-home/jobs/Atlas-1.0-AllTests/builds/369/testng/testng-results-11.xml'
Processing '/x1/jenkins/jenkins-home/jobs/Atlas-1.0-AllTests/builds/369/testng/testng-results-2.xml'
Processing '/x1/jenkins/jenkins-home/jobs/Atlas-1.0-AllTests/builds/369/testng/testng-results-3.xml'
Processing '/x1/jenkins/jenkins-home/jobs/Atlas-1.0-AllTests/builds/369/testng/testng-results-4.xml'
Processing '/x1/jenkins/jenkins-home/jobs/Atlas-1.0-AllTests/builds/369/testng/testng-results-5.xml'
Processing '/x1/jenkins/jenkins-home/jobs/Atlas-1.0-AllTests/builds/369/testng/testng-results-6.xml'
Processing '/x1/jenkins/jenkins-home/jobs/Atlas-1.0-AllTests/builds/369/testng/testng-results-7.xml'
Processing '/x1/jenkins/jenkins-home/jobs/Atlas-1.0-AllTests/builds/369/testng/testng-results-8.xml'
Processing '/x1/jenkins/jenkins-home/jobs/Atlas-1.0-AllTests/builds/369/testng/testng-results-9.xml'
Processing '/x1/jenkins/jenkins-home/jobs/Atlas-1.0-AllTests/builds/369/testng/testng-results.xml'
9.734513% of tests failed, which exceeded threshold of 0%. Marking build as UNSTABLE
TestNG Reports Processing: FINISH

Mime
View raw message