atlas-dev mailing list archives

Site index · List index
Message view « Date » · « Thread »
Top « Date » · « Thread »
From Apache Jenkins Server <jenk...@builds.apache.org>
Subject Build failed in Jenkins: Atlas-1.0-IntegrationTests #304
Date Tue, 19 Jun 2018 23:53:35 GMT
See <https://builds.apache.org/job/Atlas-1.0-IntegrationTests/304/display/redirect>

------------------------------------------
[...truncated 670.98 KB...]
    at org.eclipse.jetty.maven.plugin.JettyDeployWar.execute (JettyDeployWar.java:65)
    at org.apache.maven.plugin.DefaultBuildPluginManager.executeMojo (DefaultBuildPluginManager.java:134)
    at org.apache.maven.lifecycle.internal.MojoExecutor.execute (MojoExecutor.java:208)
    at org.apache.maven.lifecycle.internal.MojoExecutor.execute (MojoExecutor.java:154)
    at org.apache.maven.lifecycle.internal.MojoExecutor.execute (MojoExecutor.java:146)
    at org.apache.maven.lifecycle.internal.LifecycleModuleBuilder.buildProject (LifecycleModuleBuilder.java:117)
    at org.apache.maven.lifecycle.internal.LifecycleModuleBuilder.buildProject (LifecycleModuleBuilder.java:81)
    at org.apache.maven.lifecycle.internal.builder.singlethreaded.SingleThreadedBuilder.build
(SingleThreadedBuilder.java:51)
    at org.apache.maven.lifecycle.internal.LifecycleStarter.execute (LifecycleStarter.java:128)
    at org.apache.maven.DefaultMaven.doExecute (DefaultMaven.java:309)
    at org.apache.maven.DefaultMaven.doExecute (DefaultMaven.java:194)
    at org.apache.maven.DefaultMaven.execute (DefaultMaven.java:107)
    at org.apache.maven.cli.MavenCli.execute (MavenCli.java:955)
    at org.apache.maven.cli.MavenCli.doMain (MavenCli.java:290)
    at org.apache.maven.cli.MavenCli.main (MavenCli.java:194)
    at sun.reflect.NativeMethodAccessorImpl.invoke0 (Native Method)
    at sun.reflect.NativeMethodAccessorImpl.invoke (NativeMethodAccessorImpl.java:62)
    at sun.reflect.DelegatingMethodAccessorImpl.invoke (DelegatingMethodAccessorImpl.java:43)
    at java.lang.reflect.Method.invoke (Method.java:498)
    at org.codehaus.plexus.classworlds.launcher.Launcher.launchEnhanced (Launcher.java:289)
    at org.codehaus.plexus.classworlds.launcher.Launcher.launch (Launcher.java:229)
    at org.codehaus.plexus.classworlds.launcher.Launcher.mainWithExitCode (Launcher.java:415)
    at org.codehaus.plexus.classworlds.launcher.Launcher.main (Launcher.java:356)
[INFO] Started ServerConnector@59129f17{HTTP/1.1,[http/1.1]}{0.0.0.0:31000}
[INFO] Started @1498754ms
[INFO] Started Jetty Server
[INFO] 
[INFO] --- maven-failsafe-plugin:2.18.1:integration-test (integration-test) @ sqoop-bridge
---
[WARNING] useSystemClassloader setting has no effect when not forking
[INFO] Failsafe report directory: <https://builds.apache.org/job/Atlas-1.0-IntegrationTests/ws/addons/sqoop-bridge/target/failsafe-reports>
Running org.apache.atlas.sqoop.hook.SqoopHookIT
127.0.0.1 - - [19/Jun/2018:23:31:56 +0000] "GET //localhost:31000/api/atlas/entities?type=sqoop_dbdatastore&property=qualifiedName&value=mysql+--url+jdbc:mysql:///localhost/db+--table+myTable
HTTP/1.1" 503 345 "-" "Java/1.8.0_172"
127.0.0.1 - - [19/Jun/2018:23:32:01 +0000] "GET //localhost:31000/api/atlas/entities?type=sqoop_dbdatastore&property=qualifiedName&value=mysql+--url+jdbc:mysql:///localhost/db+--table+myTable
HTTP/1.1" 503 345 "-" "Java/1.8.0_172"
127.0.0.1 - - [19/Jun/2018:23:32:06 +0000] "GET //localhost:31000/api/atlas/entities?type=sqoop_dbdatastore&property=qualifiedName&value=mysql+--url+jdbc:mysql:///localhost/db+--table+myTable
HTTP/1.1" 503 345 "-" "Java/1.8.0_172"
127.0.0.1 - - [19/Jun/2018:23:32:11 +0000] "GET //localhost:31000/api/atlas/entities?type=sqoop_dbdatastore&property=qualifiedName&value=mysql+--url+jdbc:mysql:///localhost/db+--table+myTable
HTTP/1.1" 503 345 "-" "Java/1.8.0_172"
127.0.0.1 - - [19/Jun/2018:23:32:21 +0000] "GET //localhost:31000/api/atlas/entities?type=sqoop_dbdatastore&property=qualifiedName&value=mysql+--url+jdbc:mysql:///localhost/db+--table+myTable
HTTP/1.1" 503 345 "-" "Java/1.8.0_172"
127.0.0.1 - - [19/Jun/2018:23:32:26 +0000] "GET //localhost:31000/api/atlas/entities?type=sqoop_dbdatastore&property=qualifiedName&value=mysql+--url+jdbc:mysql:///localhost/db+--table+myTable
HTTP/1.1" 503 345 "-" "Java/1.8.0_172"
127.0.0.1 - - [19/Jun/2018:23:32:31 +0000] "GET //localhost:31000/api/atlas/entities?type=sqoop_dbdatastore&property=qualifiedName&value=mysql+--url+jdbc:mysql:///localhost/db+--table+myTable
HTTP/1.1" 503 345 "-" "Java/1.8.0_172"
127.0.0.1 - - [19/Jun/2018:23:32:36 +0000] "GET //localhost:31000/api/atlas/entities?type=sqoop_dbdatastore&property=qualifiedName&value=mysql+--url+jdbc:mysql:///localhost/db+--table+myTable
HTTP/1.1" 503 345 "-" "Java/1.8.0_172"
127.0.0.1 - - [19/Jun/2018:23:32:46 +0000] "GET //localhost:31000/api/atlas/entities?type=sqoop_dbdatastore&property=qualifiedName&value=mysql+--url+jdbc:mysql:///localhost/db+--table+myTable
HTTP/1.1" 503 345 "-" "Java/1.8.0_172"
127.0.0.1 - - [19/Jun/2018:23:32:51 +0000] "GET //localhost:31000/api/atlas/entities?type=sqoop_dbdatastore&property=qualifiedName&value=mysql+--url+jdbc:mysql:///localhost/db+--table+myTable
HTTP/1.1" 503 345 "-" "Java/1.8.0_172"
127.0.0.1 - - [19/Jun/2018:23:32:56 +0000] "GET //localhost:31000/api/atlas/entities?type=sqoop_dbdatastore&property=qualifiedName&value=mysql+--url+jdbc:mysql:///localhost/db+--table+myTable
HTTP/1.1" 503 345 "-" "Java/1.8.0_172"
127.0.0.1 - - [19/Jun/2018:23:33:01 +0000] "GET //localhost:31000/api/atlas/entities?type=sqoop_dbdatastore&property=qualifiedName&value=mysql+--url+jdbc:mysql:///localhost/db+--table+myTable
HTTP/1.1" 503 345 "-" "Java/1.8.0_172"
127.0.0.1 - - [19/Jun/2018:23:33:11 +0000] "GET //localhost:31000/api/atlas/entities?type=sqoop_dbdatastore&property=qualifiedName&value=mysql+--url+jdbc:mysql:///localhost/db+--table+myTable
HTTP/1.1" 503 345 "-" "Java/1.8.0_172"
127.0.0.1 - - [19/Jun/2018:23:33:16 +0000] "GET //localhost:31000/api/atlas/entities?type=sqoop_dbdatastore&property=qualifiedName&value=mysql+--url+jdbc:mysql:///localhost/db+--table+myTable
HTTP/1.1" 503 345 "-" "Java/1.8.0_172"
127.0.0.1 - - [19/Jun/2018:23:33:21 +0000] "GET //localhost:31000/api/atlas/entities?type=sqoop_dbdatastore&property=qualifiedName&value=mysql+--url+jdbc:mysql:///localhost/db+--table+myTable
HTTP/1.1" 503 345 "-" "Java/1.8.0_172"
127.0.0.1 - - [19/Jun/2018:23:33:26 +0000] "GET //localhost:31000/api/atlas/entities?type=sqoop_dbdatastore&property=qualifiedName&value=mysql+--url+jdbc:mysql:///localhost/db+--table+myTable
HTTP/1.1" 503 345 "-" "Java/1.8.0_172"
127.0.0.1 - - [19/Jun/2018:23:36:34 +0000] "GET //localhost:31000/api/atlas/entities?type=sqoop_dbdatastore&property=qualifiedName&value=mysql+--url+jdbc:mysql:///localhost/db+--table+myTable
HTTP/1.1" 503 345 "-" "Java/1.8.0_172"
127.0.0.1 - - [19/Jun/2018:23:36:39 +0000] "GET //localhost:31000/api/atlas/entities?type=sqoop_dbdatastore&property=qualifiedName&value=mysql+--url+jdbc:mysql:///localhost/db+--table+myTable
HTTP/1.1" 503 345 "-" "Java/1.8.0_172"
127.0.0.1 - - [19/Jun/2018:23:36:44 +0000] "GET //localhost:31000/api/atlas/entities?type=sqoop_dbdatastore&property=qualifiedName&value=mysql+--url+jdbc:mysql:///localhost/db+--table+myTable
HTTP/1.1" 503 345 "-" "Java/1.8.0_172"
127.0.0.1 - - [19/Jun/2018:23:36:49 +0000] "GET //localhost:31000/api/atlas/entities?type=sqoop_dbdatastore&property=qualifiedName&value=mysql+--url+jdbc:mysql:///localhost/db+--table+myTable
HTTP/1.1" 503 345 "-" "Java/1.8.0_172"
127.0.0.1 - - [19/Jun/2018:23:36:59 +0000] "GET //localhost:31000/api/atlas/entities?type=sqoop_dbdatastore&property=qualifiedName&value=mysql+--url+jdbc:mysql:///localhost/db+--table+myTable
HTTP/1.1" 503 345 "-" "Java/1.8.0_172"
127.0.0.1 - - [19/Jun/2018:23:37:04 +0000] "GET //localhost:31000/api/atlas/entities?type=sqoop_dbdatastore&property=qualifiedName&value=mysql+--url+jdbc:mysql:///localhost/db+--table+myTable
HTTP/1.1" 503 345 "-" "Java/1.8.0_172"
127.0.0.1 - - [19/Jun/2018:23:37:09 +0000] "GET //localhost:31000/api/atlas/entities?type=sqoop_dbdatastore&property=qualifiedName&value=mysql+--url+jdbc:mysql:///localhost/db+--table+myTable
HTTP/1.1" 503 345 "-" "Java/1.8.0_172"
127.0.0.1 - - [19/Jun/2018:23:37:14 +0000] "GET //localhost:31000/api/atlas/entities?type=sqoop_dbdatastore&property=qualifiedName&value=mysql+--url+jdbc:mysql:///localhost/db+--table+myTable
HTTP/1.1" 503 345 "-" "Java/1.8.0_172"
127.0.0.1 - - [19/Jun/2018:23:37:24 +0000] "GET //localhost:31000/api/atlas/entities?type=sqoop_dbdatastore&property=qualifiedName&value=mysql+--url+jdbc:mysql:///localhost/db+--table+myTable
HTTP/1.1" 503 345 "-" "Java/1.8.0_172"
127.0.0.1 - - [19/Jun/2018:23:37:29 +0000] "GET //localhost:31000/api/atlas/entities?type=sqoop_dbdatastore&property=qualifiedName&value=mysql+--url+jdbc:mysql:///localhost/db+--table+myTable
HTTP/1.1" 503 345 "-" "Java/1.8.0_172"
127.0.0.1 - - [19/Jun/2018:23:37:34 +0000] "GET //localhost:31000/api/atlas/entities?type=sqoop_dbdatastore&property=qualifiedName&value=mysql+--url+jdbc:mysql:///localhost/db+--table+myTable
HTTP/1.1" 503 345 "-" "Java/1.8.0_172"
127.0.0.1 - - [19/Jun/2018:23:37:39 +0000] "GET //localhost:31000/api/atlas/entities?type=sqoop_dbdatastore&property=qualifiedName&value=mysql+--url+jdbc:mysql:///localhost/db+--table+myTable
HTTP/1.1" 503 345 "-" "Java/1.8.0_172"
127.0.0.1 - - [19/Jun/2018:23:37:49 +0000] "GET //localhost:31000/api/atlas/entities?type=sqoop_dbdatastore&property=qualifiedName&value=mysql+--url+jdbc:mysql:///localhost/db+--table+myTable
HTTP/1.1" 503 345 "-" "Java/1.8.0_172"
127.0.0.1 - - [19/Jun/2018:23:37:54 +0000] "GET //localhost:31000/api/atlas/entities?type=sqoop_dbdatastore&property=qualifiedName&value=mysql+--url+jdbc:mysql:///localhost/db+--table+myTable
HTTP/1.1" 503 345 "-" "Java/1.8.0_172"
127.0.0.1 - - [19/Jun/2018:23:37:59 +0000] "GET //localhost:31000/api/atlas/entities?type=sqoop_dbdatastore&property=qualifiedName&value=mysql+--url+jdbc:mysql:///localhost/db+--table+myTable
HTTP/1.1" 503 345 "-" "Java/1.8.0_172"
127.0.0.1 - - [19/Jun/2018:23:38:04 +0000] "GET //localhost:31000/api/atlas/entities?type=sqoop_dbdatastore&property=qualifiedName&value=mysql+--url+jdbc:mysql:///localhost/db+--table+myTable
HTTP/1.1" 503 345 "-" "Java/1.8.0_172"
Tests run: 2, Failures: 2, Errors: 0, Skipped: 0, Time elapsed: 562.188 sec <<< FAILURE!
- in org.apache.atlas.sqoop.hook.SqoopHookIT
testSqoopExport(org.apache.atlas.sqoop.hook.SqoopHookIT)  Time elapsed: 279.356 sec  <<<
FAILURE!
java.lang.AssertionError: Assertions failed. Failing after waiting for timeout 80000 msecs
	at org.apache.atlas.AtlasBaseClient.callAPIWithResource(AtlasBaseClient.java:395)
	at org.apache.atlas.AtlasBaseClient.callAPIWithResource(AtlasBaseClient.java:323)
	at org.apache.atlas.AtlasBaseClient.callAPIWithRetries(AtlasBaseClient.java:479)
	at org.apache.atlas.AtlasClient.callAPIWithRetries(AtlasClient.java:931)
	at org.apache.atlas.AtlasClient.getEntity(AtlasClient.java:640)
	at org.apache.atlas.sqoop.hook.SqoopHookIT$1.evaluate(SqoopHookIT.java:108)
	at org.apache.atlas.sqoop.hook.SqoopHookIT.waitFor(SqoopHookIT.java:133)
	at org.apache.atlas.sqoop.hook.SqoopHookIT.assertEntityIsRegistered(SqoopHookIT.java:105)
	at org.apache.atlas.sqoop.hook.SqoopHookIT.assertDBStoreIsRegistered(SqoopHookIT.java:90)
	at org.apache.atlas.sqoop.hook.SqoopHookIT.testSqoopExport(SqoopHookIT.java:82)

testSqoopImport(org.apache.atlas.sqoop.hook.SqoopHookIT)  Time elapsed: 278.196 sec  <<<
FAILURE!
java.lang.AssertionError: Assertions failed. Failing after waiting for timeout 80000 msecs
	at org.apache.atlas.AtlasBaseClient.callAPIWithResource(AtlasBaseClient.java:395)
	at org.apache.atlas.AtlasBaseClient.callAPIWithResource(AtlasBaseClient.java:323)
	at org.apache.atlas.AtlasBaseClient.callAPIWithRetries(AtlasBaseClient.java:479)
	at org.apache.atlas.AtlasClient.callAPIWithRetries(AtlasClient.java:931)
	at org.apache.atlas.AtlasClient.getEntity(AtlasClient.java:640)
	at org.apache.atlas.sqoop.hook.SqoopHookIT$1.evaluate(SqoopHookIT.java:108)
	at org.apache.atlas.sqoop.hook.SqoopHookIT.waitFor(SqoopHookIT.java:133)
	at org.apache.atlas.sqoop.hook.SqoopHookIT.assertEntityIsRegistered(SqoopHookIT.java:105)
	at org.apache.atlas.sqoop.hook.SqoopHookIT.assertDBStoreIsRegistered(SqoopHookIT.java:90)
	at org.apache.atlas.sqoop.hook.SqoopHookIT.testSqoopImport(SqoopHookIT.java:67)


Results :

Failed tests: 
  SqoopHookIT.testSqoopExport:82->assertDBStoreIsRegistered:90->assertEntityIsRegistered:105->waitFor:137
Assertions failed. Failing after waiting for timeout 80000 msecs
  SqoopHookIT.testSqoopImport:67->assertDBStoreIsRegistered:90->assertEntityIsRegistered:105->waitFor:137
Assertions failed. Failing after waiting for timeout 80000 msecs

Tests run: 2, Failures: 2, Errors: 0, Skipped: 0

[INFO] 
[INFO] --- jetty-maven-plugin:9.3.14.v20161028:stop (stop-jetty) @ sqoop-bridge ---
[INFO] Waiting 10 seconds for jetty to stop
[INFO] Stopped ServerConnector@59129f17{HTTP/1.1,[http/1.1]}{0.0.0.0:31000}
[INFO] Stopped o.e.j.m.p.JettyWebAppContext@182ddbf9{/,file://<https://builds.apache.org/job/Atlas-1.0-IntegrationTests/ws/webapp/target/atlas-webapp-1.1.0-SNAPSHOT/,UNAVAILABLE}{/home/jenkins/jenkins-slave/workspace/Atlas-1.0-IntegrationTests/webapp/target/atlas-webapp-1.1.0-SNAPSHOT.war}>
[INFO] Server reports itself as stopped
[INFO] 
[INFO] --- maven-source-plugin:2.4:jar-no-fork (attach-sources) @ sqoop-bridge ---
[INFO] Building jar: <https://builds.apache.org/job/Atlas-1.0-IntegrationTests/ws/addons/sqoop-bridge/target/sqoop-bridge-1.1.0-SNAPSHOT-sources.jar>
[INFO] 
[INFO] --- maven-source-plugin:2.4:test-jar-no-fork (attach-sources) @ sqoop-bridge ---
[INFO] Building jar: <https://builds.apache.org/job/Atlas-1.0-IntegrationTests/ws/addons/sqoop-bridge/target/sqoop-bridge-1.1.0-SNAPSHOT-test-sources.jar>
[INFO] 
[INFO] --- maven-failsafe-plugin:2.18.1:verify (verify) @ sqoop-bridge ---
[INFO] Failsafe report directory: <https://builds.apache.org/job/Atlas-1.0-IntegrationTests/ws/addons/sqoop-bridge/target/failsafe-reports>
[INFO] ------------------------------------------------------------------------
[INFO] Reactor Summary:
[INFO] 
[INFO] Apache Atlas Server Build Tools .................... SUCCESS [  0.644 s]
[INFO] apache-atlas ....................................... SUCCESS [  4.612 s]
[INFO] Apache Atlas Test Utility Tools .................... SUCCESS [ 10.687 s]
[INFO] Apache Atlas Integration ........................... SUCCESS [ 23.979 s]
[INFO] Apache Atlas Common ................................ SUCCESS [  8.221 s]
[INFO] Apache Atlas Client ................................ SUCCESS [  0.524 s]
[INFO] atlas-client-common ................................ SUCCESS [  7.883 s]
[INFO] atlas-client-v1 .................................... SUCCESS [  7.251 s]
[INFO] Apache Atlas Server API ............................ SUCCESS [  6.021 s]
[INFO] Apache Atlas Notification .......................... SUCCESS [ 10.282 s]
[INFO] atlas-client-v2 .................................... SUCCESS [  6.110 s]
[INFO] Apache Atlas Graph Database Projects ............... SUCCESS [  0.398 s]
[INFO] Apache Atlas Graph Database API .................... SUCCESS [  5.182 s]
[INFO] Graph Database Common Code ......................... SUCCESS [  5.556 s]
[INFO] Apache Atlas JanusGraph DB Impl .................... SUCCESS [ 17.108 s]
[INFO] Apache Atlas Graph Database Implementation Dependencies SUCCESS [  2.274 s]
[INFO] Shaded version of Apache hbase client .............. SUCCESS [  7.857 s]
[INFO] Shaded version of Apache hbase server .............. SUCCESS [ 20.038 s]
[INFO] Apache Atlas Authorization ......................... SUCCESS [  6.658 s]
[INFO] Apache Atlas Repository ............................ SUCCESS [ 35.611 s]
[INFO] Apache Atlas UI .................................... SUCCESS [01:45 min]
[INFO] Apache Atlas Web Application ....................... SUCCESS [04:52 min]
[INFO] Apache Atlas Documentation ......................... SUCCESS [  5.303 s]
[INFO] Apache Atlas FileSystem Model ...................... SUCCESS [  3.431 s]
[INFO] Apache Atlas Plugin Classloader .................... SUCCESS [  7.141 s]
[INFO] Apache Atlas Hive Bridge Shim ...................... SUCCESS [  5.429 s]
[INFO] Apache Atlas Hive Bridge ........................... SUCCESS [08:39 min]
[INFO] Apache Atlas Falcon Bridge Shim .................... SUCCESS [ 19.812 s]
[INFO] Apache Atlas Falcon Bridge ......................... SUCCESS [03:17 min]
[INFO] Apache Atlas Sqoop Bridge Shim ..................... SUCCESS [ 16.433 s]
[INFO] Apache Atlas Sqoop Bridge .......................... FAILURE [11:43 min]
[INFO] Apache Atlas Storm Bridge Shim ..................... SKIPPED
[INFO] Apache Atlas Storm Bridge .......................... SKIPPED
[INFO] Apache Atlas Hbase Bridge Shim ..................... SKIPPED
[INFO] Apache Atlas Hbase Bridge .......................... SKIPPED
[INFO] Apache Atlas Kafka Bridge .......................... SKIPPED
[INFO] Apache Atlas Distribution .......................... SKIPPED
[INFO] ------------------------------------------------------------------------
[INFO] BUILD FAILURE
[INFO] ------------------------------------------------------------------------
[INFO] Total time: 34:25 min
[INFO] Finished at: 2018-06-19T23:38:10Z
[INFO] Final Memory: 827M/3465M
[INFO] ------------------------------------------------------------------------
[ERROR] Failed to execute goal org.apache.maven.plugins:maven-failsafe-plugin:2.18.1:verify
(verify) on project sqoop-bridge: There are test failures.
[ERROR] 
[ERROR] Please refer to <https://builds.apache.org/job/Atlas-1.0-IntegrationTests/ws/addons/sqoop-bridge/target/failsafe-reports>
for the individual test results.
[ERROR] -> [Help 1]
[ERROR] 
[ERROR] To see the full stack trace of the errors, re-run Maven with the -e switch.
[ERROR] Re-run Maven using the -X switch to enable full debug logging.
[ERROR] 
[ERROR] For more information about the errors and possible solutions, please read the following
articles:
[ERROR] [Help 1] http://cwiki.apache.org/confluence/display/MAVEN/MojoFailureException
[ERROR] 
[ERROR] After correcting the problems, you can resume the build with the command
[ERROR]   mvn <goals> -rf :sqoop-bridge
Build step 'Execute shell' marked build as failure
[CHECKSTYLE] Collecting checkstyle analysis files...
[CHECKSTYLE] Searching for all files in <https://builds.apache.org/job/Atlas-1.0-IntegrationTests/ws/>
that match the pattern **/target/checkstyle-result.xml
[CHECKSTYLE] Parsing 29 files in <https://builds.apache.org/job/Atlas-1.0-IntegrationTests/ws/>
[CHECKSTYLE] Successfully parsed file <https://builds.apache.org/job/Atlas-1.0-IntegrationTests/ws/addons/falcon-bridge-shim/target/checkstyle-result.xml>
with 29 unique warnings and 0 duplicates.
[CHECKSTYLE] Successfully parsed file <https://builds.apache.org/job/Atlas-1.0-IntegrationTests/ws/addons/falcon-bridge/target/checkstyle-result.xml>
with 419 unique warnings and 0 duplicates.
[CHECKSTYLE] Successfully parsed file <https://builds.apache.org/job/Atlas-1.0-IntegrationTests/ws/addons/hdfs-model/target/checkstyle-result.xml>
with 419 unique warnings and 0 duplicates.
[CHECKSTYLE] Successfully parsed file <https://builds.apache.org/job/Atlas-1.0-IntegrationTests/ws/addons/hive-bridge-shim/target/checkstyle-result.xml>
with 434 unique warnings and 0 duplicates.
[CHECKSTYLE] Successfully parsed file <https://builds.apache.org/job/Atlas-1.0-IntegrationTests/ws/addons/hive-bridge/target/checkstyle-result.xml>
with 2730 unique warnings and 0 duplicates.
[CHECKSTYLE] Successfully parsed file <https://builds.apache.org/job/Atlas-1.0-IntegrationTests/ws/addons/sqoop-bridge-shim/target/checkstyle-result.xml>
with 2746 unique warnings and 0 duplicates.
[CHECKSTYLE] Successfully parsed file <https://builds.apache.org/job/Atlas-1.0-IntegrationTests/ws/authorization/target/checkstyle-result.xml>
with 3415 unique warnings and 0 duplicates.
[CHECKSTYLE] Successfully parsed file <https://builds.apache.org/job/Atlas-1.0-IntegrationTests/ws/client/client-v1/target/checkstyle-result.xml>
with 4304 unique warnings and 0 duplicates.
[CHECKSTYLE] Successfully parsed file <https://builds.apache.org/job/Atlas-1.0-IntegrationTests/ws/client/client-v2/target/checkstyle-result.xml>
with 4663 unique warnings and 0 duplicates.
[CHECKSTYLE] Successfully parsed file <https://builds.apache.org/job/Atlas-1.0-IntegrationTests/ws/client/common/target/checkstyle-result.xml>
with 5154 unique warnings and 0 duplicates.
[CHECKSTYLE] Successfully parsed file <https://builds.apache.org/job/Atlas-1.0-IntegrationTests/ws/client/target/checkstyle-result.xml>
with 5154 unique warnings and 0 duplicates.
[CHECKSTYLE] Successfully parsed file <https://builds.apache.org/job/Atlas-1.0-IntegrationTests/ws/common/target/checkstyle-result.xml>
with 6213 unique warnings and 0 duplicates.
[CHECKSTYLE] Successfully parsed file <https://builds.apache.org/job/Atlas-1.0-IntegrationTests/ws/dashboardv2/target/checkstyle-result.xml>
with 6213 unique warnings and 0 duplicates.
[CHECKSTYLE] Successfully parsed file <https://builds.apache.org/job/Atlas-1.0-IntegrationTests/ws/docs/target/checkstyle-result.xml>
with 6213 unique warnings and 0 duplicates.
[CHECKSTYLE] Successfully parsed file <https://builds.apache.org/job/Atlas-1.0-IntegrationTests/ws/graphdb/api/target/checkstyle-result.xml>
with 6515 unique warnings and 0 duplicates.
[CHECKSTYLE] Successfully parsed file <https://builds.apache.org/job/Atlas-1.0-IntegrationTests/ws/graphdb/common/target/checkstyle-result.xml>
with 6741 unique warnings and 0 duplicates.
[CHECKSTYLE] Successfully parsed file <https://builds.apache.org/job/Atlas-1.0-IntegrationTests/ws/graphdb/graphdb-impls/target/checkstyle-result.xml>
with 6741 unique warnings and 0 duplicates.
[CHECKSTYLE] Successfully parsed file <https://builds.apache.org/job/Atlas-1.0-IntegrationTests/ws/graphdb/janus/target/checkstyle-result.xml>
with 9063 unique warnings and 0 duplicates.
[CHECKSTYLE] Successfully parsed file <https://builds.apache.org/job/Atlas-1.0-IntegrationTests/ws/graphdb/target/checkstyle-result.xml>
with 9063 unique warnings and 0 duplicates.
[CHECKSTYLE] Successfully parsed file <https://builds.apache.org/job/Atlas-1.0-IntegrationTests/ws/intg/target/checkstyle-result.xml>
with 21053 unique warnings and 0 duplicates.
[CHECKSTYLE] Successfully parsed file <https://builds.apache.org/job/Atlas-1.0-IntegrationTests/ws/notification/target/checkstyle-result.xml>
with 22290 unique warnings and 0 duplicates.
[CHECKSTYLE] Successfully parsed file <https://builds.apache.org/job/Atlas-1.0-IntegrationTests/ws/plugin-classloader/target/checkstyle-result.xml>
with 22403 unique warnings and 0 duplicates.
[CHECKSTYLE] Successfully parsed file <https://builds.apache.org/job/Atlas-1.0-IntegrationTests/ws/repository/target/checkstyle-result.xml>
with 41326 unique warnings and 0 duplicates.
[CHECKSTYLE] Successfully parsed file <https://builds.apache.org/job/Atlas-1.0-IntegrationTests/ws/server-api/target/checkstyle-result.xml>
with 41494 unique warnings and 0 duplicates.
[CHECKSTYLE] Successfully parsed file <https://builds.apache.org/job/Atlas-1.0-IntegrationTests/ws/shaded/hbase-client-shaded/target/checkstyle-result.xml>
with 41494 unique warnings and 0 duplicates.
[CHECKSTYLE] Successfully parsed file <https://builds.apache.org/job/Atlas-1.0-IntegrationTests/ws/shaded/hbase-server-shaded/target/checkstyle-result.xml>
with 41494 unique warnings and 0 duplicates.
[CHECKSTYLE] Successfully parsed file <https://builds.apache.org/job/Atlas-1.0-IntegrationTests/ws/target/checkstyle-result.xml>
with 41494 unique warnings and 0 duplicates.
[CHECKSTYLE] Successfully parsed file <https://builds.apache.org/job/Atlas-1.0-IntegrationTests/ws/test-tools/target/checkstyle-result.xml>
with 41532 unique warnings and 0 duplicates.
[CHECKSTYLE] Successfully parsed file <https://builds.apache.org/job/Atlas-1.0-IntegrationTests/ws/webapp/target/checkstyle-result.xml>
with 49876 unique warnings and 0 duplicates.
<Git Blamer> Using GitBlamer to create author and commit information for all warnings.
<Git Blamer> GIT_COMMIT=bfd88c3c3c84f4897c345e146181a56fd5af0620, workspace=<https://builds.apache.org/job/Atlas-1.0-IntegrationTests/ws/>
 > git rev-parse bfd88c3c3c84f4897c345e146181a56fd5af0620^{commit} # timeout=10
<Git Blamer> Skipping file <https://builds.apache.org/job/Atlas-1.0-IntegrationTests/ws/graphdb/janus/src/main/java/org/apache/atlas/repository/graphdb/janus/graphson/AtlasGraphSONMode.java,>
no result found.
[CHECKSTYLE] Computing warning deltas based on reference build #303
[FINDBUGS] Collecting findbugs analysis files...
[FINDBUGS] Searching for all files in <https://builds.apache.org/job/Atlas-1.0-IntegrationTests/ws/>
that match the pattern **/target/findbugs.xml
[FINDBUGS] Parsing 20 files in <https://builds.apache.org/job/Atlas-1.0-IntegrationTests/ws/>
[FINDBUGS] Successfully parsed file <https://builds.apache.org/job/Atlas-1.0-IntegrationTests/ws/addons/falcon-bridge-shim/target/findbugs.xml>
with 0 unique warnings and 0 duplicates.
[FINDBUGS] Successfully parsed file <https://builds.apache.org/job/Atlas-1.0-IntegrationTests/ws/addons/falcon-bridge/target/findbugs.xml>
with 0 unique warnings and 0 duplicates.
[FINDBUGS] Successfully parsed file <https://builds.apache.org/job/Atlas-1.0-IntegrationTests/ws/addons/hive-bridge-shim/target/findbugs.xml>
with 0 unique warnings and 0 duplicates.
[FINDBUGS] Successfully parsed file <https://builds.apache.org/job/Atlas-1.0-IntegrationTests/ws/addons/hive-bridge/target/findbugs.xml>
with 0 unique warnings and 0 duplicates.
[FINDBUGS] Successfully parsed file <https://builds.apache.org/job/Atlas-1.0-IntegrationTests/ws/addons/sqoop-bridge-shim/target/findbugs.xml>
with 0 unique warnings and 0 duplicates.
[FINDBUGS] Successfully parsed file <https://builds.apache.org/job/Atlas-1.0-IntegrationTests/ws/authorization/target/findbugs.xml>
with 0 unique warnings and 0 duplicates.
[FINDBUGS] Successfully parsed file <https://builds.apache.org/job/Atlas-1.0-IntegrationTests/ws/client/client-v1/target/findbugs.xml>
with 0 unique warnings and 0 duplicates.
[FINDBUGS] Successfully parsed file <https://builds.apache.org/job/Atlas-1.0-IntegrationTests/ws/client/client-v2/target/findbugs.xml>
with 0 unique warnings and 0 duplicates.
[FINDBUGS] Successfully parsed file <https://builds.apache.org/job/Atlas-1.0-IntegrationTests/ws/client/common/target/findbugs.xml>
with 0 unique warnings and 0 duplicates.
[FINDBUGS] Successfully parsed file <https://builds.apache.org/job/Atlas-1.0-IntegrationTests/ws/common/target/findbugs.xml>
with 0 unique warnings and 0 duplicates.
[FINDBUGS] Successfully parsed file <https://builds.apache.org/job/Atlas-1.0-IntegrationTests/ws/graphdb/api/target/findbugs.xml>
with 0 unique warnings and 0 duplicates.
[FINDBUGS] Successfully parsed file <https://builds.apache.org/job/Atlas-1.0-IntegrationTests/ws/graphdb/common/target/findbugs.xml>
with 0 unique warnings and 0 duplicates.
[FINDBUGS] Successfully parsed file <https://builds.apache.org/job/Atlas-1.0-IntegrationTests/ws/graphdb/janus/target/findbugs.xml>
with 0 unique warnings and 0 duplicates.
[FINDBUGS] Successfully parsed file <https://builds.apache.org/job/Atlas-1.0-IntegrationTests/ws/intg/target/findbugs.xml>
with 0 unique warnings and 0 duplicates.
[FINDBUGS] Successfully parsed file <https://builds.apache.org/job/Atlas-1.0-IntegrationTests/ws/notification/target/findbugs.xml>
with 0 unique warnings and 0 duplicates.
[FINDBUGS] Successfully parsed file <https://builds.apache.org/job/Atlas-1.0-IntegrationTests/ws/plugin-classloader/target/findbugs.xml>
with 0 unique warnings and 0 duplicates.
[FINDBUGS] Successfully parsed file <https://builds.apache.org/job/Atlas-1.0-IntegrationTests/ws/repository/target/findbugs.xml>
with 0 unique warnings and 0 duplicates.
[FINDBUGS] Successfully parsed file <https://builds.apache.org/job/Atlas-1.0-IntegrationTests/ws/server-api/target/findbugs.xml>
with 0 unique warnings and 0 duplicates.
[FINDBUGS] Successfully parsed file <https://builds.apache.org/job/Atlas-1.0-IntegrationTests/ws/test-tools/target/findbugs.xml>
with 0 unique warnings and 0 duplicates.
[FINDBUGS] Successfully parsed file <https://builds.apache.org/job/Atlas-1.0-IntegrationTests/ws/webapp/target/findbugs.xml>
with 0 unique warnings and 0 duplicates.
<Git Blamer> Using GitBlamer to create author and commit information for all warnings.
<Git Blamer> GIT_COMMIT=bfd88c3c3c84f4897c345e146181a56fd5af0620, workspace=<https://builds.apache.org/job/Atlas-1.0-IntegrationTests/ws/>
[FINDBUGS] Computing warning deltas based on reference build #303
Archiving artifacts
[Fast Archiver] Compressed 168.67 MB of artifacts by 83.4% relative to #303
TestNG Reports Processing: START
Looking for TestNG results report in workspace using pattern: **/target/surefire-reports/testng-results.xml,**/target/failsafe-reports/testng-results.xml
Saving reports...
Processing '/x1/jenkins/jenkins-home/jobs/Atlas-1.0-IntegrationTests/builds/304/testng/testng-results-1.xml'
Processing '/x1/jenkins/jenkins-home/jobs/Atlas-1.0-IntegrationTests/builds/304/testng/testng-results-2.xml'
Processing '/x1/jenkins/jenkins-home/jobs/Atlas-1.0-IntegrationTests/builds/304/testng/testng-results-3.xml'
Processing '/x1/jenkins/jenkins-home/jobs/Atlas-1.0-IntegrationTests/builds/304/testng/testng-results.xml'
1.183432% of tests failed, which exceeded threshold of 0%. Marking build as UNSTABLE
TestNG Reports Processing: FINISH

Mime
View raw message