atlas-dev mailing list archives

Site index · List index
Message view « Date » · « Thread »
Top « Date » · « Thread »
From Apache Jenkins Server <jenk...@builds.apache.org>
Subject Build failed in Jenkins: PreCommit-ATLAS-Build-Test #467-master-0001-ATLAS-2741-Deleted-entities-DSL-search-with-tag-does.patch
Date Tue, 05 Jun 2018 21:50:32 GMT
See <https://builds.apache.org/job/PreCommit-ATLAS-Build-Test/467/display/redirect?page=changes>

Changes:

[madhan] ATLAS-2730: added validation of TimeBoundry values in classifications

[madhan] ATLAS-2731: UI : attributes on table's detailsPage buffers forever due

[madhan] ATLAS-2732: updated import-hive.sh/import-hbase.sh to handle kerberos

------------------------------------------
[...truncated 226.42 KB...]
[INFO] 
[INFO] --- maven-compiler-plugin:3.7.0:testCompile (default-testCompile) @ atlas-repository
---
[INFO] Changes detected - recompiling the module!
[INFO] Compiling 49 source files to <https://builds.apache.org/job/PreCommit-ATLAS-Build-Test/ws/repository/target/test-classes>
[INFO] <https://builds.apache.org/job/PreCommit-ATLAS-Build-Test/ws/repository/src/test/java/org/apache/atlas/query/BasicTestSetup.java>:
<https://builds.apache.org/job/PreCommit-ATLAS-Build-Test/ws/repository/src/test/java/org/apache/atlas/query/BasicTestSetup.java>
uses or overrides a deprecated API.
[INFO] <https://builds.apache.org/job/PreCommit-ATLAS-Build-Test/ws/repository/src/test/java/org/apache/atlas/query/BasicTestSetup.java>:
Recompile with -Xlint:deprecation for details.
[INFO] <https://builds.apache.org/job/PreCommit-ATLAS-Build-Test/ws/repository/src/test/java/org/apache/atlas/repository/impexp/UniqueListTest.java>:
Some input files use unchecked or unsafe operations.
[INFO] <https://builds.apache.org/job/PreCommit-ATLAS-Build-Test/ws/repository/src/test/java/org/apache/atlas/repository/impexp/UniqueListTest.java>:
Recompile with -Xlint:unchecked for details.
[INFO] 
[INFO] --- maven-surefire-plugin:2.18.1:test (default-test) @ atlas-repository ---
[INFO] Surefire report directory: <https://builds.apache.org/job/PreCommit-ATLAS-Build-Test/ws/repository/target/surefire-reports>
[INFO] Using configured provider org.apache.maven.surefire.testng.TestNGProvider

-------------------------------------------------------
 T E S T S
-------------------------------------------------------
Running org.apache.atlas.repository.store.graph.v2.AtlasComplexAttributesTest
Running org.apache.atlas.query.DSLParsingTest
Running org.apache.atlas.utils.TestResourceFileUtils
Running org.apache.atlas.TestModules
Running org.apache.atlas.repository.store.graph.v2.AtlasRelationshipStoreV2Test
Running org.apache.atlas.repository.migration.TypesWithClassificationTest
Running org.apache.atlas.repository.store.graph.v2.AtlasRelationshipStoreSoftDeleteV2Test
Running org.apache.atlas.repository.store.graph.v2.AtlasRelationshipDefStoreV2Test
Running org.apache.atlas.repository.migration.MigrationProgressServiceTest
Running org.apache.atlas.utils.ObjectUpdateSynchronizerTest
Running org.apache.atlas.repository.store.graph.v2.AtlasRelationshipStoreHardDeleteV2Test
Running org.apache.atlas.repository.store.graph.v2.InverseReferenceUpdateHardDeleteV2Test
Running org.apache.atlas.repository.store.graph.v2.InverseReferenceUpdateV2Test
Running org.apache.atlas.repository.store.graph.v2.AtlasEntityDefStoreV2Test
Running org.apache.atlas.services.MetricsServiceTest
Running org.apache.atlas.query.GremlinQueryComposerTest
Running org.apache.atlas.repository.userprofile.UserProfileServiceTest
Running org.apache.atlas.repository.store.graph.v2.AtlasEntityStoreV2Test
Running org.apache.atlas.repository.migration.ComplexAttributesTest
Running org.apache.atlas.repository.store.graph.v2.AtlasEntityStoreV2BulkImportPercentTest
Running org.apache.atlas.repository.impexp.ImportTransformerJSONTest
Running org.apache.atlas.query.DSLQueriesTest
Running org.apache.atlas.repository.migration.TypesWithCollectionsFinderTest
Running org.apache.atlas.repository.migration.HiveParititionTest
Running org.apache.atlas.repository.store.graph.v2.InverseReferenceUpdateSoftDeleteV2Test
Running org.apache.atlas.repository.impexp.ImportTransformsTest
Running org.apache.atlas.repository.migration.TypesDefScrubberTest
Running org.apache.atlas.repository.migration.HiveStocksTest
Running org.apache.atlas.repository.migration.RelationshipCacheGeneratorTest
Running org.apache.atlas.repository.impexp.ExportServiceTest
Running org.apache.atlas.repository.store.graph.AtlasTypeDefGraphStoreTest
Running org.apache.atlas.repository.migration.PathTest
Tests run: 0, Failures: 0, Errors: 0, Skipped: 0, Time elapsed: 2.056 sec - in org.apache.atlas.utils.TestResourceFileUtils
Tests run: 0, Failures: 0, Errors: 0, Skipped: 0, Time elapsed: 2.622 sec - in org.apache.atlas.repository.store.graph.v2.AtlasRelationshipStoreV2Test
Tests run: 0, Failures: 0, Errors: 0, Skipped: 0, Time elapsed: 2.793 sec - in org.apache.atlas.TestModules
Tests run: 0, Failures: 0, Errors: 0, Skipped: 0, Time elapsed: 3.398 sec - in org.apache.atlas.repository.store.graph.v2.InverseReferenceUpdateV2Test
Running org.apache.atlas.repository.impexp.UniqueListTest
Running org.apache.atlas.repository.impexp.AtlasImportRequestTest
Running org.apache.atlas.repository.impexp.ZipSinkTest
Tests run: 9, Failures: 0, Errors: 0, Skipped: 0, Time elapsed: 4.931 sec - in org.apache.atlas.repository.store.graph.v2.AtlasEntityStoreV2BulkImportPercentTest
Running org.apache.atlas.repository.impexp.ZipSourceTest
Tests run: 4, Failures: 0, Errors: 0, Skipped: 0, Time elapsed: 6.167 sec - in org.apache.atlas.repository.migration.MigrationProgressServiceTest
Tests run: 4, Failures: 0, Errors: 0, Skipped: 0, Time elapsed: 1.996 sec - in org.apache.atlas.repository.impexp.UniqueListTest
Tests run: 9, Failures: 0, Errors: 0, Skipped: 0, Time elapsed: 6.299 sec - in org.apache.atlas.utils.ObjectUpdateSynchronizerTest
Tests run: 1, Failures: 0, Errors: 0, Skipped: 0, Time elapsed: 5.569 sec - in org.apache.atlas.repository.migration.TypesDefScrubberTest
Tests run: 1, Failures: 0, Errors: 0, Skipped: 0, Time elapsed: 6.299 sec - in org.apache.atlas.repository.impexp.ImportTransformerJSONTest
Tests run: 8, Failures: 0, Errors: 0, Skipped: 0, Time elapsed: 7.407 sec - in org.apache.atlas.query.DSLParsingTest
Running org.apache.atlas.repository.impexp.TypeAttributeDifferenceTest
Tests run: 3, Failures: 0, Errors: 0, Skipped: 0, Time elapsed: 7.671 sec - in org.apache.atlas.repository.impexp.ImportTransformsTest
Running org.apache.atlas.repository.impexp.ImportTransformerTest
Running org.apache.atlas.repository.tagpropagation.ClassificationPropagationTest
Running org.apache.atlas.repository.impexp.ImportServiceTest
Running org.apache.atlas.repository.audit.CassandraAuditRepositoryTest
Running org.apache.atlas.repository.audit.InMemoryAuditRepositoryTest
Running org.apache.atlas.glossary.PaginationHelperTest
Tests run: 6, Failures: 0, Errors: 0, Skipped: 0, Time elapsed: 4.863 sec - in org.apache.atlas.repository.impexp.ZipSourceTest
Tests run: 6, Failures: 0, Errors: 0, Skipped: 0, Time elapsed: 6.033 sec - in org.apache.atlas.repository.impexp.AtlasImportRequestTest
Running org.apache.atlas.glossary.GlossaryServiceTest
Tests run: 8, Failures: 0, Errors: 0, Skipped: 0, Time elapsed: 2.488 sec - in org.apache.atlas.repository.impexp.ImportTransformerTest
Tests run: 6, Failures: 0, Errors: 0, Skipped: 0, Time elapsed: 3.817 sec - in org.apache.atlas.repository.impexp.TypeAttributeDifferenceTest
Tests run: 6, Failures: 0, Errors: 0, Skipped: 0, Time elapsed: 2.311 sec - in org.apache.atlas.repository.audit.InMemoryAuditRepositoryTest
Tests run: 8, Failures: 0, Errors: 0, Skipped: 0, Time elapsed: 6.756 sec - in org.apache.atlas.repository.impexp.ZipSinkTest
Tests run: 20, Failures: 0, Errors: 0, Skipped: 0, Time elapsed: 2.132 sec - in org.apache.atlas.glossary.PaginationHelperTest
Tests run: 39, Failures: 3, Errors: 0, Skipped: 0, Time elapsed: 18.181 sec <<< FAILURE!
- in org.apache.atlas.query.GremlinQueryComposerTest
classification(org.apache.atlas.query.GremlinQueryComposerTest)  Time elapsed: 0.213 sec 
<<< FAILURE!
java.lang.AssertionError: PII expected [g.V().outE('classifiedAs').has('__name', within('PII')).has('__state',
'ACTIVE').outV().dedup().limit(25).toList()] but found [g.V().outE('classifiedAs').has('__name',
within('PII')).outV().dedup().limit(25).toList()]
	at org.testng.Assert.fail(Assert.java:94)
	at org.testng.Assert.failNotEquals(Assert.java:496)
	at org.testng.Assert.assertEquals(Assert.java:125)
	at org.testng.Assert.assertEquals(Assert.java:178)
	at org.apache.atlas.query.GremlinQueryComposerTest.verify(GremlinQueryComposerTest.java:354)
	at org.apache.atlas.query.GremlinQueryComposerTest.verify(GremlinQueryComposerTest.java:363)
	at org.apache.atlas.query.GremlinQueryComposerTest.classification(GremlinQueryComposerTest.java:40)

dimension(org.apache.atlas.query.GremlinQueryComposerTest)  Time elapsed: 0.161 sec  <<<
FAILURE!
java.lang.AssertionError: Table isa Dimension expected [g.V().has('__typeName', 'Table').outE('classifiedAs').has('__name',
within('Dimension')).has('__state', 'ACTIVE').outV().dedup().limit(25).toList()] but found
[g.V().has('__typeName', 'Table').outE('classifiedAs').has('__name', within('Dimension')).outV().dedup().limit(25).toList()]
	at org.testng.Assert.fail(Assert.java:94)
	at org.testng.Assert.failNotEquals(Assert.java:496)
	at org.testng.Assert.assertEquals(Assert.java:125)
	at org.testng.Assert.assertEquals(Assert.java:178)
	at org.apache.atlas.query.GremlinQueryComposerTest.verify(GremlinQueryComposerTest.java:354)
	at org.apache.atlas.query.GremlinQueryComposerTest.verify(GremlinQueryComposerTest.java:363)
	at org.apache.atlas.query.GremlinQueryComposerTest.dimension(GremlinQueryComposerTest.java:46)

keywordsInWhereClause(org.apache.atlas.query.GremlinQueryComposerTest)  Time elapsed: 0.052
sec  <<< FAILURE!
java.lang.AssertionError: Table as t where t has name and t isa Dimension expected [g.V().has('__typeName',
'Table').as('t').and(__.has('Table.name'),__.outE('classifiedAs').has('__name', within('Dimension')).has('__state',
'ACTIVE').outV()).dedup().limit(25).toList()] but found [g.V().has('__typeName', 'Table').as('t').and(__.has('Table.name'),__.outE('classifiedAs').has('__name',
within('Dimension')).outV()).dedup().limit(25).toList()]
	at org.testng.Assert.fail(Assert.java:94)
	at org.testng.Assert.failNotEquals(Assert.java:496)
	at org.testng.Assert.assertEquals(Assert.java:125)
	at org.testng.Assert.assertEquals(Assert.java:178)
	at org.apache.atlas.query.GremlinQueryComposerTest.verify(GremlinQueryComposerTest.java:354)
	at org.apache.atlas.query.GremlinQueryComposerTest.verify(GremlinQueryComposerTest.java:363)
	at org.apache.atlas.query.GremlinQueryComposerTest.keywordsInWhereClause(GremlinQueryComposerTest.java:297)

Tests run: 7, Failures: 0, Errors: 0, Skipped: 7, Time elapsed: 18.429 sec - in org.apache.atlas.repository.audit.CassandraAuditRepositoryTest
Tests run: 1, Failures: 0, Errors: 0, Skipped: 0, Time elapsed: 43.16 sec - in org.apache.atlas.services.MetricsServiceTest
Tests run: 10, Failures: 0, Errors: 0, Skipped: 0, Time elapsed: 71.472 sec - in org.apache.atlas.repository.store.graph.v2.AtlasRelationshipDefStoreV2Test
Tests run: 1, Failures: 0, Errors: 0, Skipped: 0, Time elapsed: 73.755 sec - in org.apache.atlas.repository.store.graph.v2.AtlasEntityDefStoreV2Test
Tests run: 4, Failures: 0, Errors: 0, Skipped: 0, Time elapsed: 82.273 sec - in org.apache.atlas.repository.store.graph.v2.AtlasRelationshipStoreHardDeleteV2Test
Tests run: 1, Failures: 0, Errors: 0, Skipped: 0, Time elapsed: 91.618 sec - in org.apache.atlas.repository.migration.RelationshipCacheGeneratorTest
Tests run: 5, Failures: 0, Errors: 0, Skipped: 0, Time elapsed: 96.593 sec - in org.apache.atlas.repository.store.graph.v2.InverseReferenceUpdateSoftDeleteV2Test
Tests run: 7, Failures: 0, Errors: 0, Skipped: 0, Time elapsed: 100.654 sec - in org.apache.atlas.repository.store.graph.v2.AtlasComplexAttributesTest
Tests run: 5, Failures: 0, Errors: 0, Skipped: 0, Time elapsed: 100.803 sec - in org.apache.atlas.repository.store.graph.v2.InverseReferenceUpdateHardDeleteV2Test
Tests run: 4, Failures: 0, Errors: 0, Skipped: 0, Time elapsed: 101.634 sec - in org.apache.atlas.repository.store.graph.v2.AtlasRelationshipStoreSoftDeleteV2Test
Tests run: 1, Failures: 0, Errors: 0, Skipped: 0, Time elapsed: 102.567 sec - in org.apache.atlas.repository.migration.TypesWithCollectionsFinderTest
Tests run: 12, Failures: 0, Errors: 0, Skipped: 0, Time elapsed: 101.733 sec - in org.apache.atlas.repository.impexp.ExportServiceTest
Tests run: 1, Failures: 0, Errors: 0, Skipped: 0, Time elapsed: 109.101 sec - in org.apache.atlas.repository.migration.PathTest
Tests run: 12, Failures: 0, Errors: 0, Skipped: 0, Time elapsed: 112.296 sec - in org.apache.atlas.repository.userprofile.UserProfileServiceTest
Tests run: 18, Failures: 0, Errors: 0, Skipped: 0, Time elapsed: 116.439 sec - in org.apache.atlas.repository.store.graph.AtlasTypeDefGraphStoreTest
Tests run: 35, Failures: 0, Errors: 0, Skipped: 0, Time elapsed: 107.266 sec - in org.apache.atlas.glossary.GlossaryServiceTest
Tests run: 16, Failures: 0, Errors: 0, Skipped: 0, Time elapsed: 119.092 sec - in org.apache.atlas.repository.store.graph.v2.AtlasEntityStoreV2Test
Tests run: 1, Failures: 0, Errors: 0, Skipped: 0, Time elapsed: 120.754 sec - in org.apache.atlas.repository.migration.TypesWithClassificationTest
Tests run: 1, Failures: 0, Errors: 0, Skipped: 0, Time elapsed: 120.56 sec - in org.apache.atlas.repository.migration.HiveParititionTest
Tests run: 1, Failures: 0, Errors: 0, Skipped: 0, Time elapsed: 124.703 sec - in org.apache.atlas.repository.migration.ComplexAttributesTest
Tests run: 1, Failures: 0, Errors: 0, Skipped: 0, Time elapsed: 124.158 sec - in org.apache.atlas.repository.migration.HiveStocksTest
Tests run: 14, Failures: 0, Errors: 0, Skipped: 0, Time elapsed: 128.672 sec - in org.apache.atlas.repository.impexp.ImportServiceTest
Tests run: 9, Failures: 0, Errors: 0, Skipped: 0, Time elapsed: 133.123 sec - in org.apache.atlas.repository.tagpropagation.ClassificationPropagationTest
Tests run: 246, Failures: 0, Errors: 0, Skipped: 0, Time elapsed: 192.218 sec - in org.apache.atlas.query.DSLQueriesTest

Results :

Failed tests: 
  GremlinQueryComposerTest.classification:40->verify:363->verify:354 PII expected [g.V().outE('classifiedAs').has('__name',
within('PII')).has('__state', 'ACTIVE').outV().dedup().limit(25).toList()] but found [g.V().outE('classifiedAs').has('__name',
within('PII')).outV().dedup().limit(25).toList()]
  GremlinQueryComposerTest.dimension:46->verify:363->verify:354 Table isa Dimension
expected [g.V().has('__typeName', 'Table').outE('classifiedAs').has('__name', within('Dimension')).has('__state',
'ACTIVE').outV().dedup().limit(25).toList()] but found [g.V().has('__typeName', 'Table').outE('classifiedAs').has('__name',
within('Dimension')).outV().dedup().limit(25).toList()]
  GremlinQueryComposerTest.keywordsInWhereClause:297->verify:363->verify:354 Table as
t where t has name and t isa Dimension expected [g.V().has('__typeName', 'Table').as('t').and(__.has('Table.name'),__.outE('classifiedAs').has('__name',
within('Dimension')).has('__state', 'ACTIVE').outV()).dedup().limit(25).toList()] but found
[g.V().has('__typeName', 'Table').as('t').and(__.has('Table.name'),__.outE('classifiedAs').has('__name',
within('Dimension')).outV()).dedup().limit(25).toList()]

Tests run: 551, Failures: 3, Errors: 0, Skipped: 7

[INFO] ------------------------------------------------------------------------
[INFO] Reactor Summary:
[INFO] 
[INFO] Apache Atlas Server Build Tools .................... SUCCESS [  0.721 s]
[INFO] apache-atlas ....................................... SUCCESS [  3.669 s]
[INFO] Apache Atlas Test Utility Tools .................... SUCCESS [  4.784 s]
[INFO] Open Connector Framework (OCF) ..................... SUCCESS [  1.883 s]
[INFO] Open Metadata Repository Services (OMRS) ........... SUCCESS [  6.459 s]
[INFO] Open Metadata and Governance (OMAG) Server APIs .... SUCCESS [  0.988 s]
[INFO] Connected Asset Open Metadata Access Service (OMAS)  SUCCESS [  1.297 s]
[INFO] Asset Consumer Open Metadata Access Service (OMAS) . SUCCESS [  1.098 s]
[INFO] Open Metadata and Governance (OMAG) Server ......... SUCCESS [  1.330 s]
[INFO] Apache Atlas Integration ........................... SUCCESS [ 37.958 s]
[INFO] Apache Atlas Common ................................ SUCCESS [  2.294 s]
[INFO] Apache Atlas Client ................................ SUCCESS [  0.158 s]
[INFO] atlas-client-common ................................ SUCCESS [  0.821 s]
[INFO] atlas-client-v1 .................................... SUCCESS [  2.555 s]
[INFO] Apache Atlas Server API ............................ SUCCESS [  0.897 s]
[INFO] Apache Atlas Notification .......................... SUCCESS [ 17.333 s]
[INFO] atlas-client-v2 .................................... SUCCESS [  0.734 s]
[INFO] Apache Atlas Graph Database Projects ............... SUCCESS [  0.083 s]
[INFO] Apache Atlas Graph Database API .................... SUCCESS [  1.376 s]
[INFO] Graph Database Common Code ......................... SUCCESS [  0.805 s]
[INFO] Apache Atlas JanusGraph DB Impl .................... SUCCESS [01:58 min]
[INFO] Apache Atlas Graph Database Implementation Dependencies SUCCESS [  2.169 s]
[INFO] Shaded version of Apache hbase client .............. SUCCESS [  7.499 s]
[INFO] Shaded version of Apache hbase server .............. SUCCESS [ 20.942 s]
[INFO] Apache Atlas Authorization ......................... SUCCESS [  2.375 s]
[INFO] Apache Atlas Repository ............................ FAILURE [03:24 min]
[INFO] Apache Atlas UI .................................... SKIPPED
[INFO] Apache Atlas Web Application ....................... SKIPPED
[INFO] Apache Atlas Documentation ......................... SKIPPED
[INFO] Apache Atlas FileSystem Model ...................... SKIPPED
[INFO] Apache Atlas Plugin Classloader .................... SKIPPED
[INFO] Apache Atlas Hive Bridge Shim ...................... SKIPPED
[INFO] Apache Atlas Hive Bridge ........................... SKIPPED
[INFO] Apache Atlas Falcon Bridge Shim .................... SKIPPED
[INFO] Apache Atlas Falcon Bridge ......................... SKIPPED
[INFO] Apache Atlas Sqoop Bridge Shim ..................... SKIPPED
[INFO] Apache Atlas Sqoop Bridge .......................... SKIPPED
[INFO] Apache Atlas Storm Bridge Shim ..................... SKIPPED
[INFO] Apache Atlas Storm Bridge .......................... SKIPPED
[INFO] Apache Atlas Hbase Bridge Shim ..................... SKIPPED
[INFO] Apache Atlas Hbase Bridge .......................... SKIPPED
[INFO] Apache Atlas Kafka Bridge .......................... SKIPPED
[INFO] Apache Atlas Distribution .......................... SKIPPED
[INFO] ------------------------------------------------------------------------
[INFO] BUILD FAILURE
[INFO] ------------------------------------------------------------------------
[INFO] Total time: 07:25 min
[INFO] Finished at: 2018-06-05T21:50:30Z
[INFO] Final Memory: 162M/1910M
[INFO] ------------------------------------------------------------------------
[ERROR] Failed to execute goal org.apache.maven.plugins:maven-surefire-plugin:2.18.1:test
(default-test) on project atlas-repository: There are test failures.
[ERROR] 
[ERROR] Please refer to <https://builds.apache.org/job/PreCommit-ATLAS-Build-Test/ws/repository/target/surefire-reports>
for the individual test results.
[ERROR] -> [Help 1]
[ERROR] 
[ERROR] To see the full stack trace of the errors, re-run Maven with the -e switch.
[ERROR] Re-run Maven using the -X switch to enable full debug logging.
[ERROR] 
[ERROR] For more information about the errors and possible solutions, please read the following
articles:
[ERROR] [Help 1] http://cwiki.apache.org/confluence/display/MAVEN/MojoFailureException
[ERROR] 
[ERROR] After correcting the problems, you can resume the build with the command
[ERROR]   mvn <goals> -rf :atlas-repository




{color:red}-1 overall{color}.  

    {color:green}+1 @author{color}.  The patch does not contain any @author tags.

Console output: https://builds.apache.org/job/PreCommit-ATLAS-Build-Test/467//console

This message is automatically generated.


======================================================================
======================================================================
    Adding comment to Jira.
======================================================================
======================================================================




======================================================================
======================================================================
    Finished build.
======================================================================
======================================================================


+ EXIT_CODE=1
+ '[' -d <https://builds.apache.org/job/PreCommit-ATLAS-Build-Test/ws/../atlas_patchprocess_21226>
']'
+ '[' -d <https://builds.apache.org/job/PreCommit-ATLAS-Build-Test/ws/atlas_patchprocess_21226>
']'
+ mv <https://builds.apache.org/job/PreCommit-ATLAS-Build-Test/ws/atlas_patchprocess_21226>
<https://builds.apache.org/job/PreCommit-ATLAS-Build-Test/ws/patchprocess>
+ rm -f <https://builds.apache.org/job/PreCommit-ATLAS-Build-Test/ws/../atlas_patchprocess_21226>
+ exit 1
Build step 'Execute shell' marked build as failure
Set build name.
New build name is '#467-master-0001-ATLAS-2741-Deleted-entities-DSL-search-with-tag-does.patch'
Archiving artifacts

Mime
View raw message