atlas-dev mailing list archives

Site index · List index
Message view « Date » · « Thread »
Top « Date » · « Thread »
From Apache Jenkins Server <jenk...@builds.apache.org>
Subject Build failed in Jenkins: PreCommit-ATLAS-Build-Test #442-master-ATLAS-2714.patch
Date Wed, 23 May 2018 20:06:18 GMT
See <https://builds.apache.org/job/PreCommit-ATLAS-Build-Test/442/display/redirect>

------------------------------------------
[...truncated 228.21 KB...]
[INFO] <https://builds.apache.org/job/PreCommit-ATLAS-Build-Test/ws/repository/src/test/java/org/apache/atlas/repository/impexp/UniqueListTest.java>:
Recompile with -Xlint:unchecked for details.
[INFO] 
[INFO] --- maven-surefire-plugin:2.18.1:test (default-test) @ atlas-repository ---
[INFO] Surefire report directory: <https://builds.apache.org/job/PreCommit-ATLAS-Build-Test/ws/repository/target/surefire-reports>
[INFO] Using configured provider org.apache.maven.surefire.testng.TestNGProvider

-------------------------------------------------------
 T E S T S
-------------------------------------------------------
Running org.apache.atlas.glossary.GlossaryServiceTest
Running org.apache.atlas.utils.ObjectUpdateSynchronizerTest
Running org.apache.atlas.utils.TestResourceFileUtils
Running org.apache.atlas.repository.store.graph.v1.AtlasRelationshipDefStoreV1Test
Running org.apache.atlas.services.MetricsServiceTest
Running org.apache.atlas.repository.store.graph.v1.AtlasRelationshipStoreHardDeleteV1Test
Running org.apache.atlas.repository.impexp.ImportTransformerJSONTest
Running org.apache.atlas.query.DSLQueriesTest
Running org.apache.atlas.query.GremlinQueryComposerTest
Running org.apache.atlas.glossary.PaginationHelperTest
Running org.apache.atlas.repository.store.graph.v1.AtlasRelationshipStoreSoftDeleteV1Test
Running org.apache.atlas.repository.migration.HiveStocksTest
Running org.apache.atlas.repository.store.graph.v1.AtlasRelationshipStoreV1Test
Running org.apache.atlas.repository.impexp.ImportServiceTest
Running org.apache.atlas.repository.audit.CassandraAuditRepositoryTest
Running org.apache.atlas.repository.store.graph.AtlasTypeDefGraphStoreTest
Running org.apache.atlas.TestModules
Running org.apache.atlas.repository.store.graph.v1.AtlasEntityDefStoreV1Test
Running org.apache.atlas.repository.impexp.ImportTransformerTest
Running org.apache.atlas.repository.tagpropagation.ClassificationPropagationTest
Running org.apache.atlas.repository.migration.TypesWithCollectionsFinderTest
Running org.apache.atlas.query.DSLParsingTest
Running org.apache.atlas.repository.store.graph.v1.AtlasEntityStoreV1BulkImportPercentTest
Running org.apache.atlas.repository.store.graph.v1.InverseReferenceUpdateHardDeleteV1Test
Running org.apache.atlas.repository.store.graph.v1.AtlasEntityStoreV1Test
Running org.apache.atlas.repository.migration.MigrationProgressServiceTest
Running org.apache.atlas.repository.userprofile.UserProfileServiceTest
Running org.apache.atlas.repository.store.graph.v1.AtlasComplexAttributesTest
Running org.apache.atlas.repository.impexp.ZipSourceTest
Running org.apache.atlas.repository.migration.ComplexAttributesTest
Running org.apache.atlas.repository.impexp.TypeAttributeDifferenceTest
Running org.apache.atlas.repository.impexp.ExportServiceTest
Running org.apache.atlas.repository.migration.HiveParititionTest
Running org.apache.atlas.repository.audit.InMemoryAuditRepositoryTest
Running org.apache.atlas.repository.migration.PathTest
Running org.apache.atlas.repository.impexp.UniqueListTest
Running org.apache.atlas.repository.impexp.AtlasImportRequestTest
Running org.apache.atlas.repository.migration.RelationshipCacheGeneratorTest
Running org.apache.atlas.repository.store.graph.v1.InverseReferenceUpdateV1Test
Running org.apache.atlas.repository.impexp.ZipSinkTest
Running org.apache.atlas.repository.store.graph.v1.InverseReferenceUpdateSoftDeleteV1Test
Running org.apache.atlas.repository.impexp.ImportTransformsTest
Tests run: 0, Failures: 0, Errors: 0, Skipped: 0, Time elapsed: 1.46 sec - in org.apache.atlas.utils.TestResourceFileUtils
Tests run: 0, Failures: 0, Errors: 0, Skipped: 0, Time elapsed: 2.531 sec - in org.apache.atlas.TestModules
Tests run: 20, Failures: 0, Errors: 0, Skipped: 0, Time elapsed: 2.979 sec - in org.apache.atlas.glossary.PaginationHelperTest
Tests run: 0, Failures: 0, Errors: 0, Skipped: 0, Time elapsed: 2.93 sec - in org.apache.atlas.repository.store.graph.v1.AtlasRelationshipStoreV1Test
Tests run: 8, Failures: 0, Errors: 0, Skipped: 0, Time elapsed: 3.262 sec - in org.apache.atlas.repository.impexp.ImportTransformerTest
Tests run: 0, Failures: 0, Errors: 0, Skipped: 0, Time elapsed: 3.028 sec - in org.apache.atlas.repository.store.graph.v1.InverseReferenceUpdateV1Test
Tests run: 6, Failures: 0, Errors: 0, Skipped: 0, Time elapsed: 3.274 sec - in org.apache.atlas.repository.audit.InMemoryAuditRepositoryTest
Tests run: 4, Failures: 0, Errors: 0, Skipped: 0, Time elapsed: 3.22 sec - in org.apache.atlas.repository.impexp.UniqueListTest
Tests run: 1, Failures: 0, Errors: 0, Skipped: 0, Time elapsed: 4.765 sec - in org.apache.atlas.repository.impexp.ImportTransformerJSONTest
Tests run: 9, Failures: 0, Errors: 0, Skipped: 0, Time elapsed: 5.162 sec - in org.apache.atlas.utils.ObjectUpdateSynchronizerTest
Tests run: 6, Failures: 0, Errors: 0, Skipped: 0, Time elapsed: 4.753 sec - in org.apache.atlas.repository.impexp.TypeAttributeDifferenceTest
Tests run: 9, Failures: 0, Errors: 0, Skipped: 0, Time elapsed: 4.983 sec - in org.apache.atlas.repository.store.graph.v1.AtlasEntityStoreV1BulkImportPercentTest
Tests run: 3, Failures: 0, Errors: 0, Skipped: 0, Time elapsed: 4.249 sec - in org.apache.atlas.repository.impexp.ImportTransformsTest
Tests run: 8, Failures: 0, Errors: 0, Skipped: 0, Time elapsed: 5.518 sec - in org.apache.atlas.query.DSLParsingTest
Tests run: 4, Failures: 0, Errors: 0, Skipped: 0, Time elapsed: 5.477 sec - in org.apache.atlas.repository.migration.MigrationProgressServiceTest
Tests run: 8, Failures: 0, Errors: 0, Skipped: 0, Time elapsed: 5.143 sec - in org.apache.atlas.repository.impexp.ZipSinkTest
Tests run: 6, Failures: 0, Errors: 0, Skipped: 0, Time elapsed: 5.359 sec - in org.apache.atlas.repository.impexp.AtlasImportRequestTest
Tests run: 6, Failures: 0, Errors: 0, Skipped: 0, Time elapsed: 5.773 sec - in org.apache.atlas.repository.impexp.ZipSourceTest
Tests run: 39, Failures: 0, Errors: 0, Skipped: 0, Time elapsed: 10.701 sec - in org.apache.atlas.query.GremlinQueryComposerTest
Tests run: 7, Failures: 0, Errors: 0, Skipped: 7, Time elapsed: 18.378 sec - in org.apache.atlas.repository.audit.CassandraAuditRepositoryTest
Tests run: 1, Failures: 0, Errors: 0, Skipped: 0, Time elapsed: 38.556 sec - in org.apache.atlas.services.MetricsServiceTest
Tests run: 10, Failures: 0, Errors: 0, Skipped: 0, Time elapsed: 65.689 sec - in org.apache.atlas.repository.store.graph.v1.AtlasRelationshipDefStoreV1Test
Tests run: 1, Failures: 0, Errors: 0, Skipped: 0, Time elapsed: 67.222 sec - in org.apache.atlas.repository.store.graph.v1.AtlasEntityDefStoreV1Test
Tests run: 1, Failures: 0, Errors: 0, Skipped: 0, Time elapsed: 75.445 sec - in org.apache.atlas.repository.migration.RelationshipCacheGeneratorTest
Tests run: 1, Failures: 0, Errors: 0, Skipped: 0, Time elapsed: 85.081 sec - in org.apache.atlas.repository.migration.TypesWithCollectionsFinderTest
Tests run: 5, Failures: 0, Errors: 0, Skipped: 0, Time elapsed: 86.683 sec - in org.apache.atlas.repository.store.graph.v1.InverseReferenceUpdateHardDeleteV1Test
Tests run: 7, Failures: 0, Errors: 0, Skipped: 0, Time elapsed: 87.591 sec - in org.apache.atlas.repository.store.graph.v1.AtlasComplexAttributesTest
Tests run: 12, Failures: 0, Errors: 0, Skipped: 0, Time elapsed: 89.543 sec - in org.apache.atlas.repository.impexp.ExportServiceTest
Tests run: 4, Failures: 0, Errors: 0, Skipped: 0, Time elapsed: 90.797 sec - in org.apache.atlas.repository.store.graph.v1.AtlasRelationshipStoreHardDeleteV1Test
Tests run: 4, Failures: 0, Errors: 0, Skipped: 0, Time elapsed: 91.762 sec - in org.apache.atlas.repository.store.graph.v1.AtlasRelationshipStoreSoftDeleteV1Test
Tests run: 5, Failures: 0, Errors: 0, Skipped: 0, Time elapsed: 91.154 sec - in org.apache.atlas.repository.store.graph.v1.InverseReferenceUpdateSoftDeleteV1Test
Tests run: 12, Failures: 0, Errors: 0, Skipped: 0, Time elapsed: 92.787 sec - in org.apache.atlas.repository.userprofile.UserProfileServiceTest
Tests run: 35, Failures: 0, Errors: 0, Skipped: 0, Time elapsed: 94.336 sec - in org.apache.atlas.glossary.GlossaryServiceTest
Tests run: 18, Failures: 0, Errors: 0, Skipped: 0, Time elapsed: 98.812 sec - in org.apache.atlas.repository.store.graph.AtlasTypeDefGraphStoreTest
Tests run: 16, Failures: 0, Errors: 0, Skipped: 0, Time elapsed: 103.062 sec - in org.apache.atlas.repository.store.graph.v1.AtlasEntityStoreV1Test
Tests run: 1, Failures: 1, Errors: 0, Skipped: 0, Time elapsed: 101.509 sec <<< FAILURE!
- in org.apache.atlas.repository.migration.ComplexAttributesTest
verify(org.apache.atlas.repository.migration.ComplexAttributesTest)  Time elapsed: 39.134
sec  <<< FAILURE!
java.lang.AssertionError: expected [214] but found [215]
	at org.testng.Assert.fail(Assert.java:94)
	at org.testng.Assert.failNotEquals(Assert.java:496)
	at org.testng.Assert.assertEquals(Assert.java:125)
	at org.testng.Assert.assertEquals(Assert.java:267)
	at org.testng.Assert.assertEquals(Assert.java:277)
	at org.apache.atlas.repository.migration.MigrationBaseAsserts.assertMigrationStatus(MigrationBaseAsserts.java:194)
	at org.apache.atlas.repository.migration.ComplexAttributesTest.verify(ComplexAttributesTest.java:59)

Tests run: 1, Failures: 1, Errors: 0, Skipped: 0, Time elapsed: 105.863 sec <<< FAILURE!
- in org.apache.atlas.repository.migration.HiveStocksTest
migrateStocks(org.apache.atlas.repository.migration.HiveStocksTest)  Time elapsed: 42.772
sec  <<< FAILURE!
java.lang.AssertionError: expected [188] but found [189]
	at org.testng.Assert.fail(Assert.java:94)
	at org.testng.Assert.failNotEquals(Assert.java:496)
	at org.testng.Assert.assertEquals(Assert.java:125)
	at org.testng.Assert.assertEquals(Assert.java:267)
	at org.testng.Assert.assertEquals(Assert.java:277)
	at org.apache.atlas.repository.migration.MigrationBaseAsserts.assertMigrationStatus(MigrationBaseAsserts.java:194)
	at org.apache.atlas.repository.migration.HiveStocksTest.migrateStocks(HiveStocksTest.java:65)

Tests run: 1, Failures: 1, Errors: 0, Skipped: 0, Time elapsed: 106.233 sec <<< FAILURE!
- in org.apache.atlas.repository.migration.HiveParititionTest
fileImporterTest(org.apache.atlas.repository.migration.HiveParititionTest)  Time elapsed:
40.145 sec  <<< FAILURE!
java.lang.AssertionError: expected [141] but found [142]
	at org.testng.Assert.fail(Assert.java:94)
	at org.testng.Assert.failNotEquals(Assert.java:496)
	at org.testng.Assert.assertEquals(Assert.java:125)
	at org.testng.Assert.assertEquals(Assert.java:267)
	at org.testng.Assert.assertEquals(Assert.java:277)
	at org.apache.atlas.repository.migration.MigrationBaseAsserts.assertMigrationStatus(MigrationBaseAsserts.java:194)
	at org.apache.atlas.repository.migration.HiveParititionTest.fileImporterTest(HiveParititionTest.java:57)

Tests run: 1, Failures: 1, Errors: 0, Skipped: 0, Time elapsed: 107.08 sec <<< FAILURE!
- in org.apache.atlas.repository.migration.PathTest
migrationImport(org.apache.atlas.repository.migration.PathTest)  Time elapsed: 40.472 sec
 <<< FAILURE!
java.lang.AssertionError: expected [89] but found [90]
	at org.testng.Assert.fail(Assert.java:94)
	at org.testng.Assert.failNotEquals(Assert.java:496)
	at org.testng.Assert.assertEquals(Assert.java:125)
	at org.testng.Assert.assertEquals(Assert.java:267)
	at org.testng.Assert.assertEquals(Assert.java:277)
	at org.apache.atlas.repository.migration.MigrationBaseAsserts.assertMigrationStatus(MigrationBaseAsserts.java:194)
	at org.apache.atlas.repository.migration.PathTest.migrationImport(PathTest.java:53)

Tests run: 14, Failures: 0, Errors: 0, Skipped: 0, Time elapsed: 114.389 sec - in org.apache.atlas.repository.impexp.ImportServiceTest
Tests run: 9, Failures: 0, Errors: 0, Skipped: 0, Time elapsed: 119.469 sec - in org.apache.atlas.repository.tagpropagation.ClassificationPropagationTest
Tests run: 246, Failures: 0, Errors: 0, Skipped: 0, Time elapsed: 162.833 sec - in org.apache.atlas.query.DSLQueriesTest

Results :

Failed tests: 
  ComplexAttributesTest.verify:59->MigrationBaseAsserts.assertMigrationStatus:194 expected
[214] but found [215]
  HiveParititionTest.fileImporterTest:57->MigrationBaseAsserts.assertMigrationStatus:194
expected [141] but found [142]
  HiveStocksTest.migrateStocks:65->MigrationBaseAsserts.assertMigrationStatus:194 expected
[188] but found [189]
  PathTest.migrationImport:53->MigrationBaseAsserts.assertMigrationStatus:194 expected
[89] but found [90]

Tests run: 549, Failures: 4, Errors: 0, Skipped: 7

[INFO] ------------------------------------------------------------------------
[INFO] Reactor Summary:
[INFO] 
[INFO] Apache Atlas Server Build Tools .................... SUCCESS [  0.857 s]
[INFO] apache-atlas ....................................... SUCCESS [  3.755 s]
[INFO] Apache Atlas Test Utility Tools .................... SUCCESS [  5.367 s]
[INFO] Open Connector Framework (OCF) ..................... SUCCESS [  2.012 s]
[INFO] Open Metadata Repository Services (OMRS) ........... SUCCESS [  8.109 s]
[INFO] Open Metadata and Governance (OMAG) Server APIs .... SUCCESS [  1.096 s]
[INFO] Connected Asset Open Metadata Access Service (OMAS)  SUCCESS [  1.479 s]
[INFO] Asset Consumer Open Metadata Access Service (OMAS) . SUCCESS [  0.962 s]
[INFO] Open Metadata and Governance (OMAG) Server ......... SUCCESS [  1.242 s]
[INFO] Apache Atlas Integration ........................... SUCCESS [ 33.506 s]
[INFO] Apache Atlas Common ................................ SUCCESS [  2.433 s]
[INFO] Apache Atlas Client ................................ SUCCESS [  0.174 s]
[INFO] atlas-client-common ................................ SUCCESS [  1.007 s]
[INFO] atlas-client-v1 .................................... SUCCESS [  3.481 s]
[INFO] Apache Atlas Server API ............................ SUCCESS [  0.773 s]
[INFO] Apache Atlas Notification .......................... SUCCESS [ 17.081 s]
[INFO] atlas-client-v2 .................................... SUCCESS [  0.747 s]
[INFO] Apache Atlas Graph Database Projects ............... SUCCESS [  0.110 s]
[INFO] Apache Atlas Graph Database API .................... SUCCESS [  1.279 s]
[INFO] Graph Database Common Code ......................... SUCCESS [  0.733 s]
[INFO] Apache Atlas JanusGraph DB Impl .................... SUCCESS [02:24 min]
[INFO] Apache Atlas Graph Database Implementation Dependencies SUCCESS [  2.142 s]
[INFO] Shaded version of Apache hbase client .............. SUCCESS [  8.591 s]
[INFO] Shaded version of Apache hbase server .............. SUCCESS [ 21.971 s]
[INFO] Apache Atlas Authorization ......................... SUCCESS [  2.581 s]
[INFO] Apache Atlas Repository ............................ FAILURE [02:53 min]
[INFO] Apache Atlas UI .................................... SKIPPED
[INFO] Apache Atlas Web Application ....................... SKIPPED
[INFO] Apache Atlas Documentation ......................... SKIPPED
[INFO] Apache Atlas FileSystem Model ...................... SKIPPED
[INFO] Apache Atlas Plugin Classloader .................... SKIPPED
[INFO] Apache Atlas Hive Bridge Shim ...................... SKIPPED
[INFO] Apache Atlas Hive Bridge ........................... SKIPPED
[INFO] Apache Atlas Falcon Bridge Shim .................... SKIPPED
[INFO] Apache Atlas Falcon Bridge ......................... SKIPPED
[INFO] Apache Atlas Sqoop Bridge Shim ..................... SKIPPED
[INFO] Apache Atlas Sqoop Bridge .......................... SKIPPED
[INFO] Apache Atlas Storm Bridge Shim ..................... SKIPPED
[INFO] Apache Atlas Storm Bridge .......................... SKIPPED
[INFO] Apache Atlas Hbase Bridge Shim ..................... SKIPPED
[INFO] Apache Atlas Hbase Bridge .......................... SKIPPED
[INFO] Apache Atlas Kafka Bridge .......................... SKIPPED
[INFO] Apache Atlas Distribution .......................... SKIPPED
[INFO] ------------------------------------------------------------------------
[INFO] BUILD FAILURE
[INFO] ------------------------------------------------------------------------
[INFO] Total time: 07:20 min
[INFO] Finished at: 2018-05-23T20:06:16Z
[INFO] Final Memory: 150M/2272M
[INFO] ------------------------------------------------------------------------
[ERROR] Failed to execute goal org.apache.maven.plugins:maven-surefire-plugin:2.18.1:test
(default-test) on project atlas-repository: There are test failures.
[ERROR] 
[ERROR] Please refer to <https://builds.apache.org/job/PreCommit-ATLAS-Build-Test/ws/repository/target/surefire-reports>
for the individual test results.
[ERROR] -> [Help 1]
[ERROR] 
[ERROR] To see the full stack trace of the errors, re-run Maven with the -e switch.
[ERROR] Re-run Maven using the -X switch to enable full debug logging.
[ERROR] 
[ERROR] For more information about the errors and possible solutions, please read the following
articles:
[ERROR] [Help 1] http://cwiki.apache.org/confluence/display/MAVEN/MojoFailureException
[ERROR] 
[ERROR] After correcting the problems, you can resume the build with the command
[ERROR]   mvn <goals> -rf :atlas-repository




{color:red}-1 overall{color}.  

    {color:green}+1 @author{color}.  The patch does not contain any @author tags.

Console output: https://builds.apache.org/job/PreCommit-ATLAS-Build-Test/442//console

This message is automatically generated.


======================================================================
======================================================================
    Adding comment to Jira.
======================================================================
======================================================================




======================================================================
======================================================================
    Finished build.
======================================================================
======================================================================


+ EXIT_CODE=1
+ '[' -d <https://builds.apache.org/job/PreCommit-ATLAS-Build-Test/ws/../atlas_patchprocess_29814>
']'
+ '[' -d <https://builds.apache.org/job/PreCommit-ATLAS-Build-Test/ws/atlas_patchprocess_29814>
']'
+ mv <https://builds.apache.org/job/PreCommit-ATLAS-Build-Test/ws/atlas_patchprocess_29814>
<https://builds.apache.org/job/PreCommit-ATLAS-Build-Test/ws/patchprocess>
+ rm -f <https://builds.apache.org/job/PreCommit-ATLAS-Build-Test/ws/../atlas_patchprocess_29814>
+ exit 1
Build step 'Execute shell' marked build as failure
Set build name.
New build name is '#442-master-ATLAS-2714.patch'
Archiving artifacts

Mime
View raw message