atlas-dev mailing list archives

Site index · List index
Message view « Date » · « Thread »
Top « Date » · « Thread »
From Apache Jenkins Server <jenk...@builds.apache.org>
Subject Build failed in Jenkins: PreCommit-ATLAS-Build-Test #337-master-0001-jceks-change.patch
Date Thu, 03 May 2018 12:03:37 GMT
See <https://builds.apache.org/job/PreCommit-ATLAS-Build-Test/337/display/redirect>

------------------------------------------
[...truncated 445.20 KB...]
127.0.0.1 - - [03/May/2018:12:02:43 +0000] "DELETE //localhost:31000/api/atlas/v2/entity/guid/random/classification/blah_trait
HTTP/1.1" 400 105 "-" "Java/1.8.0_172"
127.0.0.1 - - [03/May/2018:12:02:43 +0000] "GET //localhost:31000/api/atlas/discovery/search/dsl?query=hive_db_v2+where+name%3D'dbJiOzHIzJNb'&limit=10&offset=0
HTTP/1.1" 200 1658 "-" "Java/1.8.0_172"
127.0.0.1 - - [03/May/2018:12:02:44 +0000] "GET //localhost:31000/api/atlas/discovery/search/dsl?query=hive_db_v2+where+name%3D'dbJiOzHIzJNb'&limit=10&offset=0
HTTP/1.1" 200 1658 "-" "Java/1.8.0_172"
127.0.0.1 - - [03/May/2018:12:02:44 +0000] "POST //localhost:31000/api/atlas/v2/entity/ HTTP/1.1"
200 387 "-" "Java/1.8.0_172"
127.0.0.1 - - [03/May/2018:12:02:45 +0000] "GET //localhost:31000/api/atlas/discovery/search/dsl?query=hive_db_v2+where+name%3D'dbJiOzHIzJNb'&limit=10&offset=0
HTTP/1.1" 200 2726 "-" "Java/1.8.0_172"
127.0.0.1 - - [03/May/2018:12:02:45 +0000] "POST //localhost:31000/api/atlas/v2/types/typedefs/
HTTP/1.1" 200 532 "-" "Java/1.8.0_172"
127.0.0.1 - - [03/May/2018:12:02:45 +0000] "POST //localhost:31000/api/atlas/v2/entity/ HTTP/1.1"
200 237 "-" "Java/1.8.0_172"
127.0.0.1 - - [03/May/2018:12:02:45 +0000] "PUT //localhost:31000/api/atlas/v2/types/typedefs/
HTTP/1.1" 200 691 "-" "Java/1.8.0_172"
127.0.0.1 - - [03/May/2018:12:02:45 +0000] "GET //localhost:31000/api/atlas/v2/entity/guid/08fefdec-18c6-44f5-aead-d27c46049178
HTTP/1.1" 200 282 "-" "Java/1.8.0_172"
127.0.0.1 - - [03/May/2018:12:02:45 +0000] "POST //localhost:31000/api/atlas/v2/entity/ HTTP/1.1"
404 181 "-" "Java/1.8.0_172"
127.0.0.1 - - [03/May/2018:12:02:45 +0000] "POST //localhost:31000/api/atlas/v2/entity/ HTTP/1.1"
200 237 "-" "Java/1.8.0_172"
127.0.0.1 - - [03/May/2018:12:02:45 +0000] "POST //localhost:31000/api/atlas/v2/entity/ HTTP/1.1"
200 178 "-" "Java/1.8.0_172"
127.0.0.1 - - [03/May/2018:12:02:46 +0000] "GET //localhost:31000/api/atlas/v2/entity/uniqueAttribute/type/hive_db_v2?attr:name=dbJiOzHIzJNb
HTTP/1.1" 200 3537 "-" "Java/1.8.0_172"
127.0.0.1 - - [03/May/2018:12:02:46 +0000] "GET //localhost:31000/api/atlas/v2/entity/guid/blah
HTTP/1.1" 404 95 "-" "Java/1.8.0_172"
127.0.0.1 - - [03/May/2018:12:02:46 +0000] "POST //localhost:31000/api/atlas/v2/entity/ HTTP/1.1"
200 237 "-" "Java/1.8.0_172"
127.0.0.1 - - [03/May/2018:12:02:46 +0000] "GET //localhost:31000/api/atlas/entities/a36b910b-9e06-40a3-9d19-bf3f3637ed17/audit?count=10
HTTP/1.1" 200 952 "-" "Java/1.8.0_172"
127.0.0.1 - - [03/May/2018:12:02:46 +0000] "POST //localhost:31000/api/atlas/v2/entity/ HTTP/1.1"
200 239 "-" "Java/1.8.0_172"
127.0.0.1 - - [03/May/2018:12:02:46 +0000] "POST //localhost:31000/api/atlas/v2/entity/ HTTP/1.1"
200 392 "-" "Java/1.8.0_172"
127.0.0.1 - - [03/May/2018:12:02:46 +0000] "GET //localhost:31000/api/atlas/v2/types/typedef/name/e3RMAVFzww
HTTP/1.1" 404 87 "-" "Java/1.8.0_172"
127.0.0.1 - - [03/May/2018:12:02:46 +0000] "POST //localhost:31000/api/atlas/v2/types/typedefs/
HTTP/1.1" 200 557 "-" "Java/1.8.0_172"
127.0.0.1 - - [03/May/2018:12:02:47 +0000] "POST //localhost:31000/api/atlas/v2/entity/ HTTP/1.1"
200 282 "-" "Java/1.8.0_172"
127.0.0.1 - - [03/May/2018:12:02:47 +0000] "GET //localhost:31000/api/atlas/v2/entity/guid/4d17dc13-d176-48a5-94cd-976c2577d08e
HTTP/1.1" 200 308 "-" "Java/1.8.0_172"
127.0.0.1 - - [03/May/2018:12:02:47 +0000] "GET //localhost:31000/api/atlas/types/database
HTTP/1.1" 200 748 "-" "Java/1.8.0_172"
127.0.0.1 - - [03/May/2018:12:02:47 +0000] "GET //localhost:31000/api/atlas/types/table HTTP/1.1"
200 1725 "-" "Java/1.8.0_172"
127.0.0.1 - - [03/May/2018:12:02:47 +0000] "GET //localhost:31000/api/atlas/types/fetl HTTP/1.1"
200 539 "-" "Java/1.8.0_172"
127.0.0.1 - - [03/May/2018:12:02:47 +0000] "GET //localhost:31000/api/atlas/types HTTP/1.1"
200 2408 "-" "Java/1.8.0_172"
127.0.0.1 - - [03/May/2018:12:02:47 +0000] "GET //localhost:31000/api/atlas/v2/entity/guid/421cd8a1-4658-4821-8856-1eced56694f4
HTTP/1.1" 200 1506 "-" "Java/1.8.0_172"
127.0.0.1 - - [03/May/2018:12:02:47 +0000] "POST //localhost:31000/api/atlas/v2/entity/ HTTP/1.1"
200 195 "-" "Java/1.8.0_172"
127.0.0.1 - - [03/May/2018:12:02:47 +0000] "GET //localhost:31000/api/atlas/v2/entity/guid/421cd8a1-4658-4821-8856-1eced56694f4
HTTP/1.1" 200 1524 "-" "Java/1.8.0_172"
127.0.0.1 - - [03/May/2018:12:02:47 +0000] "GET //localhost:31000/api/atlas/v2/entity/guid/421cd8a1-4658-4821-8856-1eced56694f4
HTTP/1.1" 200 1524 "-" "Java/1.8.0_172"
127.0.0.1 - - [03/May/2018:12:02:47 +0000] "POST //localhost:31000/api/atlas/v2/entity/ HTTP/1.1"
200 195 "-" "Java/1.8.0_172"
127.0.0.1 - - [03/May/2018:12:02:47 +0000] "GET //localhost:31000/api/atlas/v2/entity/guid/421cd8a1-4658-4821-8856-1eced56694f4
HTTP/1.1" 200 1536 "-" "Java/1.8.0_172"
127.0.0.1 - - [03/May/2018:12:02:47 +0000] "GET //localhost:31000/api/atlas/v2/entity/guid/421cd8a1-4658-4821-8856-1eced56694f4
HTTP/1.1" 200 1536 "-" "Java/1.8.0_172"
127.0.0.1 - - [03/May/2018:12:02:47 +0000] "POST //localhost:31000/api/atlas/v2/entity/ HTTP/1.1"
200 513 "-" "Java/1.8.0_172"
127.0.0.1 - - [03/May/2018:12:02:47 +0000] "GET //localhost:31000/api/atlas/v2/entity/guid/421cd8a1-4658-4821-8856-1eced56694f4
HTTP/1.1" 200 1674 "-" "Java/1.8.0_172"
127.0.0.1 - - [03/May/2018:12:02:47 +0000] "GET //localhost:31000/api/atlas/v2/types/typedef/name/PII_TraitFMcWDabi3W
HTTP/1.1" 404 96 "-" "Java/1.8.0_172"
127.0.0.1 - - [03/May/2018:12:02:47 +0000] "POST //localhost:31000/api/atlas/v2/types/typedefs/
HTTP/1.1" 200 576 "-" "Java/1.8.0_172"
127.0.0.1 - - [03/May/2018:12:02:47 +0000] "DELETE //localhost:31000/api/atlas/v2/entity/guid/421cd8a1-4658-4821-8856-1eced56694f4/classification/PII_TraitFMcWDabi3W
HTTP/1.1" 400 114 "-" "Java/1.8.0_172"
127.0.0.1 - - [03/May/2018:12:02:47 +0000] "GET //localhost:31000/api/atlas/v2/types/typedef/name/PII_TraitNTAB965BZn
HTTP/1.1" 404 96 "-" "Java/1.8.0_172"
127.0.0.1 - - [03/May/2018:12:02:47 +0000] "POST //localhost:31000/api/atlas/v2/types/typedefs/
HTTP/1.1" 200 425 "-" "Java/1.8.0_172"
127.0.0.1 - - [03/May/2018:12:02:47 +0000] "GET //localhost:31000/api/atlas/v2/types/classificationdef/name/PII_TraitNTAB965BZn
HTTP/1.1" 200 332 "-" "Java/1.8.0_172"
127.0.0.1 - - [03/May/2018:12:02:47 +0000] "POST //localhost:31000/api/atlas/v2/entity/guid/421cd8a1-4658-4821-8856-1eced56694f4/classifications
HTTP/1.1" 204 0 "-" "Java/1.8.0_172"
127.0.0.1 - - [03/May/2018:12:02:48 +0000] "GET //localhost:31000/api/atlas/v2/entity/guid/421cd8a1-4658-4821-8856-1eced56694f4/classifications
HTTP/1.1" 200 868 "-" "Java/1.8.0_172"
127.0.0.1 - - [03/May/2018:12:02:48 +0000] "GET //localhost:31000/api/atlas/v2/entity/guid/421cd8a1-4658-4821-8856-1eced56694f4/classifications
HTTP/1.1" 200 868 "-" "Java/1.8.0_172"
127.0.0.1 - - [03/May/2018:12:02:48 +0000] "POST //localhost:31000/api/atlas/v2/entity/ HTTP/1.1"
200 359 "-" "Java/1.8.0_172"
127.0.0.1 - - [03/May/2018:12:02:48 +0000] "GET //localhost:31000/api/atlas/v2/entity/guid/421cd8a1-4658-4821-8856-1eced56694f4
HTTP/1.1" 200 1854 "-" "Java/1.8.0_172"
127.0.0.1 - - [03/May/2018:12:02:48 +0000] "PUT //localhost:31000/api/atlas/v2/entity/uniqueAttribute/type/hive_table_v2?attr:qualifiedName=tableLK0xAUOz3S
HTTP/1.1" 200 510 "-" "Java/1.8.0_172"
127.0.0.1 - - [03/May/2018:12:02:48 +0000] "GET //localhost:31000/api/atlas/v2/entity/guid/421cd8a1-4658-4821-8856-1eced56694f4
HTTP/1.1" 200 1930 "-" "Java/1.8.0_172"
127.0.0.1 - - [03/May/2018:12:03:07 +0000] "GET //localhost:31000/api/atlas/v2/types/typedef/name/PII_Traity5zMUUpwk7
HTTP/1.1" 404 96 "-" "Java/1.8.0_172"
127.0.0.1 - - [03/May/2018:12:03:07 +0000] "POST //localhost:31000/api/atlas/v2/types/typedefs/
HTTP/1.1" 200 425 "-" "Java/1.8.0_172"
127.0.0.1 - - [03/May/2018:12:03:07 +0000] "POST //localhost:31000/api/atlas/v2/entity/guid/421cd8a1-4658-4821-8856-1eced56694f4/classifications
HTTP/1.1" 204 0 "-" "Java/1.8.0_172"
127.0.0.1 - - [03/May/2018:12:03:07 +0000] "GET //localhost:31000/api/atlas/entities/421cd8a1-4658-4821-8856-1eced56694f4/audit?count=100
HTTP/1.1" 200 21391 "-" "Java/1.8.0_172"
127.0.0.1 - - [03/May/2018:12:03:07 +0000] "GET //localhost:31000/api/atlas/v2/types/typedef/name/PII_TraitOUuxs33apG
HTTP/1.1" 404 96 "-" "Java/1.8.0_172"
127.0.0.1 - - [03/May/2018:12:03:07 +0000] "POST //localhost:31000/api/atlas/v2/types/typedefs/
HTTP/1.1" 200 576 "-" "Java/1.8.0_172"
127.0.0.1 - - [03/May/2018:12:03:08 +0000] "POST //localhost:31000/api/atlas/v2/entity/guid/421cd8a1-4658-4821-8856-1eced56694f4/classifications
HTTP/1.1" 204 0 "-" "Java/1.8.0_172"
127.0.0.1 - - [03/May/2018:12:03:08 +0000] "GET //localhost:31000/api/atlas/v2/entity/guid/421cd8a1-4658-4821-8856-1eced56694f4
HTTP/1.1" 200 2166 "-" "Java/1.8.0_172"
127.0.0.1 - - [03/May/2018:12:03:08 +0000] "GET //localhost:31000/api/atlas/v2/types/typedef/name/PII_TraitJeXkHFymtf
HTTP/1.1" 404 96 "-" "Java/1.8.0_172"
127.0.0.1 - - [03/May/2018:12:03:08 +0000] "POST //localhost:31000/api/atlas/v2/types/typedefs/
HTTP/1.1" 200 425 "-" "Java/1.8.0_172"
127.0.0.1 - - [03/May/2018:12:03:08 +0000] "POST //localhost:31000/api/atlas/v2/entity/guid/421cd8a1-4658-4821-8856-1eced56694f4/classifications
HTTP/1.1" 204 0 "-" "Java/1.8.0_172"
127.0.0.1 - - [03/May/2018:12:03:09 +0000] "GET //localhost:31000/api/atlas/entities/421cd8a1-4658-4821-8856-1eced56694f4/audit?count=100
HTTP/1.1" 200 22089 "-" "Java/1.8.0_172"
127.0.0.1 - - [03/May/2018:12:03:09 +0000] "GET //localhost:31000/api/atlas/v2/entity/guid/421cd8a1-4658-4821-8856-1eced56694f4/classifications
HTTP/1.1" 200 1315 "-" "Java/1.8.0_172"
127.0.0.1 - - [03/May/2018:12:03:09 +0000] "DELETE //localhost:31000/api/atlas/v2/entity/guid/421cd8a1-4658-4821-8856-1eced56694f4/classification/PII_TraitJeXkHFymtf
HTTP/1.1" 204 0 "-" "Java/1.8.0_172"
127.0.0.1 - - [03/May/2018:12:03:09 +0000] "GET //localhost:31000/api/atlas/entities/421cd8a1-4658-4821-8856-1eced56694f4/audit?count=100
HTTP/1.1" 200 22320 "-" "Java/1.8.0_172"
Tests run: 123, Failures: 4, Errors: 0, Skipped: 0, Time elapsed: 156.607 sec <<<
FAILURE! - in TestSuite
testEnterEmptyValues(org.apache.atlas.CredentialProviderUtilityIT)  Time elapsed: 0.857 sec
 <<< FAILURE!
java.io.IOException: Invalid secret key format
	at com.sun.crypto.provider.JceKeyStore.engineLoad(JceKeyStore.java:856)
	at java.security.KeyStore.load(KeyStore.java:1445)
	at org.apache.hadoop.security.alias.AbstractJavaKeyStoreProvider.<init>(AbstractJavaKeyStoreProvider.java:106)
	at org.apache.hadoop.security.alias.JavaKeyStoreProvider.<init>(JavaKeyStoreProvider.java:49)
	at org.apache.hadoop.security.alias.JavaKeyStoreProvider.<init>(JavaKeyStoreProvider.java:41)
	at org.apache.hadoop.security.alias.JavaKeyStoreProvider$Factory.createProvider(JavaKeyStoreProvider.java:100)
	at org.apache.hadoop.security.alias.CredentialProviderFactory.getProviders(CredentialProviderFactory.java:58)
	at org.apache.atlas.CredentialProviderUtilityIT.testEnterEmptyValues(CredentialProviderUtilityIT.java:138)

testEnterMismatchedValues(org.apache.atlas.CredentialProviderUtilityIT)  Time elapsed: 0.576
sec  <<< FAILURE!
java.io.IOException: Invalid secret key format
	at com.sun.crypto.provider.JceKeyStore.engineLoad(JceKeyStore.java:856)
	at java.security.KeyStore.load(KeyStore.java:1445)
	at org.apache.hadoop.security.alias.AbstractJavaKeyStoreProvider.<init>(AbstractJavaKeyStoreProvider.java:106)
	at org.apache.hadoop.security.alias.JavaKeyStoreProvider.<init>(JavaKeyStoreProvider.java:49)
	at org.apache.hadoop.security.alias.JavaKeyStoreProvider.<init>(JavaKeyStoreProvider.java:41)
	at org.apache.hadoop.security.alias.JavaKeyStoreProvider$Factory.createProvider(JavaKeyStoreProvider.java:100)
	at org.apache.hadoop.security.alias.CredentialProviderFactory.getProviders(CredentialProviderFactory.java:58)
	at org.apache.atlas.CredentialProviderUtilityIT.testEnterMismatchedValues(CredentialProviderUtilityIT.java:192)

testEnterValidValues(org.apache.atlas.CredentialProviderUtilityIT)  Time elapsed: 0.571 sec
 <<< FAILURE!
java.io.IOException: Invalid secret key format
	at com.sun.crypto.provider.JceKeyStore.engineLoad(JceKeyStore.java:856)
	at java.security.KeyStore.load(KeyStore.java:1445)
	at org.apache.hadoop.security.alias.AbstractJavaKeyStoreProvider.<init>(AbstractJavaKeyStoreProvider.java:106)
	at org.apache.hadoop.security.alias.JavaKeyStoreProvider.<init>(JavaKeyStoreProvider.java:49)
	at org.apache.hadoop.security.alias.JavaKeyStoreProvider.<init>(JavaKeyStoreProvider.java:41)
	at org.apache.hadoop.security.alias.JavaKeyStoreProvider$Factory.createProvider(JavaKeyStoreProvider.java:100)
	at org.apache.hadoop.security.alias.CredentialProviderFactory.getProviders(CredentialProviderFactory.java:58)
	at org.apache.atlas.CredentialProviderUtilityIT.testEnterValidValues(CredentialProviderUtilityIT.java:76)

testOverwriteValues(org.apache.atlas.CredentialProviderUtilityIT)  Time elapsed: 0.581 sec
 <<< FAILURE!
java.io.IOException: Invalid secret key format
	at com.sun.crypto.provider.JceKeyStore.engineLoad(JceKeyStore.java:856)
	at java.security.KeyStore.load(KeyStore.java:1445)
	at org.apache.hadoop.security.alias.AbstractJavaKeyStoreProvider.<init>(AbstractJavaKeyStoreProvider.java:106)
	at org.apache.hadoop.security.alias.JavaKeyStoreProvider.<init>(JavaKeyStoreProvider.java:49)
	at org.apache.hadoop.security.alias.JavaKeyStoreProvider.<init>(JavaKeyStoreProvider.java:41)
	at org.apache.hadoop.security.alias.JavaKeyStoreProvider$Factory.createProvider(JavaKeyStoreProvider.java:100)
	at org.apache.hadoop.security.alias.CredentialProviderFactory.getProviders(CredentialProviderFactory.java:58)
	at org.apache.atlas.util.CredentialProviderUtility.getCredentialProvider(CredentialProviderUtility.java:150)
	at org.apache.atlas.util.CredentialProviderUtility.main(CredentialProviderUtility.java:75)
	at org.apache.atlas.CredentialProviderUtilityIT.testOverwriteValues(CredentialProviderUtilityIT.java:251)


Results :

Failed tests: 
  CredentialProviderUtilityIT.testEnterEmptyValues:138 » IO Invalid secret key f...
  CredentialProviderUtilityIT.testEnterMismatchedValues:192 » IO Invalid secret ...
  CredentialProviderUtilityIT.testEnterValidValues:76 » IO Invalid secret key fo...
  CredentialProviderUtilityIT.testOverwriteValues:251 » IO Invalid secret key fo...

Tests run: 123, Failures: 4, Errors: 0, Skipped: 0

[INFO] 
[INFO] --- jetty-maven-plugin:9.3.14.v20161028:stop (stop-jetty) @ atlas-webapp ---
[INFO] Waiting 10 seconds for jetty to stop
[INFO] Stopped ServerConnector@4f8ae4a5{HTTP/1.1,[http/1.1]}{0.0.0.0:31000}
[INFO] Closing Spring root WebApplicationContext
[INFO] Shutting down log4j
[INFO] Stopped o.e.j.m.p.JettyWebAppContext@7141e7d7{/,file://<https://builds.apache.org/job/PreCommit-ATLAS-Build-Test/ws/webapp/target/atlas-webapp-1.0.0-SNAPSHOT/,UNAVAILABLE}{/home/jenkins/jenkins-slave/workspace/PreCommit-ATLAS-Build-Test/webapp/target/atlas-webapp-1.0.0-SNAPSHOT.war}>
[INFO] Server reports itself as stopped
[INFO] 
[INFO] --- maven-source-plugin:2.4:jar-no-fork (attach-sources) @ atlas-webapp ---
[INFO] Building jar: <https://builds.apache.org/job/PreCommit-ATLAS-Build-Test/ws/webapp/target/atlas-webapp-1.0.0-SNAPSHOT-sources.jar>
log4j:WARN No appenders could be found for logger (org.apache.zookeeper.ClientCnxn).
log4j:WARN Please initialize the log4j system properly.
log4j:WARN See http://logging.apache.org/log4j/1.2/faq.html#noconfig for more info.
[INFO] 
[INFO] --- maven-source-plugin:2.4:test-jar-no-fork (attach-sources) @ atlas-webapp ---
[INFO] Building jar: <https://builds.apache.org/job/PreCommit-ATLAS-Build-Test/ws/webapp/target/atlas-webapp-1.0.0-SNAPSHOT-test-sources.jar>
[INFO] 
[INFO] --- maven-failsafe-plugin:2.18.1:verify (verify) @ atlas-webapp ---
[INFO] Failsafe report directory: <https://builds.apache.org/job/PreCommit-ATLAS-Build-Test/ws/webapp/target/failsafe-reports>
[INFO] ------------------------------------------------------------------------
[INFO] Reactor Summary:
[INFO] 
[INFO] Apache Atlas Server Build Tools .................... SUCCESS [  0.642 s]
[INFO] apache-atlas ....................................... SUCCESS [  3.385 s]
[INFO] Apache Atlas Test Utility Tools .................... SUCCESS [  4.405 s]
[INFO] Open Connector Framework (OCF) ..................... SUCCESS [  2.127 s]
[INFO] Open Metadata Repository Services (OMRS) ........... SUCCESS [  4.951 s]
[INFO] Open Metadata and Governance (OMAG) Server APIs .... SUCCESS [  0.949 s]
[INFO] Connected Asset Open Metadata Access Service (OMAS)  SUCCESS [  1.315 s]
[INFO] Asset Consumer Open Metadata Access Service (OMAS) . SUCCESS [  1.009 s]
[INFO] Open Metadata and Governance (OMAG) Server ......... SUCCESS [  0.765 s]
[INFO] Apache Atlas Integration ........................... SUCCESS [  3.571 s]
[INFO] Apache Atlas Common ................................ SUCCESS [  1.119 s]
[INFO] Apache Atlas Client ................................ SUCCESS [  0.125 s]
[INFO] atlas-client-common ................................ SUCCESS [  0.691 s]
[INFO] atlas-client-v1 .................................... SUCCESS [  0.943 s]
[INFO] Apache Atlas Server API ............................ SUCCESS [  0.896 s]
[INFO] Apache Atlas Notification .......................... SUCCESS [  1.769 s]
[INFO] atlas-client-v2 .................................... SUCCESS [  0.665 s]
[INFO] Apache Atlas Graph Database Projects ............... SUCCESS [  0.080 s]
[INFO] Apache Atlas Graph Database API .................... SUCCESS [  0.606 s]
[INFO] Graph Database Common Code ......................... SUCCESS [  0.802 s]
[INFO] Apache Atlas JanusGraph DB Impl .................... SUCCESS [  5.062 s]
[INFO] Apache Atlas Graph Database Implementation Dependencies SUCCESS [  1.934 s]
[INFO] Shaded version of Apache hbase client .............. SUCCESS [  8.093 s]
[INFO] Apache Atlas Titan 0.5.4 Graph DB Impl ............. SUCCESS [ 28.541 s]
[INFO] Shaded version of Apache hbase server .............. SUCCESS [ 20.308 s]
[INFO] Apache Atlas Authorization ......................... SUCCESS [  1.009 s]
[INFO] Apache Atlas Repository ............................ SUCCESS [  9.199 s]
[INFO] Apache Atlas UI .................................... SUCCESS [01:46 min]
[INFO] Apache Atlas Web Application ....................... FAILURE [03:57 min]
[INFO] Apache Atlas Documentation ......................... SKIPPED
[INFO] Apache Atlas FileSystem Model ...................... SKIPPED
[INFO] Apache Atlas Plugin Classloader .................... SKIPPED
[INFO] Apache Atlas Hive Bridge Shim ...................... SKIPPED
[INFO] Apache Atlas Hive Bridge ........................... SKIPPED
[INFO] Apache Atlas Falcon Bridge Shim .................... SKIPPED
[INFO] Apache Atlas Falcon Bridge ......................... SKIPPED
[INFO] Apache Atlas Sqoop Bridge Shim ..................... SKIPPED
[INFO] Apache Atlas Sqoop Bridge .......................... SKIPPED
[INFO] Apache Atlas Storm Bridge Shim ..................... SKIPPED
[INFO] Apache Atlas Storm Bridge .......................... SKIPPED
[INFO] Apache Atlas Hbase Bridge Shim ..................... SKIPPED
[INFO] Apache Atlas Hbase Bridge .......................... SKIPPED
[INFO] Apache Atlas Kafka Bridge .......................... SKIPPED
[INFO] Apache Atlas Migration Exporter .................... SKIPPED
[INFO] Apache Atlas Distribution .......................... SKIPPED
[INFO] ------------------------------------------------------------------------
[INFO] BUILD FAILURE
[INFO] ------------------------------------------------------------------------
[INFO] Total time: 07:30 min
[INFO] Finished at: 2018-05-03T12:03:14Z
[INFO] Final Memory: 381M/2284M
[INFO] ------------------------------------------------------------------------
[ERROR] Failed to execute goal org.apache.maven.plugins:maven-failsafe-plugin:2.18.1:verify
(verify) on project atlas-webapp: There are test failures.
[ERROR] 
[ERROR] Please refer to <https://builds.apache.org/job/PreCommit-ATLAS-Build-Test/ws/webapp/target/failsafe-reports>
for the individual test results.
[ERROR] -> [Help 1]
[ERROR] 
[ERROR] To see the full stack trace of the errors, re-run Maven with the -e switch.
[ERROR] Re-run Maven using the -X switch to enable full debug logging.
[ERROR] 
[ERROR] For more information about the errors and possible solutions, please read the following
articles:
[ERROR] [Help 1] http://cwiki.apache.org/confluence/display/MAVEN/MojoFailureException
[ERROR] 
[ERROR] After correcting the problems, you can resume the build with the command
[ERROR]   mvn <goals> -rf :atlas-webapp




{color:red}-1 overall{color}.  

    {color:green}+1 @author{color}.  The patch does not contain any @author tags.

Console output: https://builds.apache.org/job/PreCommit-ATLAS-Build-Test/337//console

This message is automatically generated.


======================================================================
======================================================================
    Adding comment to Jira.
======================================================================
======================================================================




======================================================================
======================================================================
    Finished build.
======================================================================
======================================================================


+ EXIT_CODE=1
+ '[' -d <https://builds.apache.org/job/PreCommit-ATLAS-Build-Test/ws/../atlas_patchprocess_25530>
']'
+ '[' -d <https://builds.apache.org/job/PreCommit-ATLAS-Build-Test/ws/atlas_patchprocess_25530>
']'
+ mv <https://builds.apache.org/job/PreCommit-ATLAS-Build-Test/ws/atlas_patchprocess_25530>
<https://builds.apache.org/job/PreCommit-ATLAS-Build-Test/ws/patchprocess>
+ rm -f <https://builds.apache.org/job/PreCommit-ATLAS-Build-Test/ws/../atlas_patchprocess_25530>
+ exit 1
Build step 'Execute shell' marked build as failure
Set build name.
New build name is '#337-master-0001-jceks-change.patch'
Archiving artifacts
[Fast Archiver] Compressed 164.77 MB of artifacts by 84.5% relative to #331

Mime
View raw message