atlas-dev mailing list archives

Site index · List index
Message view « Date » · « Thread »
Top « Date » · « Thread »
From Apache Jenkins Server <jenk...@builds.apache.org>
Subject Build failed in Jenkins: Atlas-master-IntegrationTests #1362
Date Thu, 17 May 2018 07:33:07 GMT
See <https://builds.apache.org/job/Atlas-master-IntegrationTests/1362/display/redirect?page=changes>

Changes:

[ssubramanian] ATLAS-2695: Entity deletion fails if a term was/is associated to it.

------------------------------------------
[...truncated 455.78 KB...]
127.0.0.1 - - [17/May/2018:06:52:08 +0000] "GET //localhost:31000/api/atlas/v2/types/typedef/name/hive_table_v1
HTTP/1.1" 503 372 "-" "Java/1.8.0_172"
127.0.0.1 - - [17/May/2018:06:52:13 +0000] "GET //localhost:31000/api/atlas/v2/types/typedef/name/hive_table_v1
HTTP/1.1" 503 372 "-" "Java/1.8.0_172"
127.0.0.1 - - [17/May/2018:06:52:18 +0000] "GET //localhost:31000/api/atlas/v2/types/typedef/name/hive_table_v1
HTTP/1.1" 503 372 "-" "Java/1.8.0_172"
127.0.0.1 - - [17/May/2018:06:52:23 +0000] "GET //localhost:31000/api/atlas/v2/types/typedef/name/hive_process_v1
HTTP/1.1" 503 374 "-" "Java/1.8.0_172"
127.0.0.1 - - [17/May/2018:06:52:28 +0000] "GET //localhost:31000/api/atlas/v2/types/typedef/name/hive_process_v1
HTTP/1.1" 503 374 "-" "Java/1.8.0_172"
127.0.0.1 - - [17/May/2018:06:52:33 +0000] "GET //localhost:31000/api/atlas/v2/types/typedef/name/hive_process_v1
HTTP/1.1" 503 374 "-" "Java/1.8.0_172"
127.0.0.1 - - [17/May/2018:06:52:38 +0000] "GET //localhost:31000/api/atlas/v2/types/typedef/name/hive_process_v1
HTTP/1.1" 503 374 "-" "Java/1.8.0_172"
127.0.0.1 - - [17/May/2018:06:52:43 +0000] "POST //localhost:31000/api/atlas/types HTTP/1.1"
503 342 "-" "Java/1.8.0_172"
127.0.0.1 - - [17/May/2018:06:52:48 +0000] "POST //localhost:31000/api/atlas/types HTTP/1.1"
503 342 "-" "Java/1.8.0_172"
127.0.0.1 - - [17/May/2018:06:52:53 +0000] "POST //localhost:31000/api/atlas/types HTTP/1.1"
503 342 "-" "Java/1.8.0_172"
127.0.0.1 - - [17/May/2018:06:52:58 +0000] "POST //localhost:31000/api/atlas/types HTTP/1.1"
503 342 "-" "Java/1.8.0_172"
127.0.0.1 - - [17/May/2018:06:53:03 +0000] "GET //localhost:31000/api/atlas/admin/session
HTTP/1.1" 503 350 "-" "Java/1.8.0_172"
127.0.0.1 - - [17/May/2018:06:53:03 +0000] "GET //localhost:31000/api/atlas/admin/status HTTP/1.1"
503 349 "-" "Java/1.8.0_172"
127.0.0.1 - - [17/May/2018:06:53:03 +0000] "GET //localhost:31000/api/atlas/admin/session
HTTP/1.1" 503 350 "-" "Java/1.8.0_172"
Tests run: 135, Failures: 5, Errors: 0, Skipped: 127, Time elapsed: 751.859 sec <<<
FAILURE! - in TestSuite
setUp(org.apache.atlas.web.integration.DataSetLineageJerseyResourceIT)  Time elapsed: 363.039
sec  <<< FAILURE!
org.apache.atlas.AtlasServiceException: Metadata service API org.apache.atlas.AtlasClient$API_V1@197ac7d4
failed with status 503 (Service Unavailable) Response Body (<html>
<head>
<meta http-equiv="Content-Type" content="text/html;charset=ISO-8859-1"/>
<title>Error 503 </title>
</head>
<body>
<h2>HTTP ERROR: 503</h2>
<p>Problem accessing /api/atlas/types. Reason:
<pre>    Service Unavailable</pre></p>
<hr /><a href="http://eclipse.org/jetty">Powered by Jetty:// 9.3.14.v20161028</a><hr/>
</body>
</html>
)
	at org.apache.atlas.AtlasBaseClient.callAPIWithResource(AtlasBaseClient.java:395)
	at org.apache.atlas.AtlasBaseClient.callAPIWithResource(AtlasBaseClient.java:323)
	at org.apache.atlas.AtlasBaseClient.callAPI(AtlasBaseClient.java:211)
	at org.apache.atlas.AtlasClient.callAPIWithBody(AtlasClient.java:906)
	at org.apache.atlas.AtlasClient.createType(AtlasClient.java:257)
	at org.apache.atlas.AtlasClient.createType(AtlasClient.java:275)
	at org.apache.atlas.web.integration.BaseResourceIT.createType(BaseResourceIT.java:211)
	at org.apache.atlas.web.integration.BaseResourceIT.createTypeDefinitionsV1(BaseResourceIT.java:358)
	at org.apache.atlas.web.integration.DataSetLineageJerseyResourceIT.setUp(DataSetLineageJerseyResourceIT.java:60)

setUp(org.apache.atlas.notification.NotificationHookConsumerIT)  Time elapsed: 363.413 sec
 <<< FAILURE!
org.apache.atlas.AtlasServiceException: Metadata service API org.apache.atlas.AtlasClient$API_V1@197ac7d4
failed with status 503 (Service Unavailable) Response Body (<html>
<head>
<meta http-equiv="Content-Type" content="text/html;charset=ISO-8859-1"/>
<title>Error 503 </title>
</head>
<body>
<h2>HTTP ERROR: 503</h2>
<p>Problem accessing /api/atlas/types. Reason:
<pre>    Service Unavailable</pre></p>
<hr /><a href="http://eclipse.org/jetty">Powered by Jetty:// 9.3.14.v20161028</a><hr/>
</body>
</html>
)
	at org.apache.atlas.AtlasBaseClient.callAPIWithResource(AtlasBaseClient.java:395)
	at org.apache.atlas.AtlasBaseClient.callAPIWithResource(AtlasBaseClient.java:323)
	at org.apache.atlas.AtlasBaseClient.callAPI(AtlasBaseClient.java:211)
	at org.apache.atlas.AtlasClient.callAPIWithBody(AtlasClient.java:906)
	at org.apache.atlas.AtlasClient.createType(AtlasClient.java:257)
	at org.apache.atlas.AtlasClient.createType(AtlasClient.java:275)
	at org.apache.atlas.web.integration.BaseResourceIT.createType(BaseResourceIT.java:211)
	at org.apache.atlas.web.integration.BaseResourceIT.createTypeDefinitionsV1(BaseResourceIT.java:358)
	at org.apache.atlas.notification.NotificationHookConsumerIT.setUp(NotificationHookConsumerIT.java:54)

testSimpleLoginForValidUser(org.apache.atlas.web.filters.AtlasAuthenticationSimpleFilterIT)
 Time elapsed: 0.004 sec  <<< FAILURE!
java.lang.AssertionError: expected [200] but found [503]
	at org.testng.Assert.fail(Assert.java:94)
	at org.testng.Assert.failNotEquals(Assert.java:496)
	at org.testng.Assert.assertEquals(Assert.java:125)
	at org.testng.Assert.assertEquals(Assert.java:372)
	at org.testng.Assert.assertEquals(Assert.java:382)
	at org.apache.atlas.web.filters.AtlasAuthenticationSimpleFilterIT.testSimpleLoginForValidUser(AtlasAuthenticationSimpleFilterIT.java:46)

testAccessforUnauthenticatedResource(org.apache.atlas.web.filters.AtlasAuthenticationSimpleFilterIT)
 Time elapsed: 0.006 sec  <<< FAILURE!
java.lang.AssertionError: expected [200] but found [503]
	at org.testng.Assert.fail(Assert.java:94)
	at org.testng.Assert.failNotEquals(Assert.java:496)
	at org.testng.Assert.assertEquals(Assert.java:125)
	at org.testng.Assert.assertEquals(Assert.java:372)
	at org.testng.Assert.assertEquals(Assert.java:382)
	at org.apache.atlas.web.filters.AtlasAuthenticationSimpleFilterIT.testAccessforUnauthenticatedResource(AtlasAuthenticationSimpleFilterIT.java:57)

testSimpleLoginWithInvalidCrendentials(org.apache.atlas.web.filters.AtlasAuthenticationSimpleFilterIT)
 Time elapsed: 0.001 sec  <<< FAILURE!
java.lang.AssertionError: expected [401] but found [503]
	at org.testng.Assert.fail(Assert.java:94)
	at org.testng.Assert.failNotEquals(Assert.java:496)
	at org.testng.Assert.assertEquals(Assert.java:125)
	at org.testng.Assert.assertEquals(Assert.java:372)
	at org.testng.Assert.assertEquals(Assert.java:382)
	at org.apache.atlas.web.filters.AtlasAuthenticationSimpleFilterIT.testSimpleLoginWithInvalidCrendentials(AtlasAuthenticationSimpleFilterIT.java:75)


Results :

Failed tests: 
  NotificationHookConsumerIT.setUp:54->BaseResourceIT.createTypeDefinitionsV1:358->BaseResourceIT.createType:211
» AtlasService
  AtlasAuthenticationSimpleFilterIT.testAccessforUnauthenticatedResource:57 expected [200]
but found [503]
  AtlasAuthenticationSimpleFilterIT.testSimpleLoginForValidUser:46 expected [200] but found
[503]
  AtlasAuthenticationSimpleFilterIT.testSimpleLoginWithInvalidCrendentials:75 expected [401]
but found [503]
  DataSetLineageJerseyResourceIT.setUp:60->BaseResourceIT.createTypeDefinitionsV1:358->BaseResourceIT.createType:211
» AtlasService

Tests run: 132, Failures: 5, Errors: 0, Skipped: 124

[INFO] 
[INFO] --- jetty-maven-plugin:9.3.14.v20161028:stop (stop-jetty) @ atlas-webapp ---
[INFO] Jetty not running!
[INFO] 
[INFO] --- maven-source-plugin:2.4:jar-no-fork (attach-sources) @ atlas-webapp ---
[INFO] Building jar: <https://builds.apache.org/job/Atlas-master-IntegrationTests/ws/webapp/target/atlas-webapp-1.0.0-SNAPSHOT-sources.jar>
[INFO] 
[INFO] --- maven-source-plugin:2.4:test-jar-no-fork (attach-sources) @ atlas-webapp ---
[INFO] Building jar: <https://builds.apache.org/job/Atlas-master-IntegrationTests/ws/webapp/target/atlas-webapp-1.0.0-SNAPSHOT-test-sources.jar>
[INFO] 
[INFO] --- maven-failsafe-plugin:2.18.1:verify (verify) @ atlas-webapp ---
[INFO] Failsafe report directory: <https://builds.apache.org/job/Atlas-master-IntegrationTests/ws/webapp/target/failsafe-reports>
[INFO] ------------------------------------------------------------------------
[INFO] Reactor Summary:
[INFO] 
[INFO] Apache Atlas Server Build Tools .................... SUCCESS [  0.802 s]
[INFO] apache-atlas ....................................... SUCCESS [  5.163 s]
[INFO] Apache Atlas Test Utility Tools .................... SUCCESS [ 11.838 s]
[INFO] Open Connector Framework (OCF) ..................... SUCCESS [ 12.352 s]
[INFO] Open Metadata Repository Services (OMRS) ........... SUCCESS [ 36.719 s]
[INFO] Open Metadata and Governance (OMAG) Server APIs .... SUCCESS [  7.560 s]
[INFO] Connected Asset Open Metadata Access Service (OMAS)  SUCCESS [  8.529 s]
[INFO] Asset Consumer Open Metadata Access Service (OMAS) . SUCCESS [  8.130 s]
[INFO] Open Metadata and Governance (OMAG) Server ......... SUCCESS [  5.091 s]
[INFO] Apache Atlas Integration ........................... SUCCESS [ 19.017 s]
[INFO] Apache Atlas Common ................................ SUCCESS [  7.939 s]
[INFO] Apache Atlas Client ................................ SUCCESS [  0.500 s]
[INFO] atlas-client-common ................................ SUCCESS [  6.570 s]
[INFO] atlas-client-v1 .................................... SUCCESS [  6.910 s]
[INFO] Apache Atlas Server API ............................ SUCCESS [  5.312 s]
[INFO] Apache Atlas Notification .......................... SUCCESS [  9.877 s]
[INFO] atlas-client-v2 .................................... SUCCESS [  6.289 s]
[INFO] Apache Atlas Graph Database Projects ............... SUCCESS [  0.507 s]
[INFO] Apache Atlas Graph Database API .................... SUCCESS [  5.196 s]
[INFO] Graph Database Common Code ......................... SUCCESS [  5.653 s]
[INFO] Apache Atlas JanusGraph DB Impl .................... SUCCESS [ 15.770 s]
[INFO] Apache Atlas Graph Database Implementation Dependencies SUCCESS [  2.342 s]
[INFO] Shaded version of Apache hbase client .............. SUCCESS [  8.584 s]
[INFO] Shaded version of Apache hbase server .............. SUCCESS [ 23.705 s]
[INFO] Apache Atlas Authorization ......................... SUCCESS [  8.075 s]
[INFO] Apache Atlas Repository ............................ SUCCESS [ 39.374 s]
[INFO] Apache Atlas UI .................................... SUCCESS [01:56 min]
[INFO] Apache Atlas Web Application ....................... FAILURE [13:51 min]
[INFO] Apache Atlas Documentation ......................... SKIPPED
[INFO] Apache Atlas FileSystem Model ...................... SKIPPED
[INFO] Apache Atlas Plugin Classloader .................... SKIPPED
[INFO] Apache Atlas Hive Bridge Shim ...................... SKIPPED
[INFO] Apache Atlas Hive Bridge ........................... SKIPPED
[INFO] Apache Atlas Falcon Bridge Shim .................... SKIPPED
[INFO] Apache Atlas Falcon Bridge ......................... SKIPPED
[INFO] Apache Atlas Sqoop Bridge Shim ..................... SKIPPED
[INFO] Apache Atlas Sqoop Bridge .......................... SKIPPED
[INFO] Apache Atlas Storm Bridge Shim ..................... SKIPPED
[INFO] Apache Atlas Storm Bridge .......................... SKIPPED
[INFO] Apache Atlas Hbase Bridge Shim ..................... SKIPPED
[INFO] Apache Atlas Hbase Bridge .......................... SKIPPED
[INFO] Apache Atlas Kafka Bridge .......................... SKIPPED
[INFO] Apache Atlas Distribution .......................... SKIPPED
[INFO] ------------------------------------------------------------------------
[INFO] BUILD FAILURE
[INFO] ------------------------------------------------------------------------
[INFO] Total time: 20:17 min
[INFO] Finished at: 2018-05-17T06:53:30Z
[INFO] Final Memory: 258M/2271M
[INFO] ------------------------------------------------------------------------
[ERROR] Failed to execute goal org.apache.maven.plugins:maven-failsafe-plugin:2.18.1:verify
(verify) on project atlas-webapp: There are test failures.
[ERROR] 
[ERROR] Please refer to <https://builds.apache.org/job/Atlas-master-IntegrationTests/ws/webapp/target/failsafe-reports>
for the individual test results.
[ERROR] -> [Help 1]
[ERROR] 
[ERROR] To see the full stack trace of the errors, re-run Maven with the -e switch.
[ERROR] Re-run Maven using the -X switch to enable full debug logging.
[ERROR] 
[ERROR] For more information about the errors and possible solutions, please read the following
articles:
[ERROR] [Help 1] http://cwiki.apache.org/confluence/display/MAVEN/MojoFailureException
[ERROR] 
[ERROR] After correcting the problems, you can resume the build with the command
[ERROR]   mvn <goals> -rf :atlas-webapp
[INFO] Stopped ServerConnector@73f76806{HTTP/1.1,[http/1.1]}{0.0.0.0:0}
[INFO] Stopped o.e.j.s.ServletContextHandler@c458d09{/solr,null,UNAVAILABLE}
Build step 'Execute shell' marked build as failure
[CHECKSTYLE] Collecting checkstyle analysis files...
[CHECKSTYLE] Searching for all files in <https://builds.apache.org/job/Atlas-master-IntegrationTests/ws/>
that match the pattern **/target/checkstyle-result.xml
[CHECKSTYLE] Parsing 26 files in <https://builds.apache.org/job/Atlas-master-IntegrationTests/ws/>
[CHECKSTYLE] Successfully parsed file <https://builds.apache.org/job/Atlas-master-IntegrationTests/ws/authorization/target/checkstyle-result.xml>
with 669 unique warnings and 0 duplicates.
[CHECKSTYLE] Successfully parsed file <https://builds.apache.org/job/Atlas-master-IntegrationTests/ws/client/client-v1/target/checkstyle-result.xml>
with 1556 unique warnings and 0 duplicates.
[CHECKSTYLE] Successfully parsed file <https://builds.apache.org/job/Atlas-master-IntegrationTests/ws/client/client-v2/target/checkstyle-result.xml>
with 1915 unique warnings and 0 duplicates.
[CHECKSTYLE] Successfully parsed file <https://builds.apache.org/job/Atlas-master-IntegrationTests/ws/client/common/target/checkstyle-result.xml>
with 2406 unique warnings and 0 duplicates.
[CHECKSTYLE] Successfully parsed file <https://builds.apache.org/job/Atlas-master-IntegrationTests/ws/client/target/checkstyle-result.xml>
with 2406 unique warnings and 0 duplicates.
[CHECKSTYLE] Successfully parsed file <https://builds.apache.org/job/Atlas-master-IntegrationTests/ws/common/target/checkstyle-result.xml>
with 3466 unique warnings and 0 duplicates.
[CHECKSTYLE] Successfully parsed file <https://builds.apache.org/job/Atlas-master-IntegrationTests/ws/dashboardv2/target/checkstyle-result.xml>
with 3466 unique warnings and 0 duplicates.
[CHECKSTYLE] Successfully parsed file <https://builds.apache.org/job/Atlas-master-IntegrationTests/ws/graphdb/api/target/checkstyle-result.xml>
with 3766 unique warnings and 0 duplicates.
[CHECKSTYLE] Successfully parsed file <https://builds.apache.org/job/Atlas-master-IntegrationTests/ws/graphdb/common/target/checkstyle-result.xml>
with 3992 unique warnings and 0 duplicates.
[CHECKSTYLE] Successfully parsed file <https://builds.apache.org/job/Atlas-master-IntegrationTests/ws/graphdb/graphdb-impls/target/checkstyle-result.xml>
with 3992 unique warnings and 0 duplicates.
[CHECKSTYLE] Successfully parsed file <https://builds.apache.org/job/Atlas-master-IntegrationTests/ws/graphdb/janus/target/checkstyle-result.xml>
with 5771 unique warnings and 0 duplicates.
[CHECKSTYLE] Successfully parsed file <https://builds.apache.org/job/Atlas-master-IntegrationTests/ws/graphdb/target/checkstyle-result.xml>
with 5771 unique warnings and 0 duplicates.
[CHECKSTYLE] Successfully parsed file <https://builds.apache.org/job/Atlas-master-IntegrationTests/ws/intg/target/checkstyle-result.xml>
with 17662 unique warnings and 0 duplicates.
[CHECKSTYLE] Successfully parsed file <https://builds.apache.org/job/Atlas-master-IntegrationTests/ws/notification/target/checkstyle-result.xml>
with 18899 unique warnings and 0 duplicates.
[CHECKSTYLE] Successfully parsed file <https://builds.apache.org/job/Atlas-master-IntegrationTests/ws/om-fwk-ocf/target/checkstyle-result.xml>
with 23940 unique warnings and 0 duplicates.
[CHECKSTYLE] Successfully parsed file <https://builds.apache.org/job/Atlas-master-IntegrationTests/ws/omag-api/target/checkstyle-result.xml>
with 25495 unique warnings and 0 duplicates.
[CHECKSTYLE] Successfully parsed file <https://builds.apache.org/job/Atlas-master-IntegrationTests/ws/omag-server/target/checkstyle-result.xml>
with 25504 unique warnings and 0 duplicates.
[CHECKSTYLE] Successfully parsed file <https://builds.apache.org/job/Atlas-master-IntegrationTests/ws/omas-assetconsumer/target/checkstyle-result.xml>
with 28343 unique warnings and 0 duplicates.
[CHECKSTYLE] Successfully parsed file <https://builds.apache.org/job/Atlas-master-IntegrationTests/ws/omas-connectedasset/target/checkstyle-result.xml>
with 31756 unique warnings and 0 duplicates.
[CHECKSTYLE] Successfully parsed file <https://builds.apache.org/job/Atlas-master-IntegrationTests/ws/omrs/target/checkstyle-result.xml>
with 71727 unique warnings and 0 duplicates.
[CHECKSTYLE] Successfully parsed file <https://builds.apache.org/job/Atlas-master-IntegrationTests/ws/repository/target/checkstyle-result.xml>
with 90472 unique warnings and 0 duplicates.
[CHECKSTYLE] Successfully parsed file <https://builds.apache.org/job/Atlas-master-IntegrationTests/ws/server-api/target/checkstyle-result.xml>
with 90638 unique warnings and 0 duplicates.
[CHECKSTYLE] Successfully parsed file <https://builds.apache.org/job/Atlas-master-IntegrationTests/ws/shaded/hbase-client-shaded/target/checkstyle-result.xml>
with 90638 unique warnings and 0 duplicates.
[CHECKSTYLE] Successfully parsed file <https://builds.apache.org/job/Atlas-master-IntegrationTests/ws/shaded/hbase-server-shaded/target/checkstyle-result.xml>
with 90638 unique warnings and 0 duplicates.
[CHECKSTYLE] Successfully parsed file <https://builds.apache.org/job/Atlas-master-IntegrationTests/ws/target/checkstyle-result.xml>
with 90638 unique warnings and 0 duplicates.
[CHECKSTYLE] Successfully parsed file <https://builds.apache.org/job/Atlas-master-IntegrationTests/ws/test-tools/target/checkstyle-result.xml>
with 90676 unique warnings and 0 duplicates.
<Git Blamer> Using GitBlamer to create author and commit information for all warnings.
<Git Blamer> GIT_COMMIT=c2d927e0b1a5fb8203d6fea4ded653060cd8acf3, workspace=<https://builds.apache.org/job/Atlas-master-IntegrationTests/ws/>
 > git rev-parse c2d927e0b1a5fb8203d6fea4ded653060cd8acf3^{commit} # timeout=10
[CHECKSTYLE] Computing warning deltas based on reference build #1361
[FINDBUGS] Collecting findbugs analysis files...
[FINDBUGS] Searching for all files in <https://builds.apache.org/job/Atlas-master-IntegrationTests/ws/>
that match the pattern **/target/findbugs.xml
[FINDBUGS] Parsing 19 files in <https://builds.apache.org/job/Atlas-master-IntegrationTests/ws/>
[FINDBUGS] Successfully parsed file <https://builds.apache.org/job/Atlas-master-IntegrationTests/ws/authorization/target/findbugs.xml>
with 0 unique warnings and 0 duplicates.
[FINDBUGS] Successfully parsed file <https://builds.apache.org/job/Atlas-master-IntegrationTests/ws/client/client-v1/target/findbugs.xml>
with 0 unique warnings and 0 duplicates.
[FINDBUGS] Successfully parsed file <https://builds.apache.org/job/Atlas-master-IntegrationTests/ws/client/client-v2/target/findbugs.xml>
with 0 unique warnings and 0 duplicates.
[FINDBUGS] Successfully parsed file <https://builds.apache.org/job/Atlas-master-IntegrationTests/ws/client/common/target/findbugs.xml>
with 0 unique warnings and 0 duplicates.
[FINDBUGS] Successfully parsed file <https://builds.apache.org/job/Atlas-master-IntegrationTests/ws/common/target/findbugs.xml>
with 0 unique warnings and 0 duplicates.
[FINDBUGS] Successfully parsed file <https://builds.apache.org/job/Atlas-master-IntegrationTests/ws/graphdb/api/target/findbugs.xml>
with 0 unique warnings and 0 duplicates.
[FINDBUGS] Successfully parsed file <https://builds.apache.org/job/Atlas-master-IntegrationTests/ws/graphdb/common/target/findbugs.xml>
with 0 unique warnings and 0 duplicates.
[FINDBUGS] Successfully parsed file <https://builds.apache.org/job/Atlas-master-IntegrationTests/ws/graphdb/janus/target/findbugs.xml>
with 0 unique warnings and 0 duplicates.
[FINDBUGS] Successfully parsed file <https://builds.apache.org/job/Atlas-master-IntegrationTests/ws/intg/target/findbugs.xml>
with 0 unique warnings and 0 duplicates.
[FINDBUGS] Successfully parsed file <https://builds.apache.org/job/Atlas-master-IntegrationTests/ws/notification/target/findbugs.xml>
with 0 unique warnings and 0 duplicates.
[FINDBUGS] Successfully parsed file <https://builds.apache.org/job/Atlas-master-IntegrationTests/ws/om-fwk-ocf/target/findbugs.xml>
with 0 unique warnings and 0 duplicates.
[FINDBUGS] Successfully parsed file <https://builds.apache.org/job/Atlas-master-IntegrationTests/ws/omag-api/target/findbugs.xml>
with 0 unique warnings and 0 duplicates.
[FINDBUGS] Successfully parsed file <https://builds.apache.org/job/Atlas-master-IntegrationTests/ws/omag-server/target/findbugs.xml>
with 0 unique warnings and 0 duplicates.
[FINDBUGS] Successfully parsed file <https://builds.apache.org/job/Atlas-master-IntegrationTests/ws/omas-assetconsumer/target/findbugs.xml>
with 0 unique warnings and 0 duplicates.
[FINDBUGS] Successfully parsed file <https://builds.apache.org/job/Atlas-master-IntegrationTests/ws/omas-connectedasset/target/findbugs.xml>
with 0 unique warnings and 0 duplicates.
[FINDBUGS] Successfully parsed file <https://builds.apache.org/job/Atlas-master-IntegrationTests/ws/omrs/target/findbugs.xml>
with 0 unique warnings and 0 duplicates.
[FINDBUGS] Successfully parsed file <https://builds.apache.org/job/Atlas-master-IntegrationTests/ws/repository/target/findbugs.xml>
with 0 unique warnings and 0 duplicates.
[FINDBUGS] Successfully parsed file <https://builds.apache.org/job/Atlas-master-IntegrationTests/ws/server-api/target/findbugs.xml>
with 0 unique warnings and 0 duplicates.
[FINDBUGS] Successfully parsed file <https://builds.apache.org/job/Atlas-master-IntegrationTests/ws/test-tools/target/findbugs.xml>
with 0 unique warnings and 0 duplicates.
<Git Blamer> Using GitBlamer to create author and commit information for all warnings.
<Git Blamer> GIT_COMMIT=c2d927e0b1a5fb8203d6fea4ded653060cd8acf3, workspace=<https://builds.apache.org/job/Atlas-master-IntegrationTests/ws/>
[FINDBUGS] Computing warning deltas based on reference build #1361
Archiving artifacts
[Fast Archiver] Compressed 166.63 MB of artifacts by 88.6% relative to #1361
TestNG Reports Processing: START
Looking for TestNG results report in workspace using pattern: **/target/surefire-reports/testng-results.xml,**/target/failsafe-reports/testng-results.xml
Saving reports...
Processing '/x1/jenkins/jenkins-home/jobs/Atlas-master-IntegrationTests/builds/1362/testng/testng-results.xml'
2.521008% of tests failed, which exceeded threshold of 0%. Marking build as UNSTABLE
TestNG Reports Processing: FINISH

Mime
View raw message