atlas-dev mailing list archives

Site index · List index
Message view « Date » · « Thread »
Top « Date » · « Thread »
From Apache Jenkins Server <jenk...@builds.apache.org>
Subject Build failed in Jenkins: Atlas-1.0-AllTests #82
Date Fri, 25 May 2018 16:46:01 GMT
See <https://builds.apache.org/job/Atlas-1.0-AllTests/82/display/redirect?page=changes>

Changes:

[madhan] ATLAS-2721: rename attribute displayName as name in classes

------------------------------------------
[...truncated 305.66 KB...]
[INFO] Using configured provider org.apache.maven.surefire.testng.TestNGProvider

-------------------------------------------------------
 T E S T S
-------------------------------------------------------
Running org.apache.atlas.glossary.GlossaryServiceTest
Running org.apache.atlas.repository.audit.CassandraAuditRepositoryTest
Running org.apache.atlas.repository.tagpropagation.ClassificationPropagationTest
Running org.apache.atlas.repository.store.graph.v2.AtlasRelationshipDefStoreV2Test
Running org.apache.atlas.query.GremlinQueryComposerTest
Running org.apache.atlas.utils.TestResourceFileUtils
Running org.apache.atlas.repository.store.graph.AtlasTypeDefGraphStoreTest
Running org.apache.atlas.utils.ObjectUpdateSynchronizerTest
Running org.apache.atlas.query.DSLParsingTest
Running org.apache.atlas.repository.store.graph.v2.AtlasRelationshipStoreHardDeleteV2Test
Running org.apache.atlas.repository.store.graph.v2.AtlasEntityDefStoreV2Test
Running org.apache.atlas.repository.audit.InMemoryAuditRepositoryTest
Running org.apache.atlas.services.MetricsServiceTest
Running org.apache.atlas.repository.store.graph.v2.InverseReferenceUpdateV2Test
Running org.apache.atlas.glossary.PaginationHelperTest
Running org.apache.atlas.repository.store.graph.v2.AtlasEntityStoreV2Test
Running org.apache.atlas.repository.store.graph.v2.AtlasRelationshipStoreSoftDeleteV2Test
Running org.apache.atlas.repository.store.graph.v2.InverseReferenceUpdateSoftDeleteV2Test
Running org.apache.atlas.repository.migration.RelationshipCacheGeneratorTest
Running org.apache.atlas.repository.store.graph.v2.InverseReferenceUpdateHardDeleteV2Test
Running org.apache.atlas.repository.migration.HiveParititionTest
Running org.apache.atlas.repository.migration.ComplexAttributesTest
Running org.apache.atlas.repository.userprofile.UserProfileServiceTest
Tests run: 0, Failures: 0, Errors: 0, Skipped: 0, Time elapsed: 1.618 sec - in org.apache.atlas.utils.TestResourceFileUtils
Running org.apache.atlas.repository.store.graph.v2.AtlasRelationshipStoreV2Test
Running org.apache.atlas.TestModules
Running org.apache.atlas.query.DSLQueriesTest
Running org.apache.atlas.repository.migration.PathTest
Running org.apache.atlas.repository.store.graph.v2.AtlasEntityStoreV2BulkImportPercentTest
Running org.apache.atlas.repository.migration.HiveStocksTest
Running org.apache.atlas.repository.migration.MigrationProgressServiceTest
Running org.apache.atlas.repository.migration.TypesWithCollectionsFinderTest
Running org.apache.atlas.repository.store.graph.v2.AtlasComplexAttributesTest
Tests run: 0, Failures: 0, Errors: 0, Skipped: 0, Time elapsed: 2.752 sec - in org.apache.atlas.repository.store.graph.v2.InverseReferenceUpdateV2Test
Tests run: 20, Failures: 0, Errors: 0, Skipped: 0, Time elapsed: 4.024 sec - in org.apache.atlas.glossary.PaginationHelperTest
Running org.apache.atlas.repository.impexp.ImportServiceTest
Tests run: 6, Failures: 0, Errors: 0, Skipped: 0, Time elapsed: 4.449 sec - in org.apache.atlas.repository.audit.InMemoryAuditRepositoryTest
Tests run: 0, Failures: 0, Errors: 0, Skipped: 0, Time elapsed: 2.81 sec - in org.apache.atlas.TestModules
Tests run: 0, Failures: 0, Errors: 0, Skipped: 0, Time elapsed: 3.607 sec - in org.apache.atlas.repository.store.graph.v2.AtlasRelationshipStoreV2Test
Running org.apache.atlas.repository.impexp.ExportServiceTest
Tests run: 9, Failures: 0, Errors: 0, Skipped: 0, Time elapsed: 6.537 sec - in org.apache.atlas.utils.ObjectUpdateSynchronizerTest
Running org.apache.atlas.repository.impexp.ImportTransformerTest
Running org.apache.atlas.repository.impexp.AtlasImportRequestTest
Tests run: 8, Failures: 0, Errors: 0, Skipped: 0, Time elapsed: 7.826 sec - in org.apache.atlas.query.DSLParsingTest
Running org.apache.atlas.repository.impexp.ZipSinkTest
Running org.apache.atlas.repository.impexp.TypeAttributeDifferenceTest
Tests run: 9, Failures: 0, Errors: 0, Skipped: 0, Time elapsed: 6.115 sec - in org.apache.atlas.repository.store.graph.v2.AtlasEntityStoreV2BulkImportPercentTest
Running org.apache.atlas.repository.impexp.ImportTransformsTest
Tests run: 4, Failures: 0, Errors: 0, Skipped: 0, Time elapsed: 7.313 sec - in org.apache.atlas.repository.migration.MigrationProgressServiceTest
Tests run: 8, Failures: 0, Errors: 0, Skipped: 0, Time elapsed: 2.833 sec - in org.apache.atlas.repository.impexp.ImportTransformerTest
Running org.apache.atlas.repository.impexp.UniqueListTest
Running org.apache.atlas.repository.impexp.ImportTransformerJSONTest
Running org.apache.atlas.repository.impexp.ZipSourceTest
Tests run: 4, Failures: 0, Errors: 0, Skipped: 0, Time elapsed: 2.652 sec - in org.apache.atlas.repository.impexp.UniqueListTest
Tests run: 6, Failures: 0, Errors: 0, Skipped: 0, Time elapsed: 7.102 sec - in org.apache.atlas.repository.impexp.TypeAttributeDifferenceTest
Tests run: 6, Failures: 0, Errors: 0, Skipped: 0, Time elapsed: 7.892 sec - in org.apache.atlas.repository.impexp.AtlasImportRequestTest
Tests run: 8, Failures: 0, Errors: 0, Skipped: 0, Time elapsed: 7.473 sec - in org.apache.atlas.repository.impexp.ZipSinkTest
Tests run: 3, Failures: 0, Errors: 0, Skipped: 0, Time elapsed: 8.501 sec - in org.apache.atlas.repository.impexp.ImportTransformsTest
Tests run: 1, Failures: 0, Errors: 0, Skipped: 0, Time elapsed: 7.475 sec - in org.apache.atlas.repository.impexp.ImportTransformerJSONTest
Tests run: 6, Failures: 0, Errors: 0, Skipped: 0, Time elapsed: 7.443 sec - in org.apache.atlas.repository.impexp.ZipSourceTest
Tests run: 39, Failures: 0, Errors: 0, Skipped: 0, Time elapsed: 28.586 sec - in org.apache.atlas.query.GremlinQueryComposerTest
Tests run: 6, Failures: 0, Errors: 0, Skipped: 0, Time elapsed: 35.259 sec - in org.apache.atlas.repository.audit.CassandraAuditRepositoryTest
Tests run: 1, Failures: 0, Errors: 0, Skipped: 0, Time elapsed: 45.093 sec - in org.apache.atlas.services.MetricsServiceTest
Tests run: 1, Failures: 0, Errors: 0, Skipped: 0, Time elapsed: 70.517 sec - in org.apache.atlas.repository.store.graph.v2.AtlasEntityDefStoreV2Test
Tests run: 10, Failures: 0, Errors: 0, Skipped: 0, Time elapsed: 71.994 sec - in org.apache.atlas.repository.store.graph.v2.AtlasRelationshipDefStoreV2Test
Tests run: 1, Failures: 0, Errors: 0, Skipped: 0, Time elapsed: 97.739 sec - in org.apache.atlas.repository.migration.RelationshipCacheGeneratorTest
Tests run: 5, Failures: 0, Errors: 0, Skipped: 0, Time elapsed: 98.097 sec - in org.apache.atlas.repository.store.graph.v2.InverseReferenceUpdateHardDeleteV2Test
Tests run: 1, Failures: 0, Errors: 0, Skipped: 0, Time elapsed: 96.414 sec - in org.apache.atlas.repository.migration.TypesWithCollectionsFinderTest
Tests run: 4, Failures: 0, Errors: 0, Skipped: 0, Time elapsed: 99.289 sec - in org.apache.atlas.repository.store.graph.v2.AtlasRelationshipStoreHardDeleteV2Test
Tests run: 4, Failures: 0, Errors: 0, Skipped: 0, Time elapsed: 102.118 sec - in org.apache.atlas.repository.store.graph.v2.AtlasRelationshipStoreSoftDeleteV2Test
Tests run: 5, Failures: 0, Errors: 0, Skipped: 0, Time elapsed: 103.18 sec - in org.apache.atlas.repository.store.graph.v2.InverseReferenceUpdateSoftDeleteV2Test
Tests run: 7, Failures: 0, Errors: 0, Skipped: 0, Time elapsed: 108.169 sec - in org.apache.atlas.repository.store.graph.v2.AtlasComplexAttributesTest
Tests run: 12, Failures: 0, Errors: 0, Skipped: 0, Time elapsed: 110.861 sec - in org.apache.atlas.repository.impexp.ExportServiceTest
Tests run: 12, Failures: 0, Errors: 0, Skipped: 0, Time elapsed: 116.739 sec - in org.apache.atlas.repository.userprofile.UserProfileServiceTest
Tests run: 1, Failures: 0, Errors: 0, Skipped: 0, Time elapsed: 126.987 sec - in org.apache.atlas.repository.migration.PathTest
Tests run: 18, Failures: 0, Errors: 0, Skipped: 0, Time elapsed: 129.222 sec - in org.apache.atlas.repository.store.graph.AtlasTypeDefGraphStoreTest
Tests run: 1, Failures: 0, Errors: 0, Skipped: 0, Time elapsed: 128.206 sec - in org.apache.atlas.repository.migration.HiveParititionTest
Tests run: 16, Failures: 0, Errors: 0, Skipped: 0, Time elapsed: 131.723 sec - in org.apache.atlas.repository.store.graph.v2.AtlasEntityStoreV2Test
Tests run: 1, Failures: 0, Errors: 0, Skipped: 0, Time elapsed: 132.505 sec - in org.apache.atlas.repository.migration.HiveStocksTest
Tests run: 1, Failures: 0, Errors: 0, Skipped: 0, Time elapsed: 134.73 sec - in org.apache.atlas.repository.migration.ComplexAttributesTest
Tests run: 35, Failures: 0, Errors: 0, Skipped: 0, Time elapsed: 138.612 sec - in org.apache.atlas.glossary.GlossaryServiceTest
Tests run: 14, Failures: 1, Errors: 0, Skipped: 0, Time elapsed: 159.496 sec <<<
FAILURE! - in org.apache.atlas.repository.impexp.ImportServiceTest
importGlossary(org.apache.atlas.repository.impexp.ImportServiceTest)  Time elapsed: 3.182
sec  <<< FAILURE!
org.apache.atlas.exception.AtlasBaseException: AtlasGlossaryTerm.displayName : can not add
mandatory attribute
	at org.apache.atlas.repository.store.graph.v2.AtlasStructDefStoreV2.updateVertexPreUpdate(AtlasStructDefStoreV2.java:397)
	at org.apache.atlas.repository.store.graph.v2.AtlasEntityDefStoreV2.updateVertexPreUpdate(AtlasEntityDefStoreV2.java:336)
	at org.apache.atlas.repository.store.graph.v2.AtlasEntityDefStoreV2.updateByName(AtlasEntityDefStoreV2.java:212)
	at org.apache.atlas.repository.store.graph.v2.AtlasEntityDefStoreV2.updateByName(AtlasEntityDefStoreV2.java:44)
	at org.apache.atlas.repository.store.graph.AtlasTypeDefGraphStore.updateEntityDefByName(AtlasTypeDefGraphStore.java:284)
	at org.apache.atlas.GraphTransactionInterceptor.invoke(GraphTransactionInterceptor.java:75)
	at org.apache.atlas.repository.impexp.TypeAttributeDifference.updateEntityDef(TypeAttributeDifference.java:60)
	at org.apache.atlas.repository.impexp.TypeAttributeDifference.updateTypes(TypeAttributeDifference.java:50)
	at org.apache.atlas.repository.impexp.ImportTypeDefProcessor.processTypes(ImportTypeDefProcessor.java:45)
	at org.apache.atlas.repository.impexp.ImportService.processTypes(ImportService.java:157)
	at org.apache.atlas.repository.impexp.ImportService.run(ImportService.java:80)
	at org.apache.atlas.repository.impexp.ImportService.run(ImportService.java:61)
	at org.apache.atlas.repository.impexp.ZipFileResourceTestUtils.runImportWithNoParameters(ZipFileResourceTestUtils.java:241)
	at org.apache.atlas.repository.impexp.ImportServiceTest.importGlossary(ImportServiceTest.java:247)

Tests run: 9, Failures: 0, Errors: 0, Skipped: 0, Time elapsed: 174.368 sec - in org.apache.atlas.repository.tagpropagation.ClassificationPropagationTest
Tests run: 246, Failures: 0, Errors: 0, Skipped: 0, Time elapsed: 250.685 sec - in org.apache.atlas.query.DSLQueriesTest

Results :

Failed tests: 
  ImportServiceTest.importGlossary:247 » AtlasBase AtlasGlossaryTerm.displayName...

Tests run: 548, Failures: 1, Errors: 0, Skipped: 0

[INFO] ------------------------------------------------------------------------
[INFO] Reactor Summary:
[INFO] 
[INFO] Apache Atlas Server Build Tools .................... SUCCESS [  1.302 s]
[INFO] apache-atlas ....................................... SUCCESS [  6.353 s]
[INFO] Apache Atlas Test Utility Tools .................... SUCCESS [ 17.143 s]
[INFO] Open Connector Framework (OCF) ..................... SUCCESS [ 21.282 s]
[INFO] Open Metadata Repository Services (OMRS) ........... SUCCESS [01:06 min]
[INFO] Open Metadata and Governance (OMAG) Server APIs .... SUCCESS [ 19.213 s]
[INFO] Connected Asset Open Metadata Access Service (OMAS)  SUCCESS [ 18.521 s]
[INFO] Asset Consumer Open Metadata Access Service (OMAS) . SUCCESS [ 22.131 s]
[INFO] Open Metadata and Governance (OMAG) Server ......... SUCCESS [ 12.881 s]
[INFO] Apache Atlas Integration ........................... SUCCESS [01:51 min]
[INFO] Apache Atlas Common ................................ SUCCESS [ 17.579 s]
[INFO] Apache Atlas Client ................................ SUCCESS [  1.000 s]
[INFO] atlas-client-common ................................ SUCCESS [ 16.075 s]
[INFO] atlas-client-v1 .................................... SUCCESS [ 19.530 s]
[INFO] Apache Atlas Server API ............................ SUCCESS [ 13.542 s]
[INFO] Apache Atlas Notification .......................... SUCCESS [ 35.904 s]
[INFO] atlas-client-v2 .................................... SUCCESS [ 12.415 s]
[INFO] Apache Atlas Graph Database Projects ............... SUCCESS [  0.750 s]
[INFO] Apache Atlas Graph Database API .................... SUCCESS [ 10.394 s]
[INFO] Graph Database Common Code ......................... SUCCESS [ 10.993 s]
[INFO] Apache Atlas JanusGraph DB Impl .................... SUCCESS [03:00 min]
[INFO] Apache Atlas Graph Database Implementation Dependencies SUCCESS [  4.396 s]
[INFO] Shaded version of Apache hbase client .............. SUCCESS [ 12.578 s]
[INFO] Shaded version of Apache hbase server .............. SUCCESS [ 33.544 s]
[INFO] Apache Atlas Authorization ......................... SUCCESS [ 14.529 s]
[INFO] Apache Atlas Repository ............................ FAILURE [04:34 min]
[INFO] Apache Atlas UI .................................... SKIPPED
[INFO] Apache Atlas Web Application ....................... SKIPPED
[INFO] Apache Atlas Documentation ......................... SKIPPED
[INFO] Apache Atlas FileSystem Model ...................... SKIPPED
[INFO] Apache Atlas Plugin Classloader .................... SKIPPED
[INFO] Apache Atlas Hive Bridge Shim ...................... SKIPPED
[INFO] Apache Atlas Hive Bridge ........................... SKIPPED
[INFO] Apache Atlas Falcon Bridge Shim .................... SKIPPED
[INFO] Apache Atlas Falcon Bridge ......................... SKIPPED
[INFO] Apache Atlas Sqoop Bridge Shim ..................... SKIPPED
[INFO] Apache Atlas Sqoop Bridge .......................... SKIPPED
[INFO] Apache Atlas Storm Bridge Shim ..................... SKIPPED
[INFO] Apache Atlas Storm Bridge .......................... SKIPPED
[INFO] Apache Atlas Hbase Bridge Shim ..................... SKIPPED
[INFO] Apache Atlas Hbase Bridge .......................... SKIPPED
[INFO] Apache Atlas Kafka Bridge .......................... SKIPPED
[INFO] Apache Atlas Distribution .......................... SKIPPED
[INFO] ------------------------------------------------------------------------
[INFO] BUILD FAILURE
[INFO] ------------------------------------------------------------------------
[INFO] Total time: 15:58 min
[INFO] Finished at: 2018-05-25T15:56:14Z
[INFO] Final Memory: 166M/1837M
[INFO] ------------------------------------------------------------------------
[ERROR] Failed to execute goal org.apache.maven.plugins:maven-surefire-plugin:2.18.1:test
(default-test) on project atlas-repository: There are test failures.
[ERROR] 
[ERROR] Please refer to <https://builds.apache.org/job/Atlas-1.0-AllTests/ws/repository/target/surefire-reports>
for the individual test results.
[ERROR] -> [Help 1]
[ERROR] 
[ERROR] To see the full stack trace of the errors, re-run Maven with the -e switch.
[ERROR] Re-run Maven using the -X switch to enable full debug logging.
[ERROR] 
[ERROR] For more information about the errors and possible solutions, please read the following
articles:
[ERROR] [Help 1] http://cwiki.apache.org/confluence/display/MAVEN/MojoFailureException
[ERROR] 
[ERROR] After correcting the problems, you can resume the build with the command
[ERROR]   mvn <goals> -rf :atlas-repository
Build step 'Execute shell' marked build as failure
[CHECKSTYLE] Collecting checkstyle analysis files...
[CHECKSTYLE] Searching for all files in <https://builds.apache.org/job/Atlas-1.0-AllTests/ws/>
that match the pattern **/target/checkstyle-result.xml
[CHECKSTYLE] Parsing 24 files in <https://builds.apache.org/job/Atlas-1.0-AllTests/ws/>
[CHECKSTYLE] Successfully parsed file <https://builds.apache.org/job/Atlas-1.0-AllTests/ws/authorization/target/checkstyle-result.xml>
with 669 unique warnings and 0 duplicates.
[CHECKSTYLE] Successfully parsed file <https://builds.apache.org/job/Atlas-1.0-AllTests/ws/client/client-v1/target/checkstyle-result.xml>
with 1558 unique warnings and 0 duplicates.
[CHECKSTYLE] Successfully parsed file <https://builds.apache.org/job/Atlas-1.0-AllTests/ws/client/client-v2/target/checkstyle-result.xml>
with 1917 unique warnings and 0 duplicates.
[CHECKSTYLE] Successfully parsed file <https://builds.apache.org/job/Atlas-1.0-AllTests/ws/client/common/target/checkstyle-result.xml>
with 2408 unique warnings and 0 duplicates.
[CHECKSTYLE] Successfully parsed file <https://builds.apache.org/job/Atlas-1.0-AllTests/ws/client/target/checkstyle-result.xml>
with 2408 unique warnings and 0 duplicates.
[CHECKSTYLE] Successfully parsed file <https://builds.apache.org/job/Atlas-1.0-AllTests/ws/common/target/checkstyle-result.xml>
with 3467 unique warnings and 0 duplicates.
[CHECKSTYLE] Successfully parsed file <https://builds.apache.org/job/Atlas-1.0-AllTests/ws/graphdb/api/target/checkstyle-result.xml>
with 3767 unique warnings and 0 duplicates.
[CHECKSTYLE] Successfully parsed file <https://builds.apache.org/job/Atlas-1.0-AllTests/ws/graphdb/common/target/checkstyle-result.xml>
with 3993 unique warnings and 0 duplicates.
[CHECKSTYLE] Successfully parsed file <https://builds.apache.org/job/Atlas-1.0-AllTests/ws/graphdb/graphdb-impls/target/checkstyle-result.xml>
with 3993 unique warnings and 0 duplicates.
[CHECKSTYLE] Successfully parsed file <https://builds.apache.org/job/Atlas-1.0-AllTests/ws/graphdb/janus/target/checkstyle-result.xml>
with 6155 unique warnings and 0 duplicates.
[CHECKSTYLE] Successfully parsed file <https://builds.apache.org/job/Atlas-1.0-AllTests/ws/graphdb/target/checkstyle-result.xml>
with 6155 unique warnings and 0 duplicates.
[CHECKSTYLE] Successfully parsed file <https://builds.apache.org/job/Atlas-1.0-AllTests/ws/intg/target/checkstyle-result.xml>
with 18076 unique warnings and 0 duplicates.
[CHECKSTYLE] Successfully parsed file <https://builds.apache.org/job/Atlas-1.0-AllTests/ws/notification/target/checkstyle-result.xml>
with 19313 unique warnings and 0 duplicates.
[CHECKSTYLE] Successfully parsed file <https://builds.apache.org/job/Atlas-1.0-AllTests/ws/om-fwk-ocf/target/checkstyle-result.xml>
with 24354 unique warnings and 0 duplicates.
[CHECKSTYLE] Successfully parsed file <https://builds.apache.org/job/Atlas-1.0-AllTests/ws/omag-api/target/checkstyle-result.xml>
with 25909 unique warnings and 0 duplicates.
[CHECKSTYLE] Successfully parsed file <https://builds.apache.org/job/Atlas-1.0-AllTests/ws/omag-server/target/checkstyle-result.xml>
with 25918 unique warnings and 0 duplicates.
[CHECKSTYLE] Successfully parsed file <https://builds.apache.org/job/Atlas-1.0-AllTests/ws/omas-assetconsumer/target/checkstyle-result.xml>
with 28757 unique warnings and 0 duplicates.
[CHECKSTYLE] Successfully parsed file <https://builds.apache.org/job/Atlas-1.0-AllTests/ws/omas-connectedasset/target/checkstyle-result.xml>
with 32170 unique warnings and 0 duplicates.
[CHECKSTYLE] Successfully parsed file <https://builds.apache.org/job/Atlas-1.0-AllTests/ws/omrs/target/checkstyle-result.xml>
with 72141 unique warnings and 0 duplicates.
[CHECKSTYLE] Successfully parsed file <https://builds.apache.org/job/Atlas-1.0-AllTests/ws/server-api/target/checkstyle-result.xml>
with 72309 unique warnings and 0 duplicates.
[CHECKSTYLE] Successfully parsed file <https://builds.apache.org/job/Atlas-1.0-AllTests/ws/shaded/hbase-client-shaded/target/checkstyle-result.xml>
with 72309 unique warnings and 0 duplicates.
[CHECKSTYLE] Successfully parsed file <https://builds.apache.org/job/Atlas-1.0-AllTests/ws/shaded/hbase-server-shaded/target/checkstyle-result.xml>
with 72309 unique warnings and 0 duplicates.
[CHECKSTYLE] Successfully parsed file <https://builds.apache.org/job/Atlas-1.0-AllTests/ws/target/checkstyle-result.xml>
with 72309 unique warnings and 0 duplicates.
[CHECKSTYLE] Successfully parsed file <https://builds.apache.org/job/Atlas-1.0-AllTests/ws/test-tools/target/checkstyle-result.xml>
with 72347 unique warnings and 0 duplicates.
<Git Blamer> Using GitBlamer to create author and commit information for all warnings.
<Git Blamer> GIT_COMMIT=d8cd48c1cbad8b7405c9546bd018aedd226698e3, workspace=<https://builds.apache.org/job/Atlas-1.0-AllTests/ws/>
 > git rev-parse d8cd48c1cbad8b7405c9546bd018aedd226698e3^{commit} # timeout=10
[CHECKSTYLE] Computing warning deltas based on reference build #81
[FINDBUGS] Collecting findbugs analysis files...
[FINDBUGS] Searching for all files in <https://builds.apache.org/job/Atlas-1.0-AllTests/ws/>
that match the pattern **/target/findbugs.xml
[FINDBUGS] Parsing 18 files in <https://builds.apache.org/job/Atlas-1.0-AllTests/ws/>
[FINDBUGS] Successfully parsed file <https://builds.apache.org/job/Atlas-1.0-AllTests/ws/authorization/target/findbugs.xml>
with 0 unique warnings and 0 duplicates.
[FINDBUGS] Successfully parsed file <https://builds.apache.org/job/Atlas-1.0-AllTests/ws/client/client-v1/target/findbugs.xml>
with 0 unique warnings and 0 duplicates.
[FINDBUGS] Successfully parsed file <https://builds.apache.org/job/Atlas-1.0-AllTests/ws/client/client-v2/target/findbugs.xml>
with 0 unique warnings and 0 duplicates.
[FINDBUGS] Successfully parsed file <https://builds.apache.org/job/Atlas-1.0-AllTests/ws/client/common/target/findbugs.xml>
with 0 unique warnings and 0 duplicates.
[FINDBUGS] Successfully parsed file <https://builds.apache.org/job/Atlas-1.0-AllTests/ws/common/target/findbugs.xml>
with 0 unique warnings and 0 duplicates.
[FINDBUGS] Successfully parsed file <https://builds.apache.org/job/Atlas-1.0-AllTests/ws/graphdb/api/target/findbugs.xml>
with 0 unique warnings and 0 duplicates.
[FINDBUGS] Successfully parsed file <https://builds.apache.org/job/Atlas-1.0-AllTests/ws/graphdb/common/target/findbugs.xml>
with 0 unique warnings and 0 duplicates.
[FINDBUGS] Successfully parsed file <https://builds.apache.org/job/Atlas-1.0-AllTests/ws/graphdb/janus/target/findbugs.xml>
with 0 unique warnings and 0 duplicates.
[FINDBUGS] Successfully parsed file <https://builds.apache.org/job/Atlas-1.0-AllTests/ws/intg/target/findbugs.xml>
with 0 unique warnings and 0 duplicates.
[FINDBUGS] Successfully parsed file <https://builds.apache.org/job/Atlas-1.0-AllTests/ws/notification/target/findbugs.xml>
with 0 unique warnings and 0 duplicates.
[FINDBUGS] Successfully parsed file <https://builds.apache.org/job/Atlas-1.0-AllTests/ws/om-fwk-ocf/target/findbugs.xml>
with 0 unique warnings and 0 duplicates.
[FINDBUGS] Successfully parsed file <https://builds.apache.org/job/Atlas-1.0-AllTests/ws/omag-api/target/findbugs.xml>
with 0 unique warnings and 0 duplicates.
[FINDBUGS] Successfully parsed file <https://builds.apache.org/job/Atlas-1.0-AllTests/ws/omag-server/target/findbugs.xml>
with 0 unique warnings and 0 duplicates.
[FINDBUGS] Successfully parsed file <https://builds.apache.org/job/Atlas-1.0-AllTests/ws/omas-assetconsumer/target/findbugs.xml>
with 0 unique warnings and 0 duplicates.
[FINDBUGS] Successfully parsed file <https://builds.apache.org/job/Atlas-1.0-AllTests/ws/omas-connectedasset/target/findbugs.xml>
with 0 unique warnings and 0 duplicates.
[FINDBUGS] Successfully parsed file <https://builds.apache.org/job/Atlas-1.0-AllTests/ws/omrs/target/findbugs.xml>
with 0 unique warnings and 0 duplicates.
[FINDBUGS] Successfully parsed file <https://builds.apache.org/job/Atlas-1.0-AllTests/ws/server-api/target/findbugs.xml>
with 0 unique warnings and 0 duplicates.
[FINDBUGS] Successfully parsed file <https://builds.apache.org/job/Atlas-1.0-AllTests/ws/test-tools/target/findbugs.xml>
with 0 unique warnings and 0 duplicates.
<Git Blamer> Using GitBlamer to create author and commit information for all warnings.
<Git Blamer> GIT_COMMIT=d8cd48c1cbad8b7405c9546bd018aedd226698e3, workspace=<https://builds.apache.org/job/Atlas-1.0-AllTests/ws/>
[FINDBUGS] Computing warning deltas based on reference build #81
Archiving artifacts
TestNG Reports Processing: START
Looking for TestNG results report in workspace using pattern: **/target/surefire-reports/testng-results.xml,**/target/failsafe-reports/testng-results.xml
Saving reports...
Processing '/x1/jenkins/jenkins-home/jobs/Atlas-1.0-AllTests/builds/82/testng/testng-results-1.xml'
Processing '/x1/jenkins/jenkins-home/jobs/Atlas-1.0-AllTests/builds/82/testng/testng-results-2.xml'
Processing '/x1/jenkins/jenkins-home/jobs/Atlas-1.0-AllTests/builds/82/testng/testng-results-3.xml'
Processing '/x1/jenkins/jenkins-home/jobs/Atlas-1.0-AllTests/builds/82/testng/testng-results-4.xml'
Processing '/x1/jenkins/jenkins-home/jobs/Atlas-1.0-AllTests/builds/82/testng/testng-results-5.xml'
Processing '/x1/jenkins/jenkins-home/jobs/Atlas-1.0-AllTests/builds/82/testng/testng-results-6.xml'
Processing '/x1/jenkins/jenkins-home/jobs/Atlas-1.0-AllTests/builds/82/testng/testng-results-7.xml'
Processing '/x1/jenkins/jenkins-home/jobs/Atlas-1.0-AllTests/builds/82/testng/testng-results.xml'
TestNG Reports Processing: FINISH

Mime
View raw message