atlas-dev mailing list archives

Site index · List index
Message view « Date » · « Thread »
Top « Date » · « Thread »
From Apache Jenkins Server <jenk...@builds.apache.org>
Subject Build failed in Jenkins: Atlas-master-UnitTests #1363
Date Mon, 14 May 2018 21:36:19 GMT
See <https://builds.apache.org/job/Atlas-master-UnitTests/1363/display/redirect>

------------------------------------------
[...truncated 171.45 KB...]
[INFO] Exclude: **/public/js/external_lib/**
[INFO] Exclude: **/node_modules/**
[INFO] Exclude: **/public/js/libs/**
[INFO] Exclude: **/atlas.data/**
[INFO] Exclude: **/${sys:atlas.data}/**
[INFO] Exclude: **/policy-store.txt
[INFO] Exclude: **/*rebel*.xml
[INFO] Exclude: **/*rebel*.xml.bak
[INFO] Exclude: **/test/resources/**
[INFO] 174 resources included (use -debug for more details)
[INFO] Rat check: Summary over all files. Unapproved: 0, unknown: 0, generated: 0, approved:
174 licenses.
[INFO] 
[INFO] --- maven-resources-plugin:2.7:copy-resources (copy-resources-solr) @ atlas-repository
---
[INFO] Using 'UTF-8' encoding to copy filtered resources.
[INFO] Copying 9 resources
[INFO] 
[INFO] --- maven-remote-resources-plugin:1.5:process (default) @ atlas-repository ---
[INFO] 
[INFO] --- maven-resources-plugin:2.7:resources (default-resources) @ atlas-repository ---
[INFO] Using 'UTF-8' encoding to copy filtered resources.
[INFO] skip non existing resourceDirectory <https://builds.apache.org/job/Atlas-master-UnitTests/ws/repository/src/main/resources>
[INFO] Copying 2 resources to META-INF
[INFO] Copying 3 resources
[INFO] 
[INFO] --- maven-compiler-plugin:3.7.0:compile (default-compile) @ atlas-repository ---
[INFO] Changes detected - recompiling the module!
[INFO] Compiling 132 source files to <https://builds.apache.org/job/Atlas-master-UnitTests/ws/repository/target/classes>
[INFO] <https://builds.apache.org/job/Atlas-master-UnitTests/ws/repository/src/main/java/org/apache/atlas/repository/converters/AtlasInstanceConverter.java>:
Some input files use or override a deprecated API.
[INFO] <https://builds.apache.org/job/Atlas-master-UnitTests/ws/repository/src/main/java/org/apache/atlas/repository/converters/AtlasInstanceConverter.java>:
Recompile with -Xlint:deprecation for details.
[INFO] <https://builds.apache.org/job/Atlas-master-UnitTests/ws/repository/src/main/java/org/apache/atlas/repository/store/graph/v1/AtlasGraphUtilsV1.java>:
Some input files use unchecked or unsafe operations.
[INFO] <https://builds.apache.org/job/Atlas-master-UnitTests/ws/repository/src/main/java/org/apache/atlas/repository/store/graph/v1/AtlasGraphUtilsV1.java>:
Recompile with -Xlint:unchecked for details.
[INFO] 
[INFO] --- maven-resources-plugin:2.7:testResources (default-testResources) @ atlas-repository
---
[INFO] Using 'UTF-8' encoding to copy filtered resources.
[INFO] Copying 35 resources
[INFO] Copying 3 resources
[INFO] 
[INFO] --- maven-compiler-plugin:3.7.0:testCompile (default-testCompile) @ atlas-repository
---
[INFO] Changes detected - recompiling the module!
[INFO] Compiling 45 source files to <https://builds.apache.org/job/Atlas-master-UnitTests/ws/repository/target/test-classes>
[INFO] <https://builds.apache.org/job/Atlas-master-UnitTests/ws/repository/src/test/java/org/apache/atlas/query/BasicTestSetup.java>:
<https://builds.apache.org/job/Atlas-master-UnitTests/ws/repository/src/test/java/org/apache/atlas/query/BasicTestSetup.java>
uses or overrides a deprecated API.
[INFO] <https://builds.apache.org/job/Atlas-master-UnitTests/ws/repository/src/test/java/org/apache/atlas/query/BasicTestSetup.java>:
Recompile with -Xlint:deprecation for details.
[INFO] <https://builds.apache.org/job/Atlas-master-UnitTests/ws/repository/src/test/java/org/apache/atlas/repository/store/graph/v1/InverseReferenceUpdateV1Test.java>:
Some input files use unchecked or unsafe operations.
[INFO] <https://builds.apache.org/job/Atlas-master-UnitTests/ws/repository/src/test/java/org/apache/atlas/repository/store/graph/v1/InverseReferenceUpdateV1Test.java>:
Recompile with -Xlint:unchecked for details.
[INFO] 
[INFO] --- maven-surefire-plugin:2.18.1:test (default-test) @ atlas-repository ---
[INFO] Surefire report directory: <https://builds.apache.org/job/Atlas-master-UnitTests/ws/repository/target/surefire-reports>
[INFO] Using configured provider org.apache.maven.surefire.testng.TestNGProvider

-------------------------------------------------------
 T E S T S
-------------------------------------------------------
Running org.apache.atlas.services.MetricsServiceTest
Running org.apache.atlas.glossary.GlossaryServiceTest
Running org.apache.atlas.utils.ObjectUpdateSynchronizerTest
Running org.apache.atlas.repository.audit.CassandraAuditRepositoryTest
Running org.apache.atlas.repository.impexp.UniqueListTest
Running org.apache.atlas.TestModules
Running org.apache.atlas.repository.impexp.AtlasImportRequestTest
Running org.apache.atlas.repository.impexp.ZipSourceTest
Running org.apache.atlas.glossary.PaginationHelperTest
Running org.apache.atlas.repository.impexp.ImportTransformerJSONTest
Running org.apache.atlas.query.DSLQueriesTest
Running org.apache.atlas.repository.store.graph.v1.AtlasRelationshipStoreSoftDeleteV1Test
Running org.apache.atlas.repository.store.graph.v1.AtlasRelationshipStoreV1Test
Running org.apache.atlas.repository.impexp.TypeAttributeDifferenceTest
Running org.apache.atlas.repository.impexp.ImportTransformerTest
Running org.apache.atlas.repository.impexp.ZipSinkTest
Running org.apache.atlas.repository.migration.PathTest
Running org.apache.atlas.repository.store.graph.v1.AtlasEntityDefStoreV1Test
Running org.apache.atlas.repository.store.graph.v1.AtlasRelationshipDefStoreV1Test
Running org.apache.atlas.repository.userprofile.UserProfileServiceTest
Running org.apache.atlas.query.DSLParsingTest
Running org.apache.atlas.repository.migration.RelationshipMappingTest
Running org.apache.atlas.utils.TestResourceFileUtils
Running org.apache.atlas.repository.store.graph.AtlasTypeDefGraphStoreTest
Running org.apache.atlas.repository.store.graph.v1.InverseReferenceUpdateV1Test
Running org.apache.atlas.repository.audit.InMemoryAuditRepositoryTest
Running org.apache.atlas.repository.impexp.ImportServiceTest
Running org.apache.atlas.repository.migration.HiveParititionTest
Running org.apache.atlas.query.GremlinQueryComposerTest
Running org.apache.atlas.repository.store.graph.v1.AtlasRelationshipStoreHardDeleteV1Test
Running org.apache.atlas.repository.store.graph.v1.AtlasEntityStoreV1BulkImportPercentTest
Running org.apache.atlas.repository.tagpropagation.ClassificationPropagationTest
Running org.apache.atlas.repository.store.graph.v1.InverseReferenceUpdateSoftDeleteV1Test
Running org.apache.atlas.repository.migration.HiveStocksTest
Running org.apache.atlas.repository.migration.MigrationProgressServiceTest
Running org.apache.atlas.repository.store.graph.v1.AtlasComplexAttributesTest
Running org.apache.atlas.repository.impexp.ImportTransformsTest
Running org.apache.atlas.repository.impexp.ExportServiceTest
Running org.apache.atlas.repository.store.graph.v1.InverseReferenceUpdateHardDeleteV1Test
Running org.apache.atlas.repository.store.graph.v1.AtlasEntityStoreV1Test
Tests run: 4, Failures: 0, Errors: 0, Skipped: 0, Time elapsed: 5.452 sec - in org.apache.atlas.repository.impexp.UniqueListTest
Tests run: 0, Failures: 0, Errors: 0, Skipped: 0, Time elapsed: 5.631 sec - in org.apache.atlas.TestModules
Tests run: 0, Failures: 0, Errors: 0, Skipped: 0, Time elapsed: 5.163 sec - in org.apache.atlas.repository.store.graph.v1.AtlasRelationshipStoreV1Test
Tests run: 0, Failures: 0, Errors: 0, Skipped: 0, Time elapsed: 5.206 sec - in org.apache.atlas.utils.TestResourceFileUtils
Tests run: 0, Failures: 0, Errors: 0, Skipped: 0, Time elapsed: 4.793 sec - in org.apache.atlas.repository.store.graph.v1.InverseReferenceUpdateV1Test
Tests run: 8, Failures: 0, Errors: 0, Skipped: 0, Time elapsed: 6.372 sec - in org.apache.atlas.repository.impexp.ImportTransformerTest
Tests run: 20, Failures: 0, Errors: 0, Skipped: 0, Time elapsed: 7.551 sec - in org.apache.atlas.glossary.PaginationHelperTest
Tests run: 6, Failures: 0, Errors: 0, Skipped: 0, Time elapsed: 6.483 sec - in org.apache.atlas.repository.audit.InMemoryAuditRepositoryTest
Tests run: 1, Failures: 0, Errors: 0, Skipped: 0, Time elapsed: 8.642 sec - in org.apache.atlas.repository.impexp.ImportTransformerJSONTest
Tests run: 9, Failures: 0, Errors: 0, Skipped: 0, Time elapsed: 9.412 sec - in org.apache.atlas.utils.ObjectUpdateSynchronizerTest
Tests run: 6, Failures: 0, Errors: 0, Skipped: 0, Time elapsed: 9.55 sec - in org.apache.atlas.repository.impexp.TypeAttributeDifferenceTest
Tests run: 6, Failures: 0, Errors: 0, Skipped: 0, Time elapsed: 10.392 sec - in org.apache.atlas.repository.impexp.AtlasImportRequestTest
Tests run: 3, Failures: 0, Errors: 0, Skipped: 0, Time elapsed: 8.295 sec - in org.apache.atlas.repository.impexp.ImportTransformsTest
Tests run: 8, Failures: 0, Errors: 0, Skipped: 0, Time elapsed: 10.865 sec - in org.apache.atlas.repository.impexp.ZipSinkTest
Tests run: 9, Failures: 0, Errors: 0, Skipped: 0, Time elapsed: 9.777 sec - in org.apache.atlas.repository.store.graph.v1.AtlasEntityStoreV1BulkImportPercentTest
Tests run: 8, Failures: 0, Errors: 0, Skipped: 0, Time elapsed: 10.686 sec - in org.apache.atlas.query.DSLParsingTest
Tests run: 6, Failures: 0, Errors: 0, Skipped: 0, Time elapsed: 12.379 sec - in org.apache.atlas.repository.impexp.ZipSourceTest
Tests run: 4, Failures: 0, Errors: 0, Skipped: 0, Time elapsed: 10.56 sec - in org.apache.atlas.repository.migration.MigrationProgressServiceTest
Tests run: 39, Failures: 0, Errors: 0, Skipped: 0, Time elapsed: 27.867 sec - in org.apache.atlas.query.GremlinQueryComposerTest
Tests run: 7, Failures: 0, Errors: 0, Skipped: 7, Time elapsed: 37.646 sec - in org.apache.atlas.repository.audit.CassandraAuditRepositoryTest
Tests run: 1, Failures: 0, Errors: 0, Skipped: 0, Time elapsed: 56.599 sec - in org.apache.atlas.services.MetricsServiceTest
Tests run: 10, Failures: 0, Errors: 0, Skipped: 0, Time elapsed: 83.66 sec - in org.apache.atlas.repository.store.graph.v1.AtlasRelationshipDefStoreV1Test
Tests run: 1, Failures: 0, Errors: 0, Skipped: 0, Time elapsed: 85.699 sec - in org.apache.atlas.repository.store.graph.v1.AtlasEntityDefStoreV1Test
Tests run: 1, Failures: 0, Errors: 0, Skipped: 0, Time elapsed: 113.577 sec - in org.apache.atlas.repository.migration.RelationshipMappingTest
Tests run: 4, Failures: 0, Errors: 0, Skipped: 0, Time elapsed: 118.37 sec - in org.apache.atlas.repository.store.graph.v1.AtlasRelationshipStoreSoftDeleteV1Test
Tests run: 5, Failures: 0, Errors: 0, Skipped: 0, Time elapsed: 116.011 sec - in org.apache.atlas.repository.store.graph.v1.InverseReferenceUpdateHardDeleteV1Test
Tests run: 4, Failures: 0, Errors: 0, Skipped: 0, Time elapsed: 119.213 sec - in org.apache.atlas.repository.store.graph.v1.AtlasRelationshipStoreHardDeleteV1Test
Tests run: 5, Failures: 0, Errors: 0, Skipped: 0, Time elapsed: 121.652 sec - in org.apache.atlas.repository.store.graph.v1.InverseReferenceUpdateSoftDeleteV1Test
Tests run: 12, Failures: 0, Errors: 0, Skipped: 0, Time elapsed: 124.88 sec - in org.apache.atlas.repository.userprofile.UserProfileServiceTest
Tests run: 7, Failures: 0, Errors: 0, Skipped: 0, Time elapsed: 124.781 sec - in org.apache.atlas.repository.store.graph.v1.AtlasComplexAttributesTest
Tests run: 12, Failures: 0, Errors: 0, Skipped: 0, Time elapsed: 133.26 sec - in org.apache.atlas.repository.impexp.ExportServiceTest
Tests run: 1, Failures: 0, Errors: 0, Skipped: 0, Time elapsed: 138.129 sec - in org.apache.atlas.repository.migration.PathTest
Tests run: 18, Failures: 0, Errors: 0, Skipped: 0, Time elapsed: 140.563 sec - in org.apache.atlas.repository.store.graph.AtlasTypeDefGraphStoreTest
Tests run: 35, Failures: 0, Errors: 0, Skipped: 0, Time elapsed: 150.97 sec - in org.apache.atlas.glossary.GlossaryServiceTest
Tests run: 1, Failures: 1, Errors: 0, Skipped: 0, Time elapsed: 139.223 sec <<< FAILURE!
- in org.apache.atlas.repository.migration.HiveParititionTest
fileImporterTest(org.apache.atlas.repository.migration.HiveParititionTest)  Time elapsed:
52.037 sec  <<< FAILURE!
java.lang.NullPointerException: null
	at org.apache.atlas.repository.graph.GraphHelper.getListProperty(GraphHelper.java:1789)
	at org.apache.atlas.repository.migration.HiveParititionTest.assertPartitionKeyProperty(HiveParititionTest.java:67)
	at org.apache.atlas.repository.migration.HiveParititionTest.fileImporterTest(HiveParititionTest.java:53)

Tests run: 16, Failures: 0, Errors: 0, Skipped: 0, Time elapsed: 150.761 sec - in org.apache.atlas.repository.store.graph.v1.AtlasEntityStoreV1Test
Tests run: 1, Failures: 1, Errors: 0, Skipped: 0, Time elapsed: 141.406 sec <<< FAILURE!
- in org.apache.atlas.repository.migration.HiveStocksTest
migrateStocks(org.apache.atlas.repository.migration.HiveStocksTest)  Time elapsed: 52.444
sec  <<< FAILURE!
java.lang.AssertionError: expected [1] but found [0]
	at org.testng.Assert.fail(Assert.java:94)
	at org.testng.Assert.failNotEquals(Assert.java:496)
	at org.testng.Assert.assertEquals(Assert.java:125)
	at org.testng.Assert.assertEquals(Assert.java:372)
	at org.testng.Assert.assertEquals(Assert.java:382)
	at org.apache.atlas.repository.migration.MigrationBaseAsserts.assertHiveVertices(MigrationBaseAsserts.java:99)
	at org.apache.atlas.repository.migration.HiveStocksTest.migrateStocks(HiveStocksTest.java:47)

Tests run: 14, Failures: 0, Errors: 0, Skipped: 0, Time elapsed: 177.695 sec - in org.apache.atlas.repository.impexp.ImportServiceTest
Tests run: 9, Failures: 0, Errors: 0, Skipped: 0, Time elapsed: 183.758 sec - in org.apache.atlas.repository.tagpropagation.ClassificationPropagationTest
Tests run: 246, Failures: 0, Errors: 0, Skipped: 0, Time elapsed: 267.177 sec - in org.apache.atlas.query.DSLQueriesTest

Results :

Failed tests: 
  HiveParititionTest.fileImporterTest:53->assertPartitionKeyProperty:67 » NullPointer
  HiveStocksTest.migrateStocks:47->MigrationBaseAsserts.assertHiveVertices:99 expected
[1] but found [0]

Tests run: 547, Failures: 2, Errors: 0, Skipped: 7

[INFO] ------------------------------------------------------------------------
[INFO] Reactor Summary:
[INFO] 
[INFO] Apache Atlas Server Build Tools .................... SUCCESS [  0.705 s]
[INFO] apache-atlas ....................................... SUCCESS [  2.335 s]
[INFO] Apache Atlas Test Utility Tools .................... SUCCESS [ 10.226 s]
[INFO] Open Connector Framework (OCF) ..................... SUCCESS [  4.305 s]
[INFO] Open Metadata Repository Services (OMRS) ........... SUCCESS [  8.825 s]
[INFO] Open Metadata and Governance (OMAG) Server APIs .... SUCCESS [  0.870 s]
[INFO] Connected Asset Open Metadata Access Service (OMAS)  SUCCESS [  1.029 s]
[INFO] Asset Consumer Open Metadata Access Service (OMAS) . SUCCESS [  1.112 s]
[INFO] Open Metadata and Governance (OMAG) Server ......... SUCCESS [  1.072 s]
[INFO] Apache Atlas Integration ........................... SUCCESS [ 35.714 s]
[INFO] Apache Atlas Common ................................ SUCCESS [  4.472 s]
[INFO] Apache Atlas Client ................................ SUCCESS [  0.129 s]
[INFO] atlas-client-common ................................ SUCCESS [  0.797 s]
[INFO] atlas-client-v1 .................................... SUCCESS [  3.443 s]
[INFO] Apache Atlas Server API ............................ SUCCESS [  0.788 s]
[INFO] Apache Atlas Notification .......................... SUCCESS [ 19.181 s]
[INFO] atlas-client-v2 .................................... SUCCESS [  0.716 s]
[INFO] Apache Atlas Graph Database Projects ............... SUCCESS [  0.069 s]
[INFO] Apache Atlas Graph Database API .................... SUCCESS [  0.585 s]
[INFO] Graph Database Common Code ......................... SUCCESS [  0.747 s]
[INFO] Apache Atlas JanusGraph DB Impl .................... SUCCESS [02:34 min]
[INFO] Apache Atlas Graph Database Implementation Dependencies SUCCESS [  2.684 s]
[INFO] Shaded version of Apache hbase client .............. SUCCESS [ 12.282 s]
[INFO] Shaded version of Apache hbase server .............. SUCCESS [ 28.542 s]
[INFO] Apache Atlas Authorization ......................... SUCCESS [  5.485 s]
[INFO] Apache Atlas Repository ............................ FAILURE [04:49 min]
[INFO] Apache Atlas UI .................................... SKIPPED
[INFO] Apache Atlas Web Application ....................... SKIPPED
[INFO] Apache Atlas Documentation ......................... SKIPPED
[INFO] Apache Atlas FileSystem Model ...................... SKIPPED
[INFO] Apache Atlas Plugin Classloader .................... SKIPPED
[INFO] Apache Atlas Hive Bridge Shim ...................... SKIPPED
[INFO] Apache Atlas Hive Bridge ........................... SKIPPED
[INFO] Apache Atlas Falcon Bridge Shim .................... SKIPPED
[INFO] Apache Atlas Falcon Bridge ......................... SKIPPED
[INFO] Apache Atlas Sqoop Bridge Shim ..................... SKIPPED
[INFO] Apache Atlas Sqoop Bridge .......................... SKIPPED
[INFO] Apache Atlas Storm Bridge Shim ..................... SKIPPED
[INFO] Apache Atlas Storm Bridge .......................... SKIPPED
[INFO] Apache Atlas Hbase Bridge Shim ..................... SKIPPED
[INFO] Apache Atlas Hbase Bridge .......................... SKIPPED
[INFO] Apache Atlas Kafka Bridge .......................... SKIPPED
[INFO] Apache Atlas Distribution .......................... SKIPPED
[INFO] ------------------------------------------------------------------------
[INFO] BUILD FAILURE
[INFO] ------------------------------------------------------------------------
[INFO] Total time: 09:51 min
[INFO] Finished at: 2018-05-14T21:36:08Z
[INFO] Final Memory: 143M/2090M
[INFO] ------------------------------------------------------------------------
[ERROR] Failed to execute goal org.apache.maven.plugins:maven-surefire-plugin:2.18.1:test
(default-test) on project atlas-repository: There are test failures.
[ERROR] 
[ERROR] Please refer to <https://builds.apache.org/job/Atlas-master-UnitTests/ws/repository/target/surefire-reports>
for the individual test results.
[ERROR] -> [Help 1]
[ERROR] 
[ERROR] To see the full stack trace of the errors, re-run Maven with the -e switch.
[ERROR] Re-run Maven using the -X switch to enable full debug logging.
[ERROR] 
[ERROR] For more information about the errors and possible solutions, please read the following
articles:
[ERROR] [Help 1] http://cwiki.apache.org/confluence/display/MAVEN/MojoFailureException
[ERROR] 
[ERROR] After correcting the problems, you can resume the build with the command
[ERROR]   mvn <goals> -rf :atlas-repository
Build step 'Execute shell' marked build as failure
[CHECKSTYLE] Collecting checkstyle analysis files...
[CHECKSTYLE] Searching for all files in <https://builds.apache.org/job/Atlas-master-UnitTests/ws/>
that match the pattern **/target/checkstyle-result.xml
[CHECKSTYLE] No files found. Configuration error?
<Git Blamer> Using GitBlamer to create author and commit information for all warnings.
<Git Blamer> GIT_COMMIT=3b75d56d9e151f9ad946da0ff1bb081a784703b7, workspace=<https://builds.apache.org/job/Atlas-master-UnitTests/ws/>
[CHECKSTYLE] Computing warning deltas based on reference build #1359
[FINDBUGS] Collecting findbugs analysis files...
[FINDBUGS] Searching for all files in <https://builds.apache.org/job/Atlas-master-UnitTests/ws/>
that match the pattern **/target/findbugs.xml
[FINDBUGS] No files found. Configuration error?
<Git Blamer> Using GitBlamer to create author and commit information for all warnings.
<Git Blamer> GIT_COMMIT=3b75d56d9e151f9ad946da0ff1bb081a784703b7, workspace=<https://builds.apache.org/job/Atlas-master-UnitTests/ws/>
[FINDBUGS] Computing warning deltas based on reference build #1359
Archiving artifacts
TestNG Reports Processing: START
Looking for TestNG results report in workspace using pattern: **/target/surefire-reports/testng-results.xml,**/target/failsafe-reports/testng-results.xml
Saving reports...
Processing '/x1/jenkins/jenkins-home/jobs/Atlas-master-UnitTests/builds/1363/testng/testng-results-1.xml'
Processing '/x1/jenkins/jenkins-home/jobs/Atlas-master-UnitTests/builds/1363/testng/testng-results-2.xml'
Processing '/x1/jenkins/jenkins-home/jobs/Atlas-master-UnitTests/builds/1363/testng/testng-results-3.xml'
Processing '/x1/jenkins/jenkins-home/jobs/Atlas-master-UnitTests/builds/1363/testng/testng-results-4.xml'
Processing '/x1/jenkins/jenkins-home/jobs/Atlas-master-UnitTests/builds/1363/testng/testng-results-5.xml'
Processing '/x1/jenkins/jenkins-home/jobs/Atlas-master-UnitTests/builds/1363/testng/testng-results-6.xml'
Processing '/x1/jenkins/jenkins-home/jobs/Atlas-master-UnitTests/builds/1363/testng/testng-results-7.xml'
Processing '/x1/jenkins/jenkins-home/jobs/Atlas-master-UnitTests/builds/1363/testng/testng-results.xml'
TestNG Reports Processing: FINISH

Mime
View raw message