atlas-dev mailing list archives

Site index · List index
Message view « Date » · « Thread »
Top « Date » · « Thread »
From Apache Jenkins Server <jenk...@builds.apache.org>
Subject Build failed in Jenkins: Atlas-master-IntegrationTests #1239
Date Fri, 04 May 2018 09:42:27 GMT
See <https://builds.apache.org/job/Atlas-master-IntegrationTests/1239/display/redirect?page=changes>

Changes:

[ssubramanian] ATLAS-2643: Re-evaluate tag propagation when a relationship edge is

------------------------------------------
[...truncated 524.45 KB...]
127.0.0.1 - - [04/May/2018:08:42:17 +0000] "GET //localhost:31000/api/atlas/v2/types/typedef/name/pii_Tag
HTTP/1.1" 200 308 "-" "Java/1.8.0_172"
127.0.0.1 - - [04/May/2018:08:42:17 +0000] "GET //localhost:31000/api/atlas/v2/types/typedef/name/phi_Tag
HTTP/1.1" 200 308 "-" "Java/1.8.0_172"
127.0.0.1 - - [04/May/2018:08:42:17 +0000] "GET //localhost:31000/api/atlas/v2/types/typedef/name/pci_Tag
HTTP/1.1" 200 308 "-" "Java/1.8.0_172"
127.0.0.1 - - [04/May/2018:08:42:17 +0000] "GET //localhost:31000/api/atlas/v2/types/typedef/name/sox_Tag
HTTP/1.1" 200 308 "-" "Java/1.8.0_172"
127.0.0.1 - - [04/May/2018:08:42:17 +0000] "GET //localhost:31000/api/atlas/v2/types/typedef/name/sec_Tag
HTTP/1.1" 200 308 "-" "Java/1.8.0_172"
127.0.0.1 - - [04/May/2018:08:42:17 +0000] "GET //localhost:31000/api/atlas/v2/types/typedef/name/finance_Tag
HTTP/1.1" 200 316 "-" "Java/1.8.0_172"
127.0.0.1 - - [04/May/2018:08:42:17 +0000] "POST //localhost:31000/api/atlas/v2/types/typedefs/
HTTP/1.1" 200 5333 "-" "Java/1.8.0_172"
127.0.0.1 - - [04/May/2018:08:42:17 +0000] "POST //localhost:31000/api/atlas/v2/entity/ HTTP/1.1"
200 239 "-" "Java/1.8.0_172"
127.0.0.1 - - [04/May/2018:08:42:18 +0000] "POST //localhost:31000/api/atlas/v2/entity/ HTTP/1.1"
200 392 "-" "Java/1.8.0_172"
127.0.0.1 - - [04/May/2018:08:42:18 +0000] "GET //localhost:31000/api/atlas/v2/entity/guid/05a15e64-9371-4895-bf54-65b083e39169
HTTP/1.1" 200 1513 "-" "Java/1.8.0_172"
127.0.0.1 - - [04/May/2018:08:42:18 +0000] "POST //localhost:31000/api/atlas/v2/entity/ HTTP/1.1"
200 195 "-" "Java/1.8.0_172"
127.0.0.1 - - [04/May/2018:08:42:19 +0000] "POST //localhost:31000/api/atlas/v2/entity/guid/random/classifications
HTTP/1.1" 404 97 "-" "Java/1.8.0_172"
127.0.0.1 - - [04/May/2018:08:42:19 +0000] "POST //localhost:31000/api/atlas/v2/entity/bulk/
HTTP/1.1" 200 3530 "-" "Java/1.8.0_172"
127.0.0.1 - - [04/May/2018:08:42:19 +0000] "POST //localhost:31000/api/atlas/v2/entity/ HTTP/1.1"
200 237 "-" "Java/1.8.0_172"
127.0.0.1 - - [04/May/2018:08:42:19 +0000] "POST //localhost:31000/api/atlas/v2/entity/ HTTP/1.1"
200 237 "-" "Java/1.8.0_172"
127.0.0.1 - - [04/May/2018:08:42:19 +0000] "DELETE //localhost:31000/api/atlas/v2/entity/bulk/?guid=dfeb3168-e967-4f90-8cc7-57aeadaf12fe&guid=a0f22779-4eaf-456f-bcf6-716959b67e16
HTTP/1.1" 200 282 "-" "Java/1.8.0_172"
127.0.0.1 - - [04/May/2018:08:42:19 +0000] "POST //localhost:31000/api/atlas/v2/entity/ HTTP/1.1"
200 268 "-" "Java/1.8.0_172"
127.0.0.1 - - [04/May/2018:08:42:19 +0000] "DELETE //localhost:31000/api/atlas/v2/entity/uniqueAttribute/type/hive_db_v2?attr:name=dbiG2CkoRrXo%E8%94%B5%E5%91%94%E5%B5%BC%E4%B4%B2%D1%BE%E3%A0%B5%E7%9C%91%E8%AB%96%EE%96%92%E0%B3%9D
HTTP/1.1" 200 188 "-" "Java/1.8.0_172"
127.0.0.1 - - [04/May/2018:08:42:19 +0000] "DELETE //localhost:31000/api/atlas/v2/entity/guid/random/classification/blah_trait
HTTP/1.1" 400 105 "-" "Java/1.8.0_172"
127.0.0.1 - - [04/May/2018:08:42:19 +0000] "GET //localhost:31000/api/atlas/discovery/search/dsl?query=hive_db_v2+where+name%3D'dbiG2CkoRrXo'&limit=10&offset=0
HTTP/1.1" 200 1659 "-" "Java/1.8.0_172"
127.0.0.1 - - [04/May/2018:08:42:20 +0000] "GET //localhost:31000/api/atlas/discovery/search/dsl?query=hive_db_v2+where+name%3D'dbiG2CkoRrXo'&limit=10&offset=0
HTTP/1.1" 200 1659 "-" "Java/1.8.0_172"
127.0.0.1 - - [04/May/2018:08:42:20 +0000] "POST //localhost:31000/api/atlas/v2/entity/ HTTP/1.1"
200 387 "-" "Java/1.8.0_172"
127.0.0.1 - - [04/May/2018:08:42:21 +0000] "GET //localhost:31000/api/atlas/discovery/search/dsl?query=hive_db_v2+where+name%3D'dbiG2CkoRrXo'&limit=10&offset=0
HTTP/1.1" 200 2727 "-" "Java/1.8.0_172"
127.0.0.1 - - [04/May/2018:08:42:21 +0000] "POST //localhost:31000/api/atlas/v2/types/typedefs/
HTTP/1.1" 200 532 "-" "Java/1.8.0_172"
127.0.0.1 - - [04/May/2018:08:42:21 +0000] "POST //localhost:31000/api/atlas/v2/entity/ HTTP/1.1"
200 237 "-" "Java/1.8.0_172"
127.0.0.1 - - [04/May/2018:08:42:21 +0000] "PUT //localhost:31000/api/atlas/v2/types/typedefs/
HTTP/1.1" 200 691 "-" "Java/1.8.0_172"
127.0.0.1 - - [04/May/2018:08:42:21 +0000] "GET //localhost:31000/api/atlas/v2/entity/guid/c9900168-691f-4c2f-a466-4962819a9148
HTTP/1.1" 200 282 "-" "Java/1.8.0_172"
127.0.0.1 - - [04/May/2018:08:42:21 +0000] "POST //localhost:31000/api/atlas/v2/entity/ HTTP/1.1"
404 181 "-" "Java/1.8.0_172"
127.0.0.1 - - [04/May/2018:08:42:21 +0000] "POST //localhost:31000/api/atlas/v2/entity/ HTTP/1.1"
200 237 "-" "Java/1.8.0_172"
127.0.0.1 - - [04/May/2018:08:42:22 +0000] "POST //localhost:31000/api/atlas/v2/entity/ HTTP/1.1"
200 178 "-" "Java/1.8.0_172"
127.0.0.1 - - [04/May/2018:08:42:22 +0000] "GET //localhost:31000/api/atlas/v2/entity/uniqueAttribute/type/hive_db_v2?attr:name=dbiG2CkoRrXo
HTTP/1.1" 200 3537 "-" "Java/1.8.0_172"
127.0.0.1 - - [04/May/2018:08:42:22 +0000] "GET //localhost:31000/api/atlas/v2/entity/guid/blah
HTTP/1.1" 404 95 "-" "Java/1.8.0_172"
127.0.0.1 - - [04/May/2018:08:42:22 +0000] "POST //localhost:31000/api/atlas/v2/entity/ HTTP/1.1"
200 237 "-" "Java/1.8.0_172"
127.0.0.1 - - [04/May/2018:08:42:22 +0000] "GET //localhost:31000/api/atlas/entities/adb749b0-2495-4f9a-87c9-59afae773490/audit?count=10
HTTP/1.1" 200 953 "-" "Java/1.8.0_172"
127.0.0.1 - - [04/May/2018:08:42:22 +0000] "POST //localhost:31000/api/atlas/v2/entity/ HTTP/1.1"
200 239 "-" "Java/1.8.0_172"
127.0.0.1 - - [04/May/2018:08:42:22 +0000] "POST //localhost:31000/api/atlas/v2/entity/ HTTP/1.1"
200 392 "-" "Java/1.8.0_172"
127.0.0.1 - - [04/May/2018:08:42:22 +0000] "GET //localhost:31000/api/atlas/v2/types/typedef/name/d5RvnNAKTD
HTTP/1.1" 404 87 "-" "Java/1.8.0_172"
127.0.0.1 - - [04/May/2018:08:42:22 +0000] "POST //localhost:31000/api/atlas/v2/types/typedefs/
HTTP/1.1" 200 557 "-" "Java/1.8.0_172"
127.0.0.1 - - [04/May/2018:08:42:23 +0000] "POST //localhost:31000/api/atlas/v2/entity/ HTTP/1.1"
200 288 "-" "Java/1.8.0_172"
127.0.0.1 - - [04/May/2018:08:42:23 +0000] "GET //localhost:31000/api/atlas/v2/entity/guid/fe4e266f-0c1a-425d-99e3-e924ee8b7215
HTTP/1.1" 200 314 "-" "Java/1.8.0_172"
127.0.0.1 - - [04/May/2018:08:42:23 +0000] "GET //localhost:31000/api/atlas/v2/entity/guid/05a15e64-9371-4895-bf54-65b083e39169
HTTP/1.1" 200 1506 "-" "Java/1.8.0_172"
127.0.0.1 - - [04/May/2018:08:42:23 +0000] "POST //localhost:31000/api/atlas/v2/entity/ HTTP/1.1"
200 195 "-" "Java/1.8.0_172"
127.0.0.1 - - [04/May/2018:08:42:23 +0000] "GET //localhost:31000/api/atlas/v2/entity/guid/05a15e64-9371-4895-bf54-65b083e39169
HTTP/1.1" 200 1524 "-" "Java/1.8.0_172"
127.0.0.1 - - [04/May/2018:08:42:23 +0000] "GET //localhost:31000/api/atlas/v2/entity/guid/05a15e64-9371-4895-bf54-65b083e39169
HTTP/1.1" 200 1524 "-" "Java/1.8.0_172"
127.0.0.1 - - [04/May/2018:08:42:23 +0000] "POST //localhost:31000/api/atlas/v2/entity/ HTTP/1.1"
200 195 "-" "Java/1.8.0_172"
127.0.0.1 - - [04/May/2018:08:42:23 +0000] "GET //localhost:31000/api/atlas/v2/entity/guid/05a15e64-9371-4895-bf54-65b083e39169
HTTP/1.1" 200 1536 "-" "Java/1.8.0_172"
127.0.0.1 - - [04/May/2018:08:42:23 +0000] "GET //localhost:31000/api/atlas/v2/entity/guid/05a15e64-9371-4895-bf54-65b083e39169
HTTP/1.1" 200 1536 "-" "Java/1.8.0_172"
127.0.0.1 - - [04/May/2018:08:42:23 +0000] "POST //localhost:31000/api/atlas/v2/entity/ HTTP/1.1"
200 513 "-" "Java/1.8.0_172"
127.0.0.1 - - [04/May/2018:08:42:23 +0000] "GET //localhost:31000/api/atlas/v2/entity/guid/05a15e64-9371-4895-bf54-65b083e39169
HTTP/1.1" 200 1674 "-" "Java/1.8.0_172"
127.0.0.1 - - [04/May/2018:08:42:23 +0000] "GET //localhost:31000/api/atlas/v2/types/typedef/name/PII_Traitmj410IKFr3
HTTP/1.1" 404 96 "-" "Java/1.8.0_172"
127.0.0.1 - - [04/May/2018:08:42:23 +0000] "POST //localhost:31000/api/atlas/v2/types/typedefs/
HTTP/1.1" 200 576 "-" "Java/1.8.0_172"
127.0.0.1 - - [04/May/2018:08:42:23 +0000] "DELETE //localhost:31000/api/atlas/v2/entity/guid/05a15e64-9371-4895-bf54-65b083e39169/classification/PII_Traitmj410IKFr3
HTTP/1.1" 400 114 "-" "Java/1.8.0_172"
127.0.0.1 - - [04/May/2018:08:42:23 +0000] "GET //localhost:31000/api/atlas/v2/types/typedef/name/PII_TraitC7eVRdQgXs
HTTP/1.1" 404 96 "-" "Java/1.8.0_172"
127.0.0.1 - - [04/May/2018:08:42:23 +0000] "POST //localhost:31000/api/atlas/v2/types/typedefs/
HTTP/1.1" 200 425 "-" "Java/1.8.0_172"
127.0.0.1 - - [04/May/2018:08:42:23 +0000] "GET //localhost:31000/api/atlas/v2/types/classificationdef/name/PII_TraitC7eVRdQgXs
HTTP/1.1" 200 332 "-" "Java/1.8.0_172"
127.0.0.1 - - [04/May/2018:08:42:23 +0000] "POST //localhost:31000/api/atlas/v2/entity/guid/05a15e64-9371-4895-bf54-65b083e39169/classifications
HTTP/1.1" 204 0 "-" "Java/1.8.0_172"
127.0.0.1 - - [04/May/2018:08:42:24 +0000] "GET //localhost:31000/api/atlas/v2/entity/guid/05a15e64-9371-4895-bf54-65b083e39169/classifications
HTTP/1.1" 200 868 "-" "Java/1.8.0_172"
127.0.0.1 - - [04/May/2018:08:42:24 +0000] "GET //localhost:31000/api/atlas/v2/entity/guid/05a15e64-9371-4895-bf54-65b083e39169/classifications
HTTP/1.1" 200 868 "-" "Java/1.8.0_172"
127.0.0.1 - - [04/May/2018:08:42:24 +0000] "POST //localhost:31000/api/atlas/v2/entity/ HTTP/1.1"
200 579 "-" "Java/1.8.0_172"
127.0.0.1 - - [04/May/2018:08:42:24 +0000] "GET //localhost:31000/api/atlas/v2/entity/guid/05a15e64-9371-4895-bf54-65b083e39169
HTTP/1.1" 200 1854 "-" "Java/1.8.0_172"
127.0.0.1 - - [04/May/2018:08:42:24 +0000] "PUT //localhost:31000/api/atlas/v2/entity/uniqueAttribute/type/hive_table_v2?attr:qualifiedName=tabless8b0KkcBE
HTTP/1.1" 200 1170 "-" "Java/1.8.0_172"
127.0.0.1 - - [04/May/2018:08:42:24 +0000] "GET //localhost:31000/api/atlas/v2/entity/guid/05a15e64-9371-4895-bf54-65b083e39169
HTTP/1.1" 200 1930 "-" "Java/1.8.0_172"
127.0.0.1 - - [04/May/2018:08:42:24 +0000] "GET //localhost:31000/api/atlas/v2/types/typedef/name/PII_TraitCLmjbDEXhz
HTTP/1.1" 404 96 "-" "Java/1.8.0_172"
127.0.0.1 - - [04/May/2018:08:42:24 +0000] "POST //localhost:31000/api/atlas/v2/types/typedefs/
HTTP/1.1" 200 425 "-" "Java/1.8.0_172"
127.0.0.1 - - [04/May/2018:08:42:24 +0000] "POST //localhost:31000/api/atlas/v2/entity/guid/05a15e64-9371-4895-bf54-65b083e39169/classifications
HTTP/1.1" 204 0 "-" "Java/1.8.0_172"
127.0.0.1 - - [04/May/2018:08:42:25 +0000] "GET //localhost:31000/api/atlas/entities/05a15e64-9371-4895-bf54-65b083e39169/audit?count=100
HTTP/1.1" 200 21392 "-" "Java/1.8.0_172"
127.0.0.1 - - [04/May/2018:08:42:25 +0000] "GET //localhost:31000/api/atlas/v2/types/typedef/name/PII_TraitNKlB03n261
HTTP/1.1" 404 96 "-" "Java/1.8.0_172"
127.0.0.1 - - [04/May/2018:08:42:25 +0000] "POST //localhost:31000/api/atlas/v2/types/typedefs/
HTTP/1.1" 200 576 "-" "Java/1.8.0_172"
127.0.0.1 - - [04/May/2018:08:42:25 +0000] "POST //localhost:31000/api/atlas/v2/entity/guid/05a15e64-9371-4895-bf54-65b083e39169/classifications
HTTP/1.1" 204 0 "-" "Java/1.8.0_172"
127.0.0.1 - - [04/May/2018:08:42:26 +0000] "GET //localhost:31000/api/atlas/v2/entity/guid/05a15e64-9371-4895-bf54-65b083e39169
HTTP/1.1" 200 2166 "-" "Java/1.8.0_172"
127.0.0.1 - - [04/May/2018:08:42:26 +0000] "GET //localhost:31000/api/atlas/v2/types/typedef/name/PII_TraitkEoAZog9S0
HTTP/1.1" 404 96 "-" "Java/1.8.0_172"
127.0.0.1 - - [04/May/2018:08:42:26 +0000] "POST //localhost:31000/api/atlas/v2/types/typedefs/
HTTP/1.1" 200 425 "-" "Java/1.8.0_172"
127.0.0.1 - - [04/May/2018:08:42:26 +0000] "POST //localhost:31000/api/atlas/v2/entity/guid/05a15e64-9371-4895-bf54-65b083e39169/classifications
HTTP/1.1" 204 0 "-" "Java/1.8.0_172"
127.0.0.1 - - [04/May/2018:08:42:26 +0000] "GET //localhost:31000/api/atlas/entities/05a15e64-9371-4895-bf54-65b083e39169/audit?count=100
HTTP/1.1" 200 22090 "-" "Java/1.8.0_172"
127.0.0.1 - - [04/May/2018:08:42:26 +0000] "GET //localhost:31000/api/atlas/v2/entity/guid/05a15e64-9371-4895-bf54-65b083e39169/classifications
HTTP/1.1" 200 1315 "-" "Java/1.8.0_172"
127.0.0.1 - - [04/May/2018:08:42:26 +0000] "DELETE //localhost:31000/api/atlas/v2/entity/guid/05a15e64-9371-4895-bf54-65b083e39169/classification/PII_TraitkEoAZog9S0
HTTP/1.1" 204 0 "-" "Java/1.8.0_172"
127.0.0.1 - - [04/May/2018:08:42:26 +0000] "GET //localhost:31000/api/atlas/entities/05a15e64-9371-4895-bf54-65b083e39169/audit?count=100
HTTP/1.1" 200 22321 "-" "Java/1.8.0_172"
Tests run: 119, Failures: 1, Errors: 0, Skipped: 0, Time elapsed: 167.13 sec <<<
FAILURE! - in TestSuite
testAddReferenceProperty(org.apache.atlas.web.integration.EntityJerseyResourceIT)  Time elapsed:
0.961 sec  <<< FAILURE!
java.lang.AssertionError: expected [2] but found [3]
	at org.testng.Assert.fail(Assert.java:94)
	at org.testng.Assert.failNotEquals(Assert.java:496)
	at org.testng.Assert.assertEquals(Assert.java:125)
	at org.testng.Assert.assertEquals(Assert.java:372)
	at org.testng.Assert.assertEquals(Assert.java:382)
	at org.apache.atlas.web.integration.EntityJerseyResourceIT.testAddReferenceProperty(EntityJerseyResourceIT.java:437)


Results :

Failed tests: 
  EntityJerseyResourceIT.testAddReferenceProperty:437 expected [2] but found [3]

Tests run: 119, Failures: 1, Errors: 0, Skipped: 0

[INFO] 
[INFO] --- jetty-maven-plugin:9.3.14.v20161028:stop (stop-jetty) @ atlas-webapp ---
[INFO] Waiting 10 seconds for jetty to stop
[INFO] Stopped ServerConnector@b345eb1{HTTP/1.1,[http/1.1]}{0.0.0.0:31000}
[INFO] Closing Spring root WebApplicationContext
[INFO] Shutting down log4j
[INFO] Stopped o.e.j.m.p.JettyWebAppContext@1f38a6cb{/,file://<https://builds.apache.org/job/Atlas-master-IntegrationTests/ws/webapp/target/atlas-webapp-1.0.0-SNAPSHOT/,UNAVAILABLE}{/home/jenkins/jenkins-slave/workspace/Atlas-master-IntegrationTests/webapp/target/atlas-webapp-1.0.0-SNAPSHOT.war}>
[INFO] Server reports itself as stopped
[INFO] 
[INFO] --- maven-source-plugin:2.4:jar-no-fork (attach-sources) @ atlas-webapp ---
[INFO] Building jar: <https://builds.apache.org/job/Atlas-master-IntegrationTests/ws/webapp/target/atlas-webapp-1.0.0-SNAPSHOT-sources.jar>
log4j:WARN No appenders could be found for logger (org.apache.zookeeper.ClientCnxn).
log4j:WARN Please initialize the log4j system properly.
log4j:WARN See http://logging.apache.org/log4j/1.2/faq.html#noconfig for more info.
[INFO] 
[INFO] --- maven-source-plugin:2.4:test-jar-no-fork (attach-sources) @ atlas-webapp ---
[INFO] Building jar: <https://builds.apache.org/job/Atlas-master-IntegrationTests/ws/webapp/target/atlas-webapp-1.0.0-SNAPSHOT-test-sources.jar>
[INFO] 
[INFO] --- maven-failsafe-plugin:2.18.1:verify (verify) @ atlas-webapp ---
[INFO] Failsafe report directory: <https://builds.apache.org/job/Atlas-master-IntegrationTests/ws/webapp/target/failsafe-reports>
[INFO] ------------------------------------------------------------------------
[INFO] Reactor Summary:
[INFO] 
[INFO] Apache Atlas Server Build Tools .................... SUCCESS [  0.566 s]
[INFO] apache-atlas ....................................... SUCCESS [  3.668 s]
[INFO] Apache Atlas Test Utility Tools .................... SUCCESS [  9.067 s]
[INFO] Open Connector Framework (OCF) ..................... SUCCESS [  9.693 s]
[INFO] Open Metadata Repository Services (OMRS) ........... SUCCESS [ 29.118 s]
[INFO] Open Metadata and Governance (OMAG) Server APIs .... SUCCESS [  6.904 s]
[INFO] Connected Asset Open Metadata Access Service (OMAS)  SUCCESS [  6.908 s]
[INFO] Asset Consumer Open Metadata Access Service (OMAS) . SUCCESS [  7.616 s]
[INFO] Open Metadata and Governance (OMAG) Server ......... SUCCESS [  4.681 s]
[INFO] Apache Atlas Integration ........................... SUCCESS [ 16.604 s]
[INFO] Apache Atlas Common ................................ SUCCESS [  6.885 s]
[INFO] Apache Atlas Client ................................ SUCCESS [  0.510 s]
[INFO] atlas-client-common ................................ SUCCESS [  6.438 s]
[INFO] atlas-client-v1 .................................... SUCCESS [  6.466 s]
[INFO] Apache Atlas Server API ............................ SUCCESS [  5.302 s]
[INFO] Apache Atlas Notification .......................... SUCCESS [  8.270 s]
[INFO] atlas-client-v2 .................................... SUCCESS [  5.510 s]
[INFO] Apache Atlas Graph Database Projects ............... SUCCESS [  0.505 s]
[INFO] Apache Atlas Graph Database API .................... SUCCESS [  4.815 s]
[INFO] Graph Database Common Code ......................... SUCCESS [  5.004 s]
[INFO] Apache Atlas JanusGraph DB Impl .................... SUCCESS [ 12.742 s]
[INFO] Apache Atlas Graph Database Implementation Dependencies SUCCESS [  1.907 s]
[INFO] Shaded version of Apache hbase client .............. SUCCESS [  7.198 s]
[INFO] Shaded version of Apache hbase server .............. SUCCESS [ 19.612 s]
[INFO] Apache Atlas Authorization ......................... SUCCESS [  6.405 s]
[INFO] Apache Atlas Repository ............................ SUCCESS [ 29.485 s]
[INFO] Apache Atlas UI .................................... SUCCESS [01:26 min]
[INFO] Apache Atlas Web Application ....................... FAILURE [03:59 min]
[INFO] Apache Atlas Documentation ......................... SKIPPED
[INFO] Apache Atlas FileSystem Model ...................... SKIPPED
[INFO] Apache Atlas Plugin Classloader .................... SKIPPED
[INFO] Apache Atlas Hive Bridge Shim ...................... SKIPPED
[INFO] Apache Atlas Hive Bridge ........................... SKIPPED
[INFO] Apache Atlas Falcon Bridge Shim .................... SKIPPED
[INFO] Apache Atlas Falcon Bridge ......................... SKIPPED
[INFO] Apache Atlas Sqoop Bridge Shim ..................... SKIPPED
[INFO] Apache Atlas Sqoop Bridge .......................... SKIPPED
[INFO] Apache Atlas Storm Bridge Shim ..................... SKIPPED
[INFO] Apache Atlas Storm Bridge .......................... SKIPPED
[INFO] Apache Atlas Hbase Bridge Shim ..................... SKIPPED
[INFO] Apache Atlas Hbase Bridge .......................... SKIPPED
[INFO] Apache Atlas Kafka Bridge .......................... SKIPPED
[INFO] Apache Atlas Distribution .......................... SKIPPED
[INFO] ------------------------------------------------------------------------
[INFO] BUILD FAILURE
[INFO] ------------------------------------------------------------------------
[INFO] Total time: 09:09 min
[INFO] Finished at: 2018-05-04T08:42:32Z
[INFO] Final Memory: 374M/2920M
[INFO] ------------------------------------------------------------------------
[ERROR] Failed to execute goal org.apache.maven.plugins:maven-failsafe-plugin:2.18.1:verify
(verify) on project atlas-webapp: There are test failures.
[ERROR] 
[ERROR] Please refer to <https://builds.apache.org/job/Atlas-master-IntegrationTests/ws/webapp/target/failsafe-reports>
for the individual test results.
[ERROR] -> [Help 1]
[ERROR] 
[ERROR] To see the full stack trace of the errors, re-run Maven with the -e switch.
[ERROR] Re-run Maven using the -X switch to enable full debug logging.
[ERROR] 
[ERROR] For more information about the errors and possible solutions, please read the following
articles:
[ERROR] [Help 1] http://cwiki.apache.org/confluence/display/MAVEN/MojoFailureException
[ERROR] 
[ERROR] After correcting the problems, you can resume the build with the command
[ERROR]   mvn <goals> -rf :atlas-webapp
Build step 'Execute shell' marked build as failure
[CHECKSTYLE] Collecting checkstyle analysis files...
[CHECKSTYLE] Searching for all files in <https://builds.apache.org/job/Atlas-master-IntegrationTests/ws/>
that match the pattern **/target/checkstyle-result.xml
[CHECKSTYLE] Parsing 26 files in <https://builds.apache.org/job/Atlas-master-IntegrationTests/ws/>
[CHECKSTYLE] Successfully parsed file <https://builds.apache.org/job/Atlas-master-IntegrationTests/ws/authorization/target/checkstyle-result.xml>
with 669 unique warnings and 0 duplicates.
[CHECKSTYLE] Successfully parsed file <https://builds.apache.org/job/Atlas-master-IntegrationTests/ws/client/client-v1/target/checkstyle-result.xml>
with 1556 unique warnings and 0 duplicates.
[CHECKSTYLE] Successfully parsed file <https://builds.apache.org/job/Atlas-master-IntegrationTests/ws/client/client-v2/target/checkstyle-result.xml>
with 1915 unique warnings and 0 duplicates.
[CHECKSTYLE] Successfully parsed file <https://builds.apache.org/job/Atlas-master-IntegrationTests/ws/client/common/target/checkstyle-result.xml>
with 2406 unique warnings and 0 duplicates.
[CHECKSTYLE] Successfully parsed file <https://builds.apache.org/job/Atlas-master-IntegrationTests/ws/client/target/checkstyle-result.xml>
with 2406 unique warnings and 0 duplicates.
[CHECKSTYLE] Successfully parsed file <https://builds.apache.org/job/Atlas-master-IntegrationTests/ws/common/target/checkstyle-result.xml>
with 3462 unique warnings and 0 duplicates.
[CHECKSTYLE] Successfully parsed file <https://builds.apache.org/job/Atlas-master-IntegrationTests/ws/dashboardv2/target/checkstyle-result.xml>
with 3462 unique warnings and 0 duplicates.
[CHECKSTYLE] Successfully parsed file <https://builds.apache.org/job/Atlas-master-IntegrationTests/ws/graphdb/api/target/checkstyle-result.xml>
with 3762 unique warnings and 0 duplicates.
[CHECKSTYLE] Successfully parsed file <https://builds.apache.org/job/Atlas-master-IntegrationTests/ws/graphdb/common/target/checkstyle-result.xml>
with 3988 unique warnings and 0 duplicates.
[CHECKSTYLE] Successfully parsed file <https://builds.apache.org/job/Atlas-master-IntegrationTests/ws/graphdb/graphdb-impls/target/checkstyle-result.xml>
with 3988 unique warnings and 0 duplicates.
[CHECKSTYLE] Successfully parsed file <https://builds.apache.org/job/Atlas-master-IntegrationTests/ws/graphdb/janus/target/checkstyle-result.xml>
with 5766 unique warnings and 0 duplicates.
[CHECKSTYLE] Successfully parsed file <https://builds.apache.org/job/Atlas-master-IntegrationTests/ws/graphdb/target/checkstyle-result.xml>
with 5766 unique warnings and 0 duplicates.
[CHECKSTYLE] Successfully parsed file <https://builds.apache.org/job/Atlas-master-IntegrationTests/ws/intg/target/checkstyle-result.xml>
with 17588 unique warnings and 0 duplicates.
[CHECKSTYLE] Successfully parsed file <https://builds.apache.org/job/Atlas-master-IntegrationTests/ws/notification/target/checkstyle-result.xml>
with 18824 unique warnings and 0 duplicates.
[CHECKSTYLE] Successfully parsed file <https://builds.apache.org/job/Atlas-master-IntegrationTests/ws/om-fwk-ocf/target/checkstyle-result.xml>
with 23865 unique warnings and 0 duplicates.
[CHECKSTYLE] Successfully parsed file <https://builds.apache.org/job/Atlas-master-IntegrationTests/ws/omag-api/target/checkstyle-result.xml>
with 25420 unique warnings and 0 duplicates.
[CHECKSTYLE] Successfully parsed file <https://builds.apache.org/job/Atlas-master-IntegrationTests/ws/omag-server/target/checkstyle-result.xml>
with 25429 unique warnings and 0 duplicates.
[CHECKSTYLE] Successfully parsed file <https://builds.apache.org/job/Atlas-master-IntegrationTests/ws/omas-assetconsumer/target/checkstyle-result.xml>
with 28268 unique warnings and 0 duplicates.
[CHECKSTYLE] Successfully parsed file <https://builds.apache.org/job/Atlas-master-IntegrationTests/ws/omas-connectedasset/target/checkstyle-result.xml>
with 31681 unique warnings and 0 duplicates.
[CHECKSTYLE] Successfully parsed file <https://builds.apache.org/job/Atlas-master-IntegrationTests/ws/omrs/target/checkstyle-result.xml>
with 71652 unique warnings and 0 duplicates.
[CHECKSTYLE] Successfully parsed file <https://builds.apache.org/job/Atlas-master-IntegrationTests/ws/repository/target/checkstyle-result.xml>
with 91549 unique warnings and 0 duplicates.
[CHECKSTYLE] Successfully parsed file <https://builds.apache.org/job/Atlas-master-IntegrationTests/ws/server-api/target/checkstyle-result.xml>
with 91715 unique warnings and 0 duplicates.
[CHECKSTYLE] Successfully parsed file <https://builds.apache.org/job/Atlas-master-IntegrationTests/ws/shaded/hbase-client-shaded/target/checkstyle-result.xml>
with 91715 unique warnings and 0 duplicates.
[CHECKSTYLE] Successfully parsed file <https://builds.apache.org/job/Atlas-master-IntegrationTests/ws/shaded/hbase-server-shaded/target/checkstyle-result.xml>
with 91715 unique warnings and 0 duplicates.
[CHECKSTYLE] Successfully parsed file <https://builds.apache.org/job/Atlas-master-IntegrationTests/ws/target/checkstyle-result.xml>
with 91715 unique warnings and 0 duplicates.
[CHECKSTYLE] Successfully parsed file <https://builds.apache.org/job/Atlas-master-IntegrationTests/ws/test-tools/target/checkstyle-result.xml>
with 91753 unique warnings and 0 duplicates.
<Git Blamer> Using GitBlamer to create author and commit information for all warnings.
<Git Blamer> GIT_COMMIT=967bf67eb6858c91c97b13e2b1c60caa1d51299c, workspace=<https://builds.apache.org/job/Atlas-master-IntegrationTests/ws/>
 > git rev-parse 967bf67eb6858c91c97b13e2b1c60caa1d51299c^{commit} # timeout=10
<Git Blamer> Skipping file <https://builds.apache.org/job/Atlas-master-IntegrationTests/ws/repository/src/main/java/org/apache/atlas/discovery/SearchIndexer.java,>
no result found.
[CHECKSTYLE] Computing warning deltas based on reference build #1238
[FINDBUGS] Collecting findbugs analysis files...
[FINDBUGS] Searching for all files in <https://builds.apache.org/job/Atlas-master-IntegrationTests/ws/>
that match the pattern **/target/findbugs.xml
[FINDBUGS] Parsing 19 files in <https://builds.apache.org/job/Atlas-master-IntegrationTests/ws/>
[FINDBUGS] Successfully parsed file <https://builds.apache.org/job/Atlas-master-IntegrationTests/ws/authorization/target/findbugs.xml>
with 0 unique warnings and 0 duplicates.
[FINDBUGS] Successfully parsed file <https://builds.apache.org/job/Atlas-master-IntegrationTests/ws/client/client-v1/target/findbugs.xml>
with 0 unique warnings and 0 duplicates.
[FINDBUGS] Successfully parsed file <https://builds.apache.org/job/Atlas-master-IntegrationTests/ws/client/client-v2/target/findbugs.xml>
with 0 unique warnings and 0 duplicates.
[FINDBUGS] Successfully parsed file <https://builds.apache.org/job/Atlas-master-IntegrationTests/ws/client/common/target/findbugs.xml>
with 0 unique warnings and 0 duplicates.
[FINDBUGS] Successfully parsed file <https://builds.apache.org/job/Atlas-master-IntegrationTests/ws/common/target/findbugs.xml>
with 0 unique warnings and 0 duplicates.
[FINDBUGS] Successfully parsed file <https://builds.apache.org/job/Atlas-master-IntegrationTests/ws/graphdb/api/target/findbugs.xml>
with 0 unique warnings and 0 duplicates.
[FINDBUGS] Successfully parsed file <https://builds.apache.org/job/Atlas-master-IntegrationTests/ws/graphdb/common/target/findbugs.xml>
with 0 unique warnings and 0 duplicates.
[FINDBUGS] Successfully parsed file <https://builds.apache.org/job/Atlas-master-IntegrationTests/ws/graphdb/janus/target/findbugs.xml>
with 0 unique warnings and 0 duplicates.
[FINDBUGS] Successfully parsed file <https://builds.apache.org/job/Atlas-master-IntegrationTests/ws/intg/target/findbugs.xml>
with 0 unique warnings and 0 duplicates.
[FINDBUGS] Successfully parsed file <https://builds.apache.org/job/Atlas-master-IntegrationTests/ws/notification/target/findbugs.xml>
with 0 unique warnings and 0 duplicates.
[FINDBUGS] Successfully parsed file <https://builds.apache.org/job/Atlas-master-IntegrationTests/ws/om-fwk-ocf/target/findbugs.xml>
with 0 unique warnings and 0 duplicates.
[FINDBUGS] Successfully parsed file <https://builds.apache.org/job/Atlas-master-IntegrationTests/ws/omag-api/target/findbugs.xml>
with 0 unique warnings and 0 duplicates.
[FINDBUGS] Successfully parsed file <https://builds.apache.org/job/Atlas-master-IntegrationTests/ws/omag-server/target/findbugs.xml>
with 0 unique warnings and 0 duplicates.
[FINDBUGS] Successfully parsed file <https://builds.apache.org/job/Atlas-master-IntegrationTests/ws/omas-assetconsumer/target/findbugs.xml>
with 0 unique warnings and 0 duplicates.
[FINDBUGS] Successfully parsed file <https://builds.apache.org/job/Atlas-master-IntegrationTests/ws/omas-connectedasset/target/findbugs.xml>
with 0 unique warnings and 0 duplicates.
[FINDBUGS] Successfully parsed file <https://builds.apache.org/job/Atlas-master-IntegrationTests/ws/omrs/target/findbugs.xml>
with 0 unique warnings and 0 duplicates.
[FINDBUGS] Successfully parsed file <https://builds.apache.org/job/Atlas-master-IntegrationTests/ws/repository/target/findbugs.xml>
with 0 unique warnings and 0 duplicates.
[FINDBUGS] Successfully parsed file <https://builds.apache.org/job/Atlas-master-IntegrationTests/ws/server-api/target/findbugs.xml>
with 0 unique warnings and 0 duplicates.
[FINDBUGS] Successfully parsed file <https://builds.apache.org/job/Atlas-master-IntegrationTests/ws/test-tools/target/findbugs.xml>
with 0 unique warnings and 0 duplicates.
<Git Blamer> Using GitBlamer to create author and commit information for all warnings.
<Git Blamer> GIT_COMMIT=967bf67eb6858c91c97b13e2b1c60caa1d51299c, workspace=<https://builds.apache.org/job/Atlas-master-IntegrationTests/ws/>
[FINDBUGS] Computing warning deltas based on reference build #1238
Archiving artifacts
[Fast Archiver] Compressed 165.39 MB of artifacts by 84.3% relative to #1238
TestNG Reports Processing: START
Looking for TestNG results report in workspace using pattern: **/target/surefire-reports/testng-results.xml,**/target/failsafe-reports/testng-results.xml
Saving reports...
Processing '/x1/jenkins/jenkins-home/jobs/Atlas-master-IntegrationTests/builds/1239/testng/testng-results.xml'
0.840336% of tests failed, which exceeded threshold of 0%. Marking build as UNSTABLE
TestNG Reports Processing: FINISH

Mime
View raw message