atlas-dev mailing list archives

Site index · List index
Message view « Date » · « Thread »
Top « Date » · « Thread »
From Apache Jenkins Server <jenk...@builds.apache.org>
Subject Build failed in Jenkins: Atlas-master-IntegrationTests #1428
Date Thu, 24 May 2018 03:32:40 GMT
See <https://builds.apache.org/job/Atlas-master-IntegrationTests/1428/display/redirect?page=changes>

Changes:

[apoorvnaik] Updates to HDFSNameServiceResolver

------------------------------------------
[...truncated 555.07 KB...]
127.0.0.1 - - [24/May/2018:02:48:46 +0000] "POST //localhost:31000/api/atlas/entities HTTP/1.1"
201 2302 "-" "Java/1.8.0_172"
127.0.0.1 - - [24/May/2018:02:48:47 +0000] "PUT //localhost:31000/api/atlas/entities HTTP/1.1"
200 1254 "-" "Java/1.8.0_172"
127.0.0.1 - - [24/May/2018:02:48:47 +0000] "GET //localhost:31000/api/atlas/entities/729dbce9-89fe-4111-9b5e-341706339810
HTTP/1.1" 200 3674 "-" "Java/1.8.0_172"
127.0.0.1 - - [24/May/2018:02:48:47 +0000] "GET //localhost:31000/api/atlas/v2/types/typedef/name/testFCBlXhLku3
HTTP/1.1" 404 91 "-" "Java/1.8.0_172"
127.0.0.1 - - [24/May/2018:02:48:47 +0000] "POST //localhost:31000/api/atlas/types HTTP/1.1"
201 108 "-" "Java/1.8.0_172"
127.0.0.1 - - [24/May/2018:02:48:47 +0000] "GET //localhost:31000/api/atlas/entities?type=testFCBlXhLku3
HTTP/1.1" 200 123 "-" "Java/1.8.0_172"
127.0.0.1 - - [24/May/2018:02:48:47 +0000] "POST //localhost:31000/api/atlas/entities HTTP/1.1"
201 883 "-" "Java/1.8.0_172"
127.0.0.1 - - [24/May/2018:02:48:47 +0000] "POST //localhost:31000/api/atlas/entities HTTP/1.1"
201 2302 "-" "Java/1.8.0_172"
127.0.0.1 - - [24/May/2018:02:48:48 +0000] "GET //localhost:31000/api/atlas/entities/f4ac9f8f-171f-428e-a37c-b9dc8099cd29
HTTP/1.1" 200 2087 "-" "Java/1.8.0_172"
127.0.0.1 - - [24/May/2018:02:48:48 +0000] "POST //localhost:31000/api/atlas/entities HTTP/1.1"
201 883 "-" "Java/1.8.0_172"
127.0.0.1 - - [24/May/2018:02:48:48 +0000] "POST //localhost:31000/api/atlas/entities HTTP/1.1"
201 2302 "-" "Java/1.8.0_172"
127.0.0.1 - - [24/May/2018:02:48:49 +0000] "POST //localhost:31000/api/atlas/entities/8cf2ba8c-570a-40da-b540-dc6ea051559a?property=description
HTTP/1.1" 200 2162 "-" "Java/1.8.0_172"
127.0.0.1 - - [24/May/2018:02:48:49 +0000] "GET //localhost:31000/api/atlas/entities/8cf2ba8c-570a-40da-b540-dc6ea051559a
HTTP/1.1" 200 2098 "-" "Java/1.8.0_172"
127.0.0.1 - - [24/May/2018:02:48:49 +0000] "POST //localhost:31000/api/atlas/entities/8cf2ba8c-570a-40da-b540-dc6ea051559a?property=invalid_property
HTTP/1.1" 400 68 "-" "Java/1.8.0_172"
127.0.0.1 - - [24/May/2018:02:48:49 +0000] "GET //localhost:31000/api/atlas/entities/8cf2ba8c-570a-40da-b540-dc6ea051559a
HTTP/1.1" 200 2098 "-" "Java/1.8.0_172"
127.0.0.1 - - [24/May/2018:02:48:49 +0000] "GET //localhost:31000/api/atlas/v2/types/typedef/name/PII_TraithoieViglwC
HTTP/1.1" 404 96 "-" "Java/1.8.0_172"
127.0.0.1 - - [24/May/2018:02:48:49 +0000] "POST //localhost:31000/api/atlas/v2/types/typedefs/
HTTP/1.1" 200 425 "-" "Java/1.8.0_172"
127.0.0.1 - - [24/May/2018:02:48:49 +0000] "POST //localhost:31000/api/atlas/v2/entity/guid/3293ac3e-dd87-44fa-b53f-572f119c217c/classifications
HTTP/1.1" 204 0 "-" "Java/1.8.0_172"
127.0.0.1 - - [24/May/2018:02:48:49 +0000] "GET //localhost:31000/api/atlas/entities/3293ac3e-dd87-44fa-b53f-572f119c217c/audit?count=100
HTTP/1.1" 200 21392 "-" "Java/1.8.0_172"
127.0.0.1 - - [24/May/2018:02:48:49 +0000] "GET //localhost:31000/api/atlas/v2/types/typedef/name/PII_TraitmrFV3ziAqS
HTTP/1.1" 404 96 "-" "Java/1.8.0_172"
127.0.0.1 - - [24/May/2018:02:48:49 +0000] "POST //localhost:31000/api/atlas/v2/types/typedefs/
HTTP/1.1" 200 606 "-" "Java/1.8.0_172"
127.0.0.1 - - [24/May/2018:02:48:49 +0000] "POST //localhost:31000/api/atlas/v2/entity/guid/3293ac3e-dd87-44fa-b53f-572f119c217c/classifications
HTTP/1.1" 204 0 "-" "Java/1.8.0_172"
127.0.0.1 - - [24/May/2018:02:48:50 +0000] "GET //localhost:31000/api/atlas/v2/entity/guid/3293ac3e-dd87-44fa-b53f-572f119c217c
HTTP/1.1" 200 2126 "-" "Java/1.8.0_172"
127.0.0.1 - - [24/May/2018:02:48:50 +0000] "GET //localhost:31000/api/atlas/v2/types/typedef/name/PII_TraitBk98qtSo8l
HTTP/1.1" 404 96 "-" "Java/1.8.0_172"
127.0.0.1 - - [24/May/2018:02:48:50 +0000] "POST //localhost:31000/api/atlas/v2/types/typedefs/
HTTP/1.1" 200 425 "-" "Java/1.8.0_172"
127.0.0.1 - - [24/May/2018:02:48:50 +0000] "POST //localhost:31000/api/atlas/v2/entity/guid/3293ac3e-dd87-44fa-b53f-572f119c217c/classifications
HTTP/1.1" 204 0 "-" "Java/1.8.0_172"
127.0.0.1 - - [24/May/2018:02:48:50 +0000] "GET //localhost:31000/api/atlas/entities/3293ac3e-dd87-44fa-b53f-572f119c217c/audit?count=100
HTTP/1.1" 200 22090 "-" "Java/1.8.0_172"
127.0.0.1 - - [24/May/2018:02:48:50 +0000] "GET //localhost:31000/api/atlas/v2/entity/guid/3293ac3e-dd87-44fa-b53f-572f119c217c/classifications
HTTP/1.1" 200 1315 "-" "Java/1.8.0_172"
127.0.0.1 - - [24/May/2018:02:48:50 +0000] "GET //localhost:31000/api/atlas/types/blah HTTP/1.1"
404 43 "-" "Java/1.8.0_172"
127.0.0.1 - - [24/May/2018:02:48:51 +0000] "GET //localhost:31000/api/atlas/v2/types/typedef/name/class_trait
HTTP/1.1" 404 88 "-" "Java/1.8.0_172"
127.0.0.1 - - [24/May/2018:02:48:51 +0000] "POST //localhost:31000/api/atlas/types HTTP/1.1"
201 105 "-" "Java/1.8.0_172"
127.0.0.1 - - [24/May/2018:02:48:51 +0000] "GET //localhost:31000/api/atlas/v2/types/typedef/name/secure_trait
HTTP/1.1" 404 89 "-" "Java/1.8.0_172"
127.0.0.1 - - [24/May/2018:02:48:51 +0000] "POST //localhost:31000/api/atlas/types HTTP/1.1"
201 106 "-" "Java/1.8.0_172"
127.0.0.1 - - [24/May/2018:02:48:51 +0000] "GET //localhost:31000/api/atlas/v2/types/typedef/name/pii_trait
HTTP/1.1" 404 86 "-" "Java/1.8.0_172"
127.0.0.1 - - [24/May/2018:02:48:51 +0000] "POST //localhost:31000/api/atlas/types HTTP/1.1"
201 103 "-" "Java/1.8.0_172"
127.0.0.1 - - [24/May/2018:02:48:51 +0000] "GET //localhost:31000/api/atlas/v2/types/typedef/name/ssn_trait
HTTP/1.1" 404 86 "-" "Java/1.8.0_172"
127.0.0.1 - - [24/May/2018:02:48:51 +0000] "POST //localhost:31000/api/atlas/types HTTP/1.1"
201 103 "-" "Java/1.8.0_172"
127.0.0.1 - - [24/May/2018:02:48:51 +0000] "GET //localhost:31000/api/atlas/v2/types/typedef/name/salary_trait
HTTP/1.1" 404 89 "-" "Java/1.8.0_172"
127.0.0.1 - - [24/May/2018:02:48:51 +0000] "POST //localhost:31000/api/atlas/types HTTP/1.1"
201 106 "-" "Java/1.8.0_172"
127.0.0.1 - - [24/May/2018:02:48:51 +0000] "GET //localhost:31000/api/atlas/v2/types/typedef/name/sox_trait
HTTP/1.1" 404 86 "-" "Java/1.8.0_172"
127.0.0.1 - - [24/May/2018:02:48:51 +0000] "POST //localhost:31000/api/atlas/types HTTP/1.1"
201 103 "-" "Java/1.8.0_172"
127.0.0.1 - - [24/May/2018:02:48:51 +0000] "GET //localhost:31000/api/atlas/types?type=TRAIT
HTTP/1.1" 200 1083 "-" "Java/1.8.0_172"
127.0.0.1 - - [24/May/2018:02:48:51 +0000] "GET //localhost:31000/api/atlas/v2/types/typedef/name/AUXl6DlGmqr
HTTP/1.1" 404 88 "-" "Java/1.8.0_172"
127.0.0.1 - - [24/May/2018:02:48:51 +0000] "POST //localhost:31000/api/atlas/types HTTP/1.1"
201 105 "-" "Java/1.8.0_172"
127.0.0.1 - - [24/May/2018:02:48:51 +0000] "GET //localhost:31000/api/atlas/v2/types/typedef/name/A1z8eiRUhOJD
HTTP/1.1" 404 89 "-" "Java/1.8.0_172"
127.0.0.1 - - [24/May/2018:02:48:51 +0000] "POST //localhost:31000/api/atlas/types HTTP/1.1"
201 106 "-" "Java/1.8.0_172"
127.0.0.1 - - [24/May/2018:02:48:51 +0000] "GET //localhost:31000/api/atlas/v2/types/typedef/name/BGEeemDQKkZ
HTTP/1.1" 404 88 "-" "Java/1.8.0_172"
127.0.0.1 - - [24/May/2018:02:48:51 +0000] "POST //localhost:31000/api/atlas/types HTTP/1.1"
201 105 "-" "Java/1.8.0_172"
127.0.0.1 - - [24/May/2018:02:48:51 +0000] "GET //localhost:31000/api/atlas/v2/types/typedef/name/CUrJPAyI4OF
HTTP/1.1" 404 88 "-" "Java/1.8.0_172"
127.0.0.1 - - [24/May/2018:02:48:51 +0000] "POST //localhost:31000/api/atlas/types HTTP/1.1"
201 105 "-" "Java/1.8.0_172"
127.0.0.1 - - [24/May/2018:02:48:52 +0000] "GET //localhost:31000/api/atlas/types?type=CLASS&supertype=AUXl6DlGmqr&notsupertype=BGEeemDQKkZ
HTTP/1.1" 200 109 "-" "Java/1.8.0_172"
127.0.0.1 - - [24/May/2018:02:48:52 +0000] "GET //localhost:31000/api/atlas/types/database
HTTP/1.1" 200 749 "-" "Java/1.8.0_172"
127.0.0.1 - - [24/May/2018:02:48:52 +0000] "GET //localhost:31000/api/atlas/types/table HTTP/1.1"
200 1726 "-" "Java/1.8.0_172"
127.0.0.1 - - [24/May/2018:02:48:52 +0000] "GET //localhost:31000/api/atlas/types/fetl HTTP/1.1"
200 540 "-" "Java/1.8.0_172"
127.0.0.1 - - [24/May/2018:02:48:52 +0000] "POST //localhost:31000/api/atlas/types HTTP/1.1"
201 104 "-" "Java/1.8.0_172"
127.0.0.1 - - [24/May/2018:02:48:52 +0000] "PUT //localhost:31000/api/atlas/types HTTP/1.1"
200 104 "-" "Java/1.8.0_172"
127.0.0.1 - - [24/May/2018:02:48:52 +0000] "GET //localhost:31000/api/atlas/types/tpDcWdkbfX
HTTP/1.1" 200 755 "-" "Java/1.8.0_172"
127.0.0.1 - - [24/May/2018:02:48:52 +0000] "POST //localhost:31000/api/atlas/types HTTP/1.1"
201 104 "-" "Java/1.8.0_172"
127.0.0.1 - - [24/May/2018:02:48:52 +0000] "POST //localhost:31000/api/atlas/types HTTP/1.1"
409 48 "-" "Java/1.8.0_172"
127.0.0.1 - - [24/May/2018:02:48:52 +0000] "DELETE //localhost:31000/api/atlas/v2/entity/guid/3293ac3e-dd87-44fa-b53f-572f119c217c/classification/PII_TraitBk98qtSo8l
HTTP/1.1" 204 0 "-" "Java/1.8.0_172"
127.0.0.1 - - [24/May/2018:02:48:52 +0000] "GET //localhost:31000/api/atlas/entities/3293ac3e-dd87-44fa-b53f-572f119c217c/audit?count=100
HTTP/1.1" 200 22321 "-" "Java/1.8.0_172"
127.0.0.1 - - [24/May/2018:02:48:52 +0000] "GET //localhost:31000/api/atlas/types/database
HTTP/1.1" 200 749 "-" "Java/1.8.0_172"
127.0.0.1 - - [24/May/2018:02:48:52 +0000] "GET //localhost:31000/api/atlas/types/table HTTP/1.1"
200 1726 "-" "Java/1.8.0_172"
127.0.0.1 - - [24/May/2018:02:48:52 +0000] "GET //localhost:31000/api/atlas/types/fetl HTTP/1.1"
200 540 "-" "Java/1.8.0_172"
127.0.0.1 - - [24/May/2018:02:48:52 +0000] "GET //localhost:31000/api/atlas/types HTTP/1.1"
200 2552 "-" "Java/1.8.0_172"
Tests run: 119, Failures: 2, Errors: 0, Skipped: 0, Time elapsed: 205.806 sec <<<
FAILURE! - in TestSuite
testMessageHandleFailureConsumerContinues(org.apache.atlas.notification.NotificationHookConsumerIT)
 Time elapsed: 4.787 sec  <<< FAILURE!
org.apache.atlas.AtlasServiceException: Metadata service API org.apache.atlas.AtlasClient$API_V1@3ebca6c0
failed with status 500 (Internal Server Error) Response Body ({"error":"Gremlin script execution
failed: g.V().has('__typeName', 'hive_db').has('Asset.name', eq('dbRVJlAsp6qV')).dedup().limit(10).toList()"})
	at org.apache.atlas.AtlasBaseClient.callAPIWithResource(AtlasBaseClient.java:395)
	at org.apache.atlas.AtlasBaseClient.callAPIWithResource(AtlasBaseClient.java:323)
	at org.apache.atlas.AtlasBaseClient.callAPIWithRetries(AtlasBaseClient.java:479)
	at org.apache.atlas.AtlasClient.callAPIWithRetries(AtlasClient.java:931)
	at org.apache.atlas.AtlasClient.searchByDSL(AtlasClient.java:802)
	at org.apache.atlas.web.integration.BaseResourceIT.searchByDSL(BaseResourceIT.java:681)
	at org.apache.atlas.notification.NotificationHookConsumerIT.access$000(NotificationHookConsumerIT.java:40)

testUpdateEntityPartial(org.apache.atlas.notification.NotificationHookConsumerIT)  Time elapsed:
7.053 sec  <<< FAILURE!
org.apache.atlas.AtlasServiceException: Metadata service API org.apache.atlas.AtlasClient$API_V1@26d0302c
failed with status 500 (Internal Server Error) Response Body ({"error":"Could not execute
operation due to backend exception"})
	at org.apache.atlas.AtlasBaseClient.callAPIWithResource(AtlasBaseClient.java:395)
	at org.apache.atlas.AtlasBaseClient.callAPIWithResource(AtlasBaseClient.java:323)
	at org.apache.atlas.AtlasBaseClient.callAPIWithRetries(AtlasBaseClient.java:479)
	at org.apache.atlas.AtlasClient.callAPIWithRetries(AtlasClient.java:931)
	at org.apache.atlas.AtlasClient.getEntity(AtlasClient.java:640)
	at org.apache.atlas.notification.NotificationHookConsumerIT$3.evaluate(NotificationHookConsumerIT.java:144)
	at org.apache.atlas.web.integration.BaseResourceIT.waitFor(BaseResourceIT.java:620)
	at org.apache.atlas.notification.NotificationHookConsumerIT.testUpdateEntityPartial(NotificationHookConsumerIT.java:141)


Results :

Failed tests: 
  NotificationHookConsumerIT.testMessageHandleFailureConsumerContinues:84->BaseResourceIT.waitFor:620->access$000:40->BaseResourceIT.searchByDSL:681
» AtlasService
  NotificationHookConsumerIT.testUpdateEntityPartial:141->BaseResourceIT.waitFor:620 »
AtlasService

Tests run: 119, Failures: 2, Errors: 0, Skipped: 0

[INFO] 
[INFO] --- jetty-maven-plugin:9.3.14.v20161028:stop (stop-jetty) @ atlas-webapp ---
[INFO] Waiting 10 seconds for jetty to stop
[INFO] Stopped ServerConnector@40478ed4{HTTP/1.1,[http/1.1]}{0.0.0.0:31000}
[INFO] Closing Spring root WebApplicationContext
[INFO] Shutting down log4j
[INFO] Stopped o.e.j.m.p.JettyWebAppContext@7021e295{/,file://<https://builds.apache.org/job/Atlas-master-IntegrationTests/ws/webapp/target/atlas-webapp-1.0.0-SNAPSHOT/,UNAVAILABLE}{/home/jenkins/jenkins-slave/workspace/Atlas-master-IntegrationTests/webapp/target/atlas-webapp-1.0.0-SNAPSHOT.war}>
[INFO] Server reports itself as stopped
[INFO] 
[INFO] --- maven-source-plugin:2.4:jar-no-fork (attach-sources) @ atlas-webapp ---
[INFO] Building jar: <https://builds.apache.org/job/Atlas-master-IntegrationTests/ws/webapp/target/atlas-webapp-1.0.0-SNAPSHOT-sources.jar>
log4j:WARN No appenders could be found for logger (org.apache.zookeeper.ClientCnxn).
log4j:WARN Please initialize the log4j system properly.
log4j:WARN See http://logging.apache.org/log4j/1.2/faq.html#noconfig for more info.
[INFO] 
[INFO] --- maven-source-plugin:2.4:test-jar-no-fork (attach-sources) @ atlas-webapp ---
[INFO] Building jar: <https://builds.apache.org/job/Atlas-master-IntegrationTests/ws/webapp/target/atlas-webapp-1.0.0-SNAPSHOT-test-sources.jar>
[INFO] 
[INFO] --- maven-failsafe-plugin:2.18.1:verify (verify) @ atlas-webapp ---
[INFO] Failsafe report directory: <https://builds.apache.org/job/Atlas-master-IntegrationTests/ws/webapp/target/failsafe-reports>
[INFO] ------------------------------------------------------------------------
[INFO] Reactor Summary:
[INFO] 
[INFO] Apache Atlas Server Build Tools .................... SUCCESS [  1.672 s]
[INFO] apache-atlas ....................................... SUCCESS [ 10.314 s]
[INFO] Apache Atlas Test Utility Tools .................... SUCCESS [ 31.660 s]
[INFO] Open Connector Framework (OCF) ..................... SUCCESS [ 14.694 s]
[INFO] Open Metadata Repository Services (OMRS) ........... SUCCESS [ 41.198 s]
[INFO] Open Metadata and Governance (OMAG) Server APIs .... SUCCESS [ 13.377 s]
[INFO] Connected Asset Open Metadata Access Service (OMAS)  SUCCESS [ 11.794 s]
[INFO] Asset Consumer Open Metadata Access Service (OMAS) . SUCCESS [ 10.387 s]
[INFO] Open Metadata and Governance (OMAG) Server ......... SUCCESS [  7.498 s]
[INFO] Apache Atlas Integration ........................... SUCCESS [ 26.773 s]
[INFO] Apache Atlas Common ................................ SUCCESS [ 10.685 s]
[INFO] Apache Atlas Client ................................ SUCCESS [  0.612 s]
[INFO] atlas-client-common ................................ SUCCESS [ 10.292 s]
[INFO] atlas-client-v1 .................................... SUCCESS [  8.374 s]
[INFO] Apache Atlas Server API ............................ SUCCESS [  7.035 s]
[INFO] Apache Atlas Notification .......................... SUCCESS [ 17.760 s]
[INFO] atlas-client-v2 .................................... SUCCESS [  8.019 s]
[INFO] Apache Atlas Graph Database Projects ............... SUCCESS [  0.443 s]
[INFO] Apache Atlas Graph Database API .................... SUCCESS [  5.892 s]
[INFO] Graph Database Common Code ......................... SUCCESS [  6.062 s]
[INFO] Apache Atlas JanusGraph DB Impl .................... SUCCESS [ 31.870 s]
[INFO] Apache Atlas Graph Database Implementation Dependencies SUCCESS [  2.320 s]
[INFO] Shaded version of Apache hbase client .............. SUCCESS [  9.464 s]
[INFO] Shaded version of Apache hbase server .............. SUCCESS [ 53.997 s]
[INFO] Apache Atlas Authorization ......................... SUCCESS [  6.959 s]
[INFO] Apache Atlas Repository ............................ SUCCESS [ 45.730 s]
[INFO] Apache Atlas UI .................................... SUCCESS [02:24 min]
[INFO] Apache Atlas Web Application ....................... FAILURE [05:32 min]
[INFO] Apache Atlas Documentation ......................... SKIPPED
[INFO] Apache Atlas FileSystem Model ...................... SKIPPED
[INFO] Apache Atlas Plugin Classloader .................... SKIPPED
[INFO] Apache Atlas Hive Bridge Shim ...................... SKIPPED
[INFO] Apache Atlas Hive Bridge ........................... SKIPPED
[INFO] Apache Atlas Falcon Bridge Shim .................... SKIPPED
[INFO] Apache Atlas Falcon Bridge ......................... SKIPPED
[INFO] Apache Atlas Sqoop Bridge Shim ..................... SKIPPED
[INFO] Apache Atlas Sqoop Bridge .......................... SKIPPED
[INFO] Apache Atlas Storm Bridge Shim ..................... SKIPPED
[INFO] Apache Atlas Storm Bridge .......................... SKIPPED
[INFO] Apache Atlas Hbase Bridge Shim ..................... SKIPPED
[INFO] Apache Atlas Hbase Bridge .......................... SKIPPED
[INFO] Apache Atlas Kafka Bridge .......................... SKIPPED
[INFO] Apache Atlas Distribution .......................... SKIPPED
[INFO] ------------------------------------------------------------------------
[INFO] BUILD FAILURE
[INFO] ------------------------------------------------------------------------
[INFO] Total time: 14:35 min
[INFO] Finished at: 2018-05-24T02:49:17Z
[INFO] Final Memory: 389M/2316M
[INFO] ------------------------------------------------------------------------
[ERROR] Failed to execute goal org.apache.maven.plugins:maven-failsafe-plugin:2.18.1:verify
(verify) on project atlas-webapp: There are test failures.
[ERROR] 
[ERROR] Please refer to <https://builds.apache.org/job/Atlas-master-IntegrationTests/ws/webapp/target/failsafe-reports>
for the individual test results.
[ERROR] -> [Help 1]
[ERROR] 
[ERROR] To see the full stack trace of the errors, re-run Maven with the -e switch.
[ERROR] Re-run Maven using the -X switch to enable full debug logging.
[ERROR] 
[ERROR] For more information about the errors and possible solutions, please read the following
articles:
[ERROR] [Help 1] http://cwiki.apache.org/confluence/display/MAVEN/MojoFailureException
[ERROR] 
[ERROR] After correcting the problems, you can resume the build with the command
[ERROR]   mvn <goals> -rf :atlas-webapp
Build step 'Execute shell' marked build as failure
[CHECKSTYLE] Collecting checkstyle analysis files...
[CHECKSTYLE] Searching for all files in <https://builds.apache.org/job/Atlas-master-IntegrationTests/ws/>
that match the pattern **/target/checkstyle-result.xml
[CHECKSTYLE] Parsing 26 files in <https://builds.apache.org/job/Atlas-master-IntegrationTests/ws/>
[CHECKSTYLE] Successfully parsed file <https://builds.apache.org/job/Atlas-master-IntegrationTests/ws/authorization/target/checkstyle-result.xml>
with 669 unique warnings and 0 duplicates.
[CHECKSTYLE] Successfully parsed file <https://builds.apache.org/job/Atlas-master-IntegrationTests/ws/client/client-v1/target/checkstyle-result.xml>
with 1556 unique warnings and 0 duplicates.
[CHECKSTYLE] Successfully parsed file <https://builds.apache.org/job/Atlas-master-IntegrationTests/ws/client/client-v2/target/checkstyle-result.xml>
with 1915 unique warnings and 0 duplicates.
[CHECKSTYLE] Successfully parsed file <https://builds.apache.org/job/Atlas-master-IntegrationTests/ws/client/common/target/checkstyle-result.xml>
with 2406 unique warnings and 0 duplicates.
[CHECKSTYLE] Successfully parsed file <https://builds.apache.org/job/Atlas-master-IntegrationTests/ws/client/target/checkstyle-result.xml>
with 2406 unique warnings and 0 duplicates.
[CHECKSTYLE] Successfully parsed file <https://builds.apache.org/job/Atlas-master-IntegrationTests/ws/common/target/checkstyle-result.xml>
with 3465 unique warnings and 0 duplicates.
[CHECKSTYLE] Successfully parsed file <https://builds.apache.org/job/Atlas-master-IntegrationTests/ws/dashboardv2/target/checkstyle-result.xml>
with 3465 unique warnings and 0 duplicates.
[CHECKSTYLE] Successfully parsed file <https://builds.apache.org/job/Atlas-master-IntegrationTests/ws/graphdb/api/target/checkstyle-result.xml>
with 3765 unique warnings and 0 duplicates.
[CHECKSTYLE] Successfully parsed file <https://builds.apache.org/job/Atlas-master-IntegrationTests/ws/graphdb/common/target/checkstyle-result.xml>
with 3991 unique warnings and 0 duplicates.
[CHECKSTYLE] Successfully parsed file <https://builds.apache.org/job/Atlas-master-IntegrationTests/ws/graphdb/graphdb-impls/target/checkstyle-result.xml>
with 3991 unique warnings and 0 duplicates.
[CHECKSTYLE] Successfully parsed file <https://builds.apache.org/job/Atlas-master-IntegrationTests/ws/graphdb/janus/target/checkstyle-result.xml>
with 6153 unique warnings and 0 duplicates.
[CHECKSTYLE] Successfully parsed file <https://builds.apache.org/job/Atlas-master-IntegrationTests/ws/graphdb/target/checkstyle-result.xml>
with 6153 unique warnings and 0 duplicates.
[CHECKSTYLE] Successfully parsed file <https://builds.apache.org/job/Atlas-master-IntegrationTests/ws/intg/target/checkstyle-result.xml>
with 18066 unique warnings and 0 duplicates.
[CHECKSTYLE] Successfully parsed file <https://builds.apache.org/job/Atlas-master-IntegrationTests/ws/notification/target/checkstyle-result.xml>
with 19303 unique warnings and 0 duplicates.
[CHECKSTYLE] Successfully parsed file <https://builds.apache.org/job/Atlas-master-IntegrationTests/ws/om-fwk-ocf/target/checkstyle-result.xml>
with 24344 unique warnings and 0 duplicates.
[CHECKSTYLE] Successfully parsed file <https://builds.apache.org/job/Atlas-master-IntegrationTests/ws/omag-api/target/checkstyle-result.xml>
with 25899 unique warnings and 0 duplicates.
[CHECKSTYLE] Successfully parsed file <https://builds.apache.org/job/Atlas-master-IntegrationTests/ws/omag-server/target/checkstyle-result.xml>
with 25908 unique warnings and 0 duplicates.
[CHECKSTYLE] Successfully parsed file <https://builds.apache.org/job/Atlas-master-IntegrationTests/ws/omas-assetconsumer/target/checkstyle-result.xml>
with 28747 unique warnings and 0 duplicates.
[CHECKSTYLE] Successfully parsed file <https://builds.apache.org/job/Atlas-master-IntegrationTests/ws/omas-connectedasset/target/checkstyle-result.xml>
with 32160 unique warnings and 0 duplicates.
[CHECKSTYLE] Successfully parsed file <https://builds.apache.org/job/Atlas-master-IntegrationTests/ws/omrs/target/checkstyle-result.xml>
with 72131 unique warnings and 0 duplicates.
[CHECKSTYLE] Successfully parsed file <https://builds.apache.org/job/Atlas-master-IntegrationTests/ws/repository/target/checkstyle-result.xml>
with 90912 unique warnings and 0 duplicates.
[CHECKSTYLE] Successfully parsed file <https://builds.apache.org/job/Atlas-master-IntegrationTests/ws/server-api/target/checkstyle-result.xml>
with 91078 unique warnings and 0 duplicates.
[CHECKSTYLE] Successfully parsed file <https://builds.apache.org/job/Atlas-master-IntegrationTests/ws/shaded/hbase-client-shaded/target/checkstyle-result.xml>
with 91078 unique warnings and 0 duplicates.
[CHECKSTYLE] Successfully parsed file <https://builds.apache.org/job/Atlas-master-IntegrationTests/ws/shaded/hbase-server-shaded/target/checkstyle-result.xml>
with 91078 unique warnings and 0 duplicates.
[CHECKSTYLE] Successfully parsed file <https://builds.apache.org/job/Atlas-master-IntegrationTests/ws/target/checkstyle-result.xml>
with 91078 unique warnings and 0 duplicates.
[CHECKSTYLE] Successfully parsed file <https://builds.apache.org/job/Atlas-master-IntegrationTests/ws/test-tools/target/checkstyle-result.xml>
with 91116 unique warnings and 0 duplicates.
<Git Blamer> Using GitBlamer to create author and commit information for all warnings.
<Git Blamer> GIT_COMMIT=bcd5bb60732833f000e8e50f1f16b2cf3dbc32c7, workspace=<https://builds.apache.org/job/Atlas-master-IntegrationTests/ws/>
 > git rev-parse bcd5bb60732833f000e8e50f1f16b2cf3dbc32c7^{commit} # timeout=10
[CHECKSTYLE] Computing warning deltas based on reference build #1427
[FINDBUGS] Collecting findbugs analysis files...
[FINDBUGS] Searching for all files in <https://builds.apache.org/job/Atlas-master-IntegrationTests/ws/>
that match the pattern **/target/findbugs.xml
[FINDBUGS] Parsing 19 files in <https://builds.apache.org/job/Atlas-master-IntegrationTests/ws/>
[FINDBUGS] Successfully parsed file <https://builds.apache.org/job/Atlas-master-IntegrationTests/ws/authorization/target/findbugs.xml>
with 0 unique warnings and 0 duplicates.
[FINDBUGS] Successfully parsed file <https://builds.apache.org/job/Atlas-master-IntegrationTests/ws/client/client-v1/target/findbugs.xml>
with 0 unique warnings and 0 duplicates.
[FINDBUGS] Successfully parsed file <https://builds.apache.org/job/Atlas-master-IntegrationTests/ws/client/client-v2/target/findbugs.xml>
with 0 unique warnings and 0 duplicates.
[FINDBUGS] Successfully parsed file <https://builds.apache.org/job/Atlas-master-IntegrationTests/ws/client/common/target/findbugs.xml>
with 0 unique warnings and 0 duplicates.
[FINDBUGS] Successfully parsed file <https://builds.apache.org/job/Atlas-master-IntegrationTests/ws/common/target/findbugs.xml>
with 0 unique warnings and 0 duplicates.
[FINDBUGS] Successfully parsed file <https://builds.apache.org/job/Atlas-master-IntegrationTests/ws/graphdb/api/target/findbugs.xml>
with 0 unique warnings and 0 duplicates.
[FINDBUGS] Successfully parsed file <https://builds.apache.org/job/Atlas-master-IntegrationTests/ws/graphdb/common/target/findbugs.xml>
with 0 unique warnings and 0 duplicates.
[FINDBUGS] Successfully parsed file <https://builds.apache.org/job/Atlas-master-IntegrationTests/ws/graphdb/janus/target/findbugs.xml>
with 0 unique warnings and 0 duplicates.
[FINDBUGS] Successfully parsed file <https://builds.apache.org/job/Atlas-master-IntegrationTests/ws/intg/target/findbugs.xml>
with 0 unique warnings and 0 duplicates.
[FINDBUGS] Successfully parsed file <https://builds.apache.org/job/Atlas-master-IntegrationTests/ws/notification/target/findbugs.xml>
with 0 unique warnings and 0 duplicates.
[FINDBUGS] Successfully parsed file <https://builds.apache.org/job/Atlas-master-IntegrationTests/ws/om-fwk-ocf/target/findbugs.xml>
with 0 unique warnings and 0 duplicates.
[FINDBUGS] Successfully parsed file <https://builds.apache.org/job/Atlas-master-IntegrationTests/ws/omag-api/target/findbugs.xml>
with 0 unique warnings and 0 duplicates.
[FINDBUGS] Successfully parsed file <https://builds.apache.org/job/Atlas-master-IntegrationTests/ws/omag-server/target/findbugs.xml>
with 0 unique warnings and 0 duplicates.
[FINDBUGS] Successfully parsed file <https://builds.apache.org/job/Atlas-master-IntegrationTests/ws/omas-assetconsumer/target/findbugs.xml>
with 0 unique warnings and 0 duplicates.
[FINDBUGS] Successfully parsed file <https://builds.apache.org/job/Atlas-master-IntegrationTests/ws/omas-connectedasset/target/findbugs.xml>
with 0 unique warnings and 0 duplicates.
[FINDBUGS] Successfully parsed file <https://builds.apache.org/job/Atlas-master-IntegrationTests/ws/omrs/target/findbugs.xml>
with 0 unique warnings and 0 duplicates.
[FINDBUGS] Successfully parsed file <https://builds.apache.org/job/Atlas-master-IntegrationTests/ws/repository/target/findbugs.xml>
with 0 unique warnings and 0 duplicates.
[FINDBUGS] Successfully parsed file <https://builds.apache.org/job/Atlas-master-IntegrationTests/ws/server-api/target/findbugs.xml>
with 0 unique warnings and 0 duplicates.
[FINDBUGS] Successfully parsed file <https://builds.apache.org/job/Atlas-master-IntegrationTests/ws/test-tools/target/findbugs.xml>
with 0 unique warnings and 0 duplicates.
<Git Blamer> Using GitBlamer to create author and commit information for all warnings.
<Git Blamer> GIT_COMMIT=bcd5bb60732833f000e8e50f1f16b2cf3dbc32c7, workspace=<https://builds.apache.org/job/Atlas-master-IntegrationTests/ws/>
[FINDBUGS] Computing warning deltas based on reference build #1427
Archiving artifacts
[Fast Archiver] Compressed 166.44 MB of artifacts by 84.1% relative to #1427
TestNG Reports Processing: START
Looking for TestNG results report in workspace using pattern: **/target/surefire-reports/testng-results.xml,**/target/failsafe-reports/testng-results.xml
Saving reports...
Processing '/x1/jenkins/jenkins-home/jobs/Atlas-master-IntegrationTests/builds/1428/testng/testng-results.xml'
1.680672% of tests failed, which exceeded threshold of 0%. Marking build as UNSTABLE
TestNG Reports Processing: FINISH

Mime
View raw message