atlas-dev mailing list archives

Site index · List index
Message view « Date » · « Thread »
Top « Date » · « Thread »
From Apache Jenkins Server <jenk...@builds.apache.org>
Subject Build failed in Jenkins: Atlas-master-IntegrationTests #1299
Date Thu, 10 May 2018 22:35:52 GMT
See <https://builds.apache.org/job/Atlas-master-IntegrationTests/1299/display/redirect>

------------------------------------------
[...truncated 679.79 KB...]
127.0.0.1 - - [10/May/2018:21:57:15 +0000] "GET //localhost:31000/api/atlas/v2/entity/uniqueAttribute/type/hive_table?attr:qualifiedName=default.tabley2cvnc5i4u@primary
HTTP/1.1" 200 4980 "-" "Java/1.8.0_172"
127.0.0.1 - - [10/May/2018:21:57:15 +0000] "GET //localhost:31000/api/atlas/v2/entity/uniqueAttribute/type/hive_process?attr:qualifiedName=TRUNCATETABLE-%3E:default.tabley2cvnc5i4u@primary:1525989435000
HTTP/1.1" 404 186 "-" "Java/1.8.0_172"
127.0.0.1 - - [10/May/2018:21:57:20 +0000] "GET //localhost:31000/api/atlas/v2/entity/uniqueAttribute/type/hive_process?attr:qualifiedName=TRUNCATETABLE-%3E:default.tabley2cvnc5i4u@primary:1525989435000
HTTP/1.1" 200 1162 "-" "Java/1.8.0_172"
127.0.0.1 - - [10/May/2018:21:57:20 +0000] "GET //localhost:31000/api/atlas/v2/entity/uniqueAttribute/type/hive_process?attr:qualifiedName=TRUNCATETABLE-%3E:default.tabley2cvnc5i4u@primary:1525989435000
HTTP/1.1" 200 1162 "-" "Java/1.8.0_172"
127.0.0.1 - - [10/May/2018:21:57:20 +0000] "GET //localhost:31000/api/atlas/v2/entity/guid/5d474e67-ee05-458b-bbf2-a7257e4e74b7
HTTP/1.1" 200 1162 "-" "Java/1.8.0_172"
127.0.0.1 - - [10/May/2018:21:57:20 +0000] "GET //localhost:31000/api/atlas/v2/entity/guid/7b7c76c2-a32f-43f4-92b9-fb707f2be16b
HTTP/1.1" 200 5252 "-" "Java/1.8.0_172"
127.0.0.1 - - [10/May/2018:21:57:20 +0000] "GET //localhost:31000/api/atlas/v2/lineage/7b7c76c2-a32f-43f4-92b9-fb707f2be16b?depth=0&direction=INPUT
HTTP/1.1" 200 135 "-" "Java/1.8.0_172"
127.0.0.1 - - [10/May/2018:21:57:23 +0000] "GET //localhost:31000/api/atlas/v2/entity/uniqueAttribute/type/hive_process?attr:qualifiedName=QUERY:default.tablejvnkkzbtib@primary:1525989441000-%3E
HTTP/1.1" 404 178 "-" "Java/1.8.0_172"
127.0.0.1 - - [10/May/2018:21:57:29 +0000] "GET //localhost:31000/api/atlas/v2/entity/uniqueAttribute/type/hive_process?attr:qualifiedName=QUERY:default.tablejvnkkzbtib@primary:1525989441000-%3E
HTTP/1.1" 200 2078 "-" "Java/1.8.0_172"
127.0.0.1 - - [10/May/2018:21:57:29 +0000] "GET //localhost:31000/api/atlas/v2/entity/uniqueAttribute/type/hive_process?attr:qualifiedName=QUERY:default.tablejvnkkzbtib@primary:1525989441000-%3E
HTTP/1.1" 200 2078 "-" "Java/1.8.0_172"
127.0.0.1 - - [10/May/2018:21:57:29 +0000] "GET //localhost:31000/api/atlas/v2/entity/guid/b9268472-dcac-41f5-ba77-9de5be6d1abd
HTTP/1.1" 200 2078 "-" "Java/1.8.0_172"
127.0.0.1 - - [10/May/2018:21:57:29 +0000] "GET //localhost:31000/api/atlas/v2/entity/guid/e1b3c575-b0aa-4172-9ab8-556f88b42b2a
HTTP/1.1" 200 5419 "-" "Java/1.8.0_172"
127.0.0.1 - - [10/May/2018:21:57:29 +0000] "GET //localhost:31000/api/atlas/v2/entity/guid/2663331f-57e5-4d04-919c-089f15e7fedf
HTTP/1.1" 200 1416 "-" "Java/1.8.0_172"
127.0.0.1 - - [10/May/2018:21:57:29 +0000] "GET //localhost:31000/api/atlas/v2/entity/uniqueAttribute/type/hdfs_path?attr:qualifiedName=pfile:/home/jenkins/jenkins-slave/workspace/atlas-master-integrationtests/addons/hive-bridge/target/somedfspath1-data-3tbge1rkxw
HTTP/1.1" 200 1416 "-" "Java/1.8.0_172"
127.0.0.1 - - [10/May/2018:21:57:29 +0000] "GET //localhost:31000/api/atlas/v2/entity/uniqueAttribute/type/hdfs_path?attr:qualifiedName=pfile:/home/jenkins/jenkins-slave/workspace/atlas-master-integrationtests/addons/hive-bridge/target/somedfspath1-data-3tbge1rkxw
HTTP/1.1" 200 1416 "-" "Java/1.8.0_172"
127.0.0.1 - - [10/May/2018:21:57:29 +0000] "GET //localhost:31000/api/atlas/v2/entity/uniqueAttribute/type/hive_table?attr:qualifiedName=default.tablejvnkkzbtib@primary
HTTP/1.1" 200 5419 "-" "Java/1.8.0_172"
127.0.0.1 - - [10/May/2018:21:57:29 +0000] "GET //localhost:31000/api/atlas/v2/entity/uniqueAttribute/type/hive_table?attr:qualifiedName=default.tablejvnkkzbtib@primary
HTTP/1.1" 200 5419 "-" "Java/1.8.0_172"
127.0.0.1 - - [10/May/2018:21:57:29 +0000] "GET //localhost:31000/api/atlas/v2/entity/guid/e1b3c575-b0aa-4172-9ab8-556f88b42b2a
HTTP/1.1" 200 5419 "-" "Java/1.8.0_172"
127.0.0.1 - - [10/May/2018:21:57:32 +0000] "GET //localhost:31000/api/atlas/v2/entity/uniqueAttribute/type/hive_table?attr:qualifiedName=default.tablejvnkkzbtib@primary
HTTP/1.1" 200 5419 "-" "Java/1.8.0_172"
127.0.0.1 - - [10/May/2018:21:57:32 +0000] "GET //localhost:31000/api/atlas/v2/entity/uniqueAttribute/type/hive_table?attr:qualifiedName=default.tablejvnkkzbtib@primary
HTTP/1.1" 200 5419 "-" "Java/1.8.0_172"
127.0.0.1 - - [10/May/2018:21:57:32 +0000] "GET //localhost:31000/api/atlas/v2/entity/uniqueAttribute/type/hive_process?attr:qualifiedName=QUERY:default.tablejvnkkzbtib@primary:1525989441000-%3E
HTTP/1.1" 200 2078 "-" "Java/1.8.0_172"
127.0.0.1 - - [10/May/2018:21:57:32 +0000] "GET //localhost:31000/api/atlas/v2/entity/uniqueAttribute/type/hive_process?attr:qualifiedName=QUERY:default.tablejvnkkzbtib@primary:1525989441000-%3E
HTTP/1.1" 200 2078 "-" "Java/1.8.0_172"
127.0.0.1 - - [10/May/2018:21:57:32 +0000] "GET //localhost:31000/api/atlas/v2/entity/guid/b9268472-dcac-41f5-ba77-9de5be6d1abd
HTTP/1.1" 200 2078 "-" "Java/1.8.0_172"
127.0.0.1 - - [10/May/2018:21:57:32 +0000] "GET //localhost:31000/api/atlas/v2/entity/guid/e1b3c575-b0aa-4172-9ab8-556f88b42b2a
HTTP/1.1" 200 5419 "-" "Java/1.8.0_172"
127.0.0.1 - - [10/May/2018:21:57:32 +0000] "GET //localhost:31000/api/atlas/v2/entity/guid/2663331f-57e5-4d04-919c-089f15e7fedf
HTTP/1.1" 200 1416 "-" "Java/1.8.0_172"
127.0.0.1 - - [10/May/2018:21:57:32 +0000] "GET //localhost:31000/api/atlas/v2/entity/uniqueAttribute/type/hdfs_path?attr:qualifiedName=pfile:/home/jenkins/jenkins-slave/workspace/atlas-master-integrationtests/addons/hive-bridge/target/somedfspath1-data-3tbge1rkxw
HTTP/1.1" 200 1416 "-" "Java/1.8.0_172"
127.0.0.1 - - [10/May/2018:21:57:32 +0000] "GET //localhost:31000/api/atlas/v2/entity/uniqueAttribute/type/hdfs_path?attr:qualifiedName=pfile:/home/jenkins/jenkins-slave/workspace/atlas-master-integrationtests/addons/hive-bridge/target/somedfspath1-data-3tbge1rkxw
HTTP/1.1" 200 1416 "-" "Java/1.8.0_172"
127.0.0.1 - - [10/May/2018:21:57:36 +0000] "GET //localhost:31000/api/atlas/v2/entity/uniqueAttribute/type/hive_table?attr:qualifiedName=default.tablejvnkkzbtib@primary
HTTP/1.1" 200 5419 "-" "Java/1.8.0_172"
127.0.0.1 - - [10/May/2018:21:57:36 +0000] "GET //localhost:31000/api/atlas/v2/entity/uniqueAttribute/type/hive_table?attr:qualifiedName=default.tablejvnkkzbtib@primary
HTTP/1.1" 200 5419 "-" "Java/1.8.0_172"
127.0.0.1 - - [10/May/2018:21:57:36 +0000] "GET //localhost:31000/api/atlas/v2/entity/uniqueAttribute/type/hive_process?attr:qualifiedName=QUERY:default.tablejvnkkzbtib@primary:1525989441000-%3E
HTTP/1.1" 200 2512 "-" "Java/1.8.0_172"
127.0.0.1 - - [10/May/2018:21:57:36 +0000] "GET //localhost:31000/api/atlas/v2/entity/uniqueAttribute/type/hive_process?attr:qualifiedName=QUERY:default.tablejvnkkzbtib@primary:1525989441000-%3E
HTTP/1.1" 200 2512 "-" "Java/1.8.0_172"
127.0.0.1 - - [10/May/2018:21:57:36 +0000] "GET //localhost:31000/api/atlas/v2/entity/guid/b9268472-dcac-41f5-ba77-9de5be6d1abd
HTTP/1.1" 200 2512 "-" "Java/1.8.0_172"
127.0.0.1 - - [10/May/2018:21:57:36 +0000] "GET //localhost:31000/api/atlas/v2/entity/guid/e1b3c575-b0aa-4172-9ab8-556f88b42b2a
HTTP/1.1" 200 5419 "-" "Java/1.8.0_172"
127.0.0.1 - - [10/May/2018:21:57:36 +0000] "GET //localhost:31000/api/atlas/v2/entity/guid/75f74ac3-2420-49fa-8ca6-a3d205867940
HTTP/1.1" 200 1416 "-" "Java/1.8.0_172"
127.0.0.1 - - [10/May/2018:21:57:36 +0000] "GET //localhost:31000/api/atlas/v2/entity/guid/2663331f-57e5-4d04-919c-089f15e7fedf
HTTP/1.1" 200 1417 "-" "Java/1.8.0_172"
127.0.0.1 - - [10/May/2018:21:57:36 +0000] "GET //localhost:31000/api/atlas/v2/entity/uniqueAttribute/type/hdfs_path?attr:qualifiedName=pfile:/home/jenkins/jenkins-slave/workspace/atlas-master-integrationtests/addons/hive-bridge/target/somedfspath2-data-cks8c0bayy
HTTP/1.1" 200 1416 "-" "Java/1.8.0_172"
127.0.0.1 - - [10/May/2018:21:57:36 +0000] "GET //localhost:31000/api/atlas/v2/entity/uniqueAttribute/type/hdfs_path?attr:qualifiedName=pfile:/home/jenkins/jenkins-slave/workspace/atlas-master-integrationtests/addons/hive-bridge/target/somedfspath2-data-cks8c0bayy
HTTP/1.1" 200 1416 "-" "Java/1.8.0_172"
127.0.0.1 - - [10/May/2018:21:57:38 +0000] "GET //localhost:31000/api/atlas/v2/entity/uniqueAttribute/type/hive_db?attr:qualifiedName=default@primary
HTTP/1.1" 200 16141 "-" "Java/1.8.0_172"
127.0.0.1 - - [10/May/2018:21:57:38 +0000] "GET //localhost:31000/api/atlas/v2/entity/uniqueAttribute/type/hive_db?attr:qualifiedName=default@primary
HTTP/1.1" 200 16141 "-" "Java/1.8.0_172"
127.0.0.1 - - [10/May/2018:21:57:38 +0000] "GET //localhost:31000/api/atlas/v2/entity/uniqueAttribute/type/hive_table?attr:qualifiedName=default.tablep7gli3ahal@primary
HTTP/1.1" 404 154 "-" "Java/1.8.0_172"
127.0.0.1 - - [10/May/2018:21:57:43 +0000] "GET //localhost:31000/api/atlas/v2/entity/uniqueAttribute/type/hive_table?attr:qualifiedName=default.tablep7gli3ahal@primary
HTTP/1.1" 200 5402 "-" "Java/1.8.0_172"
127.0.0.1 - - [10/May/2018:21:57:43 +0000] "GET //localhost:31000/api/atlas/v2/entity/uniqueAttribute/type/hive_table?attr:qualifiedName=default.tablep7gli3ahal@primary
HTTP/1.1" 200 5402 "-" "Java/1.8.0_172"
127.0.0.1 - - [10/May/2018:21:57:43 +0000] "GET //localhost:31000/api/atlas/v2/entity/uniqueAttribute/type/hive_process?attr:qualifiedName=default.tablep7gli3ahal@primary:1525989457000
HTTP/1.1" 200 2077 "-" "Java/1.8.0_172"
127.0.0.1 - - [10/May/2018:21:57:43 +0000] "GET //localhost:31000/api/atlas/v2/entity/uniqueAttribute/type/hive_process?attr:qualifiedName=default.tablep7gli3ahal@primary:1525989457000
HTTP/1.1" 200 2077 "-" "Java/1.8.0_172"
127.0.0.1 - - [10/May/2018:21:57:43 +0000] "GET //localhost:31000/api/atlas/v2/entity/guid/11501f68-f590-40a0-8aad-421b2ff93c75
HTTP/1.1" 200 2077 "-" "Java/1.8.0_172"
127.0.0.1 - - [10/May/2018:21:57:43 +0000] "GET //localhost:31000/api/atlas/v2/entity/uniqueAttribute/type/hdfs_path?attr:qualifiedName=pfile:/home/jenkins/jenkins-slave/workspace/atlas-master-integrationtests/addons/hive-bridge/target/parentpath-data-qs6ltkjbfm
HTTP/1.1" 200 1410 "-" "Java/1.8.0_172"
127.0.0.1 - - [10/May/2018:21:57:43 +0000] "GET //localhost:31000/api/atlas/v2/entity/uniqueAttribute/type/hdfs_path?attr:qualifiedName=pfile:/home/jenkins/jenkins-slave/workspace/atlas-master-integrationtests/addons/hive-bridge/target/parentpath-data-qs6ltkjbfm
HTTP/1.1" 200 1410 "-" "Java/1.8.0_172"
127.0.0.1 - - [10/May/2018:21:57:43 +0000] "GET //localhost:31000/api/atlas/entities?type=hive_table
HTTP/1.1" 200 2731 "-" "Java/1.8.0_172"
127.0.0.1 - - [10/May/2018:21:57:43 +0000] "GET //localhost:31000/api/atlas/v2/entity/guid/22962ce1-77ad-420d-a015-118fafe4570d
HTTP/1.1" 200 16388 "-" "Java/1.8.0_172"
127.0.0.1 - - [10/May/2018:21:57:43 +0000] "GET //localhost:31000/api/atlas/v2/entity/uniqueAttribute/type/hive_table?attr:qualifiedName=default.tablep7gli3ahal@primary
HTTP/1.1" 200 5402 "-" "Java/1.8.0_172"
127.0.0.1 - - [10/May/2018:21:57:43 +0000] "POST //localhost:31000/api/atlas/v2/entity/ HTTP/1.1"
200 384 "-" "Java/1.8.0_172"
127.0.0.1 - - [10/May/2018:21:57:44 +0000] "GET //localhost:31000/api/atlas/v2/entity/uniqueAttribute/type/hive_process?attr:qualifiedName=default.tablep7gli3ahal@primary:1525989457000
HTTP/1.1" 200 2077 "-" "Java/1.8.0_172"
127.0.0.1 - - [10/May/2018:21:57:44 +0000] "GET //localhost:31000/api/atlas/v2/entity/uniqueAttribute/type/hive_table?attr:qualifiedName=default.tablep7gli3ahal@primary
HTTP/1.1" 200 5400 "-" "Java/1.8.0_172"
127.0.0.1 - - [10/May/2018:21:57:44 +0000] "GET //localhost:31000/api/atlas/v2/entity/uniqueAttribute/type/hive_table?attr:qualifiedName=default.tablep7gli3ahal@primary
HTTP/1.1" 200 5400 "-" "Java/1.8.0_172"
127.0.0.1 - - [10/May/2018:21:57:44 +0000] "GET //localhost:31000/api/atlas/v2/entity/uniqueAttribute/type/hive_process?attr:qualifiedName=default.tablep7gli3ahal@primary:1525989457000
HTTP/1.1" 200 2077 "-" "Java/1.8.0_172"
127.0.0.1 - - [10/May/2018:21:57:44 +0000] "GET //localhost:31000/api/atlas/v2/entity/uniqueAttribute/type/hive_process?attr:qualifiedName=default.tablep7gli3ahal@primary:1525989457000
HTTP/1.1" 200 2077 "-" "Java/1.8.0_172"
127.0.0.1 - - [10/May/2018:21:57:44 +0000] "GET //localhost:31000/api/atlas/entities?type=hive_table
HTTP/1.1" 200 2731 "-" "Java/1.8.0_172"
127.0.0.1 - - [10/May/2018:21:57:44 +0000] "GET //localhost:31000/api/atlas/v2/entity/uniqueAttribute/type/hive_db?attr:qualifiedName=default@primary
HTTP/1.1" 200 16388 "-" "Java/1.8.0_172"
127.0.0.1 - - [10/May/2018:21:57:44 +0000] "GET //localhost:31000/api/atlas/v2/entity/uniqueAttribute/type/hive_db?attr:qualifiedName=default@primary
HTTP/1.1" 200 16388 "-" "Java/1.8.0_172"
127.0.0.1 - - [10/May/2018:21:57:44 +0000] "GET //localhost:31000/api/atlas/v2/entity/guid/22962ce1-77ad-420d-a015-118fafe4570d
HTTP/1.1" 200 16388 "-" "Java/1.8.0_172"
127.0.0.1 - - [10/May/2018:21:57:44 +0000] "GET //localhost:31000/api/atlas/v2/entity/uniqueAttribute/type/hive_table?attr:qualifiedName=default.tablelmbwokvrbw@primary
HTTP/1.1" 404 154 "-" "Java/1.8.0_172"
127.0.0.1 - - [10/May/2018:21:57:44 +0000] "POST //localhost:31000/api/atlas/v2/entity/ HTTP/1.1"
200 859 "-" "Java/1.8.0_172"
127.0.0.1 - - [10/May/2018:21:57:44 +0000] "GET //localhost:31000/api/atlas/v2/entity/guid/3a0f7b0f-907b-47a5-96ec-77dc7a1f7a8f
HTTP/1.1" 200 3823 "-" "Java/1.8.0_172"
127.0.0.1 - - [10/May/2018:21:57:44 +0000] "GET //localhost:31000/api/atlas/v2/entity/uniqueAttribute/type/hive_process?attr:qualifiedName=default.tablelmbwokvrbw@primary:1525989464000
HTTP/1.1" 404 170 "-" "Java/1.8.0_172"
127.0.0.1 - - [10/May/2018:21:57:44 +0000] "POST //localhost:31000/api/atlas/v2/entity/bulk/
HTTP/1.1" 200 756 "-" "Java/1.8.0_172"
127.0.0.1 - - [10/May/2018:21:57:45 +0000] "GET //localhost:31000/api/atlas/v2/entity/guid/0e988772-1052-4ae3-a6ea-007f7da51704
HTTP/1.1" 200 2155 "-" "Java/1.8.0_172"
127.0.0.1 - - [10/May/2018:21:57:45 +0000] "GET //localhost:31000/api/atlas/v2/entity/guid/c9056789-b8c6-4781-a660-5b88cecaef22
HTTP/1.1" 200 1393 "-" "Java/1.8.0_172"
127.0.0.1 - - [10/May/2018:21:57:45 +0000] "GET //localhost:31000/api/atlas/v2/entity/uniqueAttribute/type/hive_table?attr:qualifiedName=default.tablelmbwokvrbw@primary
HTTP/1.1" 200 4251 "-" "Java/1.8.0_172"
127.0.0.1 - - [10/May/2018:21:57:45 +0000] "GET //localhost:31000/api/atlas/v2/entity/uniqueAttribute/type/hive_table?attr:qualifiedName=default.tablelmbwokvrbw@primary
HTTP/1.1" 200 4251 "-" "Java/1.8.0_172"
127.0.0.1 - - [10/May/2018:21:57:45 +0000] "GET //localhost:31000/api/atlas/v2/entity/uniqueAttribute/type/hive_process?attr:qualifiedName=default.tablelmbwokvrbw@primary:1525989464000
HTTP/1.1" 200 2155 "-" "Java/1.8.0_172"
127.0.0.1 - - [10/May/2018:21:57:45 +0000] "GET //localhost:31000/api/atlas/v2/entity/uniqueAttribute/type/hive_process?attr:qualifiedName=default.tablelmbwokvrbw@primary:1525989464000
HTTP/1.1" 200 2155 "-" "Java/1.8.0_172"
127.0.0.1 - - [10/May/2018:21:57:45 +0000] "GET //localhost:31000/api/atlas/v2/entity/guid/0e988772-1052-4ae3-a6ea-007f7da51704
HTTP/1.1" 200 2155 "-" "Java/1.8.0_172"
Tests run: 45, Failures: 1, Errors: 0, Skipped: 0, Time elapsed: 456.716 sec <<<
FAILURE! - in TestSuite
testDropDatabaseWithoutCascade(org.apache.atlas.hive.hook.HiveHookIT)  Time elapsed: 10.651
sec  <<< FAILURE!
java.lang.AssertionError: Entity was not supposed to exist for typeName = hive_db, attributeName
= qualifiedName, attributeValue = db0j6vnuoy60@primary
	at org.testng.Assert.fail(Assert.java:94)
	at org.apache.atlas.hive.hook.HiveHookIT.testDropDatabaseWithoutCascade(HiveHookIT.java:1621)


Results :

Failed tests: 
  HiveHookIT.testDropDatabaseWithoutCascade:1621 Entity was not supposed to exist for typeName
= hive_db, attributeName = qualifiedName, attributeValue = db0j6vnuoy60@primary

Tests run: 45, Failures: 1, Errors: 0, Skipped: 0

[INFO] 
[INFO] --- jetty-maven-plugin:9.3.14.v20161028:stop (stop-jetty) @ hive-bridge ---
[INFO] Waiting 10 seconds for jetty to stop
[INFO] Stopped ServerConnector@1e098748{HTTP/1.1,[http/1.1]}{0.0.0.0:31000}
[INFO] Closing Spring root WebApplicationContext
[INFO] Shutting down log4j
[INFO] Stopped o.e.j.m.p.JettyWebAppContext@b56a9ea{/,file://<https://builds.apache.org/job/Atlas-master-IntegrationTests/ws/webapp/target/atlas-webapp-1.0.0-SNAPSHOT/,UNAVAILABLE}{/home/jenkins/jenkins-slave/workspace/Atlas-master-IntegrationTests/webapp/target/atlas-webapp-1.0.0-SNAPSHOT.war}>
[INFO] Server reports itself as stopped
[INFO] 
[INFO] --- maven-source-plugin:2.4:jar-no-fork (attach-sources) @ hive-bridge ---
[INFO] Building jar: <https://builds.apache.org/job/Atlas-master-IntegrationTests/ws/addons/hive-bridge/target/hive-bridge-1.0.0-SNAPSHOT-sources.jar>
[INFO] 
[INFO] --- maven-source-plugin:2.4:test-jar-no-fork (attach-sources) @ hive-bridge ---
[INFO] Building jar: <https://builds.apache.org/job/Atlas-master-IntegrationTests/ws/addons/hive-bridge/target/hive-bridge-1.0.0-SNAPSHOT-test-sources.jar>
log4j:WARN No appenders could be found for logger (org.apache.zookeeper.ClientCnxn).
log4j:WARN Please initialize the log4j system properly.
log4j:WARN See http://logging.apache.org/log4j/1.2/faq.html#noconfig for more info.
[INFO] 
[INFO] --- maven-failsafe-plugin:2.18.1:verify (verify) @ hive-bridge ---
[INFO] Failsafe report directory: <https://builds.apache.org/job/Atlas-master-IntegrationTests/ws/addons/hive-bridge/target/failsafe-reports>
[INFO] ------------------------------------------------------------------------
[INFO] Reactor Summary:
[INFO] 
[INFO] Apache Atlas Server Build Tools .................... SUCCESS [  0.774 s]
[INFO] apache-atlas ....................................... SUCCESS [  6.197 s]
[INFO] Apache Atlas Test Utility Tools .................... SUCCESS [ 13.588 s]
[INFO] Open Connector Framework (OCF) ..................... SUCCESS [ 13.417 s]
[INFO] Open Metadata Repository Services (OMRS) ........... SUCCESS [ 41.024 s]
[INFO] Open Metadata and Governance (OMAG) Server APIs .... SUCCESS [ 11.193 s]
[INFO] Connected Asset Open Metadata Access Service (OMAS)  SUCCESS [ 11.109 s]
[INFO] Asset Consumer Open Metadata Access Service (OMAS) . SUCCESS [  8.671 s]
[INFO] Open Metadata and Governance (OMAG) Server ......... SUCCESS [  6.345 s]
[INFO] Apache Atlas Integration ........................... SUCCESS [ 24.816 s]
[INFO] Apache Atlas Common ................................ SUCCESS [  9.149 s]
[INFO] Apache Atlas Client ................................ SUCCESS [  0.494 s]
[INFO] atlas-client-common ................................ SUCCESS [  7.492 s]
[INFO] atlas-client-v1 .................................... SUCCESS [  8.490 s]
[INFO] Apache Atlas Server API ............................ SUCCESS [  6.176 s]
[INFO] Apache Atlas Notification .......................... SUCCESS [ 10.708 s]
[INFO] atlas-client-v2 .................................... SUCCESS [  7.009 s]
[INFO] Apache Atlas Graph Database Projects ............... SUCCESS [  0.408 s]
[INFO] Apache Atlas Graph Database API .................... SUCCESS [  5.819 s]
[INFO] Graph Database Common Code ......................... SUCCESS [  6.123 s]
[INFO] Apache Atlas JanusGraph DB Impl .................... SUCCESS [ 19.066 s]
[INFO] Apache Atlas Graph Database Implementation Dependencies SUCCESS [  2.116 s]
[INFO] Shaded version of Apache hbase client .............. SUCCESS [  9.967 s]
[INFO] Shaded version of Apache hbase server .............. SUCCESS [ 25.167 s]
[INFO] Apache Atlas Authorization ......................... SUCCESS [  8.168 s]
[INFO] Apache Atlas Repository ............................ SUCCESS [ 42.044 s]
[INFO] Apache Atlas UI .................................... SUCCESS [01:52 min]
[INFO] Apache Atlas Web Application ....................... SUCCESS [06:03 min]
[INFO] Apache Atlas Documentation ......................... SUCCESS [  4.363 s]
[INFO] Apache Atlas FileSystem Model ...................... SUCCESS [  3.407 s]
[INFO] Apache Atlas Plugin Classloader .................... SUCCESS [  7.284 s]
[INFO] Apache Atlas Hive Bridge Shim ...................... SUCCESS [  6.515 s]
[INFO] Apache Atlas Hive Bridge ........................... FAILURE [08:44 min]
[INFO] Apache Atlas Falcon Bridge Shim .................... SKIPPED
[INFO] Apache Atlas Falcon Bridge ......................... SKIPPED
[INFO] Apache Atlas Sqoop Bridge Shim ..................... SKIPPED
[INFO] Apache Atlas Sqoop Bridge .......................... SKIPPED
[INFO] Apache Atlas Storm Bridge Shim ..................... SKIPPED
[INFO] Apache Atlas Storm Bridge .......................... SKIPPED
[INFO] Apache Atlas Hbase Bridge Shim ..................... SKIPPED
[INFO] Apache Atlas Hbase Bridge .......................... SKIPPED
[INFO] Apache Atlas Kafka Bridge .......................... SKIPPED
[INFO] Apache Atlas Distribution .......................... SKIPPED
[INFO] ------------------------------------------------------------------------
[INFO] BUILD FAILURE
[INFO] ------------------------------------------------------------------------
[INFO] Total time: 22:09 min
[INFO] Finished at: 2018-05-10T21:57:49Z
[INFO] Final Memory: 596M/2987M
[INFO] ------------------------------------------------------------------------
[ERROR] Failed to execute goal org.apache.maven.plugins:maven-failsafe-plugin:2.18.1:verify
(verify) on project hive-bridge: There are test failures.
[ERROR] 
[ERROR] Please refer to <https://builds.apache.org/job/Atlas-master-IntegrationTests/ws/addons/hive-bridge/target/failsafe-reports>
for the individual test results.
[ERROR] -> [Help 1]
[ERROR] 
[ERROR] To see the full stack trace of the errors, re-run Maven with the -e switch.
[ERROR] Re-run Maven using the -X switch to enable full debug logging.
[ERROR] 
[ERROR] For more information about the errors and possible solutions, please read the following
articles:
[ERROR] [Help 1] http://cwiki.apache.org/confluence/display/MAVEN/MojoFailureException
[ERROR] 
[ERROR] After correcting the problems, you can resume the build with the command
[ERROR]   mvn <goals> -rf :hive-bridge
Build step 'Execute shell' marked build as failure
[CHECKSTYLE] Collecting checkstyle analysis files...
[CHECKSTYLE] Searching for all files in <https://builds.apache.org/job/Atlas-master-IntegrationTests/ws/>
that match the pattern **/target/checkstyle-result.xml
[CHECKSTYLE] Parsing 31 files in <https://builds.apache.org/job/Atlas-master-IntegrationTests/ws/>
[CHECKSTYLE] Successfully parsed file <https://builds.apache.org/job/Atlas-master-IntegrationTests/ws/addons/hdfs-model/target/checkstyle-result.xml>
with 0 unique warnings and 0 duplicates.
[CHECKSTYLE] Successfully parsed file <https://builds.apache.org/job/Atlas-master-IntegrationTests/ws/addons/hive-bridge-shim/target/checkstyle-result.xml>
with 15 unique warnings and 0 duplicates.
[CHECKSTYLE] Successfully parsed file <https://builds.apache.org/job/Atlas-master-IntegrationTests/ws/authorization/target/checkstyle-result.xml>
with 684 unique warnings and 0 duplicates.
[CHECKSTYLE] Successfully parsed file <https://builds.apache.org/job/Atlas-master-IntegrationTests/ws/client/client-v1/target/checkstyle-result.xml>
with 1571 unique warnings and 0 duplicates.
[CHECKSTYLE] Successfully parsed file <https://builds.apache.org/job/Atlas-master-IntegrationTests/ws/client/client-v2/target/checkstyle-result.xml>
with 1930 unique warnings and 0 duplicates.
[CHECKSTYLE] Successfully parsed file <https://builds.apache.org/job/Atlas-master-IntegrationTests/ws/client/common/target/checkstyle-result.xml>
with 2421 unique warnings and 0 duplicates.
[CHECKSTYLE] Successfully parsed file <https://builds.apache.org/job/Atlas-master-IntegrationTests/ws/client/target/checkstyle-result.xml>
with 2421 unique warnings and 0 duplicates.
[CHECKSTYLE] Successfully parsed file <https://builds.apache.org/job/Atlas-master-IntegrationTests/ws/common/target/checkstyle-result.xml>
with 3481 unique warnings and 0 duplicates.
[CHECKSTYLE] Successfully parsed file <https://builds.apache.org/job/Atlas-master-IntegrationTests/ws/dashboardv2/target/checkstyle-result.xml>
with 3481 unique warnings and 0 duplicates.
[CHECKSTYLE] Successfully parsed file <https://builds.apache.org/job/Atlas-master-IntegrationTests/ws/docs/target/checkstyle-result.xml>
with 3481 unique warnings and 0 duplicates.
[CHECKSTYLE] Successfully parsed file <https://builds.apache.org/job/Atlas-master-IntegrationTests/ws/graphdb/api/target/checkstyle-result.xml>
with 3781 unique warnings and 0 duplicates.
[CHECKSTYLE] Successfully parsed file <https://builds.apache.org/job/Atlas-master-IntegrationTests/ws/graphdb/common/target/checkstyle-result.xml>
with 4007 unique warnings and 0 duplicates.
[CHECKSTYLE] Successfully parsed file <https://builds.apache.org/job/Atlas-master-IntegrationTests/ws/graphdb/graphdb-impls/target/checkstyle-result.xml>
with 4007 unique warnings and 0 duplicates.
[CHECKSTYLE] Successfully parsed file <https://builds.apache.org/job/Atlas-master-IntegrationTests/ws/graphdb/janus/target/checkstyle-result.xml>
with 5785 unique warnings and 0 duplicates.
[CHECKSTYLE] Successfully parsed file <https://builds.apache.org/job/Atlas-master-IntegrationTests/ws/graphdb/target/checkstyle-result.xml>
with 5785 unique warnings and 0 duplicates.
[CHECKSTYLE] Successfully parsed file <https://builds.apache.org/job/Atlas-master-IntegrationTests/ws/intg/target/checkstyle-result.xml>
with 17656 unique warnings and 0 duplicates.
[CHECKSTYLE] Successfully parsed file <https://builds.apache.org/job/Atlas-master-IntegrationTests/ws/notification/target/checkstyle-result.xml>
with 18893 unique warnings and 0 duplicates.
[CHECKSTYLE] Successfully parsed file <https://builds.apache.org/job/Atlas-master-IntegrationTests/ws/om-fwk-ocf/target/checkstyle-result.xml>
with 23934 unique warnings and 0 duplicates.
[CHECKSTYLE] Successfully parsed file <https://builds.apache.org/job/Atlas-master-IntegrationTests/ws/omag-api/target/checkstyle-result.xml>
with 25489 unique warnings and 0 duplicates.
[CHECKSTYLE] Successfully parsed file <https://builds.apache.org/job/Atlas-master-IntegrationTests/ws/omag-server/target/checkstyle-result.xml>
with 25498 unique warnings and 0 duplicates.
[CHECKSTYLE] Successfully parsed file <https://builds.apache.org/job/Atlas-master-IntegrationTests/ws/omas-assetconsumer/target/checkstyle-result.xml>
with 28337 unique warnings and 0 duplicates.
[CHECKSTYLE] Successfully parsed file <https://builds.apache.org/job/Atlas-master-IntegrationTests/ws/omas-connectedasset/target/checkstyle-result.xml>
with 31750 unique warnings and 0 duplicates.
[CHECKSTYLE] Successfully parsed file <https://builds.apache.org/job/Atlas-master-IntegrationTests/ws/omrs/target/checkstyle-result.xml>
with 71721 unique warnings and 0 duplicates.
[CHECKSTYLE] Successfully parsed file <https://builds.apache.org/job/Atlas-master-IntegrationTests/ws/plugin-classloader/target/checkstyle-result.xml>
with 71834 unique warnings and 0 duplicates.
[CHECKSTYLE] Successfully parsed file <https://builds.apache.org/job/Atlas-master-IntegrationTests/ws/repository/target/checkstyle-result.xml>
with 91121 unique warnings and 0 duplicates.
[CHECKSTYLE] Successfully parsed file <https://builds.apache.org/job/Atlas-master-IntegrationTests/ws/server-api/target/checkstyle-result.xml>
with 91287 unique warnings and 0 duplicates.
[CHECKSTYLE] Successfully parsed file <https://builds.apache.org/job/Atlas-master-IntegrationTests/ws/shaded/hbase-client-shaded/target/checkstyle-result.xml>
with 91287 unique warnings and 0 duplicates.
[CHECKSTYLE] Successfully parsed file <https://builds.apache.org/job/Atlas-master-IntegrationTests/ws/shaded/hbase-server-shaded/target/checkstyle-result.xml>
with 91287 unique warnings and 0 duplicates.
[CHECKSTYLE] Successfully parsed file <https://builds.apache.org/job/Atlas-master-IntegrationTests/ws/target/checkstyle-result.xml>
with 91287 unique warnings and 0 duplicates.
[CHECKSTYLE] Successfully parsed file <https://builds.apache.org/job/Atlas-master-IntegrationTests/ws/test-tools/target/checkstyle-result.xml>
with 91325 unique warnings and 0 duplicates.
[CHECKSTYLE] Successfully parsed file <https://builds.apache.org/job/Atlas-master-IntegrationTests/ws/webapp/target/checkstyle-result.xml>
with 99660 unique warnings and 0 duplicates.
<Git Blamer> Using GitBlamer to create author and commit information for all warnings.
<Git Blamer> GIT_COMMIT=f15995cc8471e498e2a86c3e4790889ccccac84e, workspace=<https://builds.apache.org/job/Atlas-master-IntegrationTests/ws/>
 > git rev-parse f15995cc8471e498e2a86c3e4790889ccccac84e^{commit} # timeout=10
<Git Blamer> Skipping file <https://builds.apache.org/job/Atlas-master-IntegrationTests/ws/graphdb/janus/src/main/java/org/apache/atlas/repository/graphdb/janus/graphson/AtlasGraphSONMode.java,>
no result found.
[CHECKSTYLE] Computing warning deltas based on reference build #1298
[FINDBUGS] Collecting findbugs analysis files...
[FINDBUGS] Searching for all files in <https://builds.apache.org/job/Atlas-master-IntegrationTests/ws/>
that match the pattern **/target/findbugs.xml
[FINDBUGS] Parsing 22 files in <https://builds.apache.org/job/Atlas-master-IntegrationTests/ws/>
[FINDBUGS] Successfully parsed file <https://builds.apache.org/job/Atlas-master-IntegrationTests/ws/addons/hive-bridge-shim/target/findbugs.xml>
with 0 unique warnings and 0 duplicates.
[FINDBUGS] Successfully parsed file <https://builds.apache.org/job/Atlas-master-IntegrationTests/ws/authorization/target/findbugs.xml>
with 0 unique warnings and 0 duplicates.
[FINDBUGS] Successfully parsed file <https://builds.apache.org/job/Atlas-master-IntegrationTests/ws/client/client-v1/target/findbugs.xml>
with 0 unique warnings and 0 duplicates.
[FINDBUGS] Successfully parsed file <https://builds.apache.org/job/Atlas-master-IntegrationTests/ws/client/client-v2/target/findbugs.xml>
with 0 unique warnings and 0 duplicates.
[FINDBUGS] Successfully parsed file <https://builds.apache.org/job/Atlas-master-IntegrationTests/ws/client/common/target/findbugs.xml>
with 0 unique warnings and 0 duplicates.
[FINDBUGS] Successfully parsed file <https://builds.apache.org/job/Atlas-master-IntegrationTests/ws/common/target/findbugs.xml>
with 0 unique warnings and 0 duplicates.
[FINDBUGS] Successfully parsed file <https://builds.apache.org/job/Atlas-master-IntegrationTests/ws/graphdb/api/target/findbugs.xml>
with 0 unique warnings and 0 duplicates.
[FINDBUGS] Successfully parsed file <https://builds.apache.org/job/Atlas-master-IntegrationTests/ws/graphdb/common/target/findbugs.xml>
with 0 unique warnings and 0 duplicates.
[FINDBUGS] Successfully parsed file <https://builds.apache.org/job/Atlas-master-IntegrationTests/ws/graphdb/janus/target/findbugs.xml>
with 0 unique warnings and 0 duplicates.
[FINDBUGS] Successfully parsed file <https://builds.apache.org/job/Atlas-master-IntegrationTests/ws/intg/target/findbugs.xml>
with 0 unique warnings and 0 duplicates.
[FINDBUGS] Successfully parsed file <https://builds.apache.org/job/Atlas-master-IntegrationTests/ws/notification/target/findbugs.xml>
with 0 unique warnings and 0 duplicates.
[FINDBUGS] Successfully parsed file <https://builds.apache.org/job/Atlas-master-IntegrationTests/ws/om-fwk-ocf/target/findbugs.xml>
with 0 unique warnings and 0 duplicates.
[FINDBUGS] Successfully parsed file <https://builds.apache.org/job/Atlas-master-IntegrationTests/ws/omag-api/target/findbugs.xml>
with 0 unique warnings and 0 duplicates.
[FINDBUGS] Successfully parsed file <https://builds.apache.org/job/Atlas-master-IntegrationTests/ws/omag-server/target/findbugs.xml>
with 0 unique warnings and 0 duplicates.
[FINDBUGS] Successfully parsed file <https://builds.apache.org/job/Atlas-master-IntegrationTests/ws/omas-assetconsumer/target/findbugs.xml>
with 0 unique warnings and 0 duplicates.
[FINDBUGS] Successfully parsed file <https://builds.apache.org/job/Atlas-master-IntegrationTests/ws/omas-connectedasset/target/findbugs.xml>
with 0 unique warnings and 0 duplicates.
[FINDBUGS] Successfully parsed file <https://builds.apache.org/job/Atlas-master-IntegrationTests/ws/omrs/target/findbugs.xml>
with 0 unique warnings and 0 duplicates.
[FINDBUGS] Successfully parsed file <https://builds.apache.org/job/Atlas-master-IntegrationTests/ws/plugin-classloader/target/findbugs.xml>
with 0 unique warnings and 0 duplicates.
[FINDBUGS] Successfully parsed file <https://builds.apache.org/job/Atlas-master-IntegrationTests/ws/repository/target/findbugs.xml>
with 0 unique warnings and 0 duplicates.
[FINDBUGS] Successfully parsed file <https://builds.apache.org/job/Atlas-master-IntegrationTests/ws/server-api/target/findbugs.xml>
with 0 unique warnings and 0 duplicates.
[FINDBUGS] Successfully parsed file <https://builds.apache.org/job/Atlas-master-IntegrationTests/ws/test-tools/target/findbugs.xml>
with 0 unique warnings and 0 duplicates.
[FINDBUGS] Successfully parsed file <https://builds.apache.org/job/Atlas-master-IntegrationTests/ws/webapp/target/findbugs.xml>
with 0 unique warnings and 0 duplicates.
<Git Blamer> Using GitBlamer to create author and commit information for all warnings.
<Git Blamer> GIT_COMMIT=f15995cc8471e498e2a86c3e4790889ccccac84e, workspace=<https://builds.apache.org/job/Atlas-master-IntegrationTests/ws/>
[FINDBUGS] Computing warning deltas based on reference build #1298
Archiving artifacts
[Fast Archiver] Compressed 166.15 MB of artifacts by 83.9% relative to #1298
TestNG Reports Processing: START
Looking for TestNG results report in workspace using pattern: **/target/surefire-reports/testng-results.xml,**/target/failsafe-reports/testng-results.xml
Saving reports...
Processing '/x1/jenkins/jenkins-home/jobs/Atlas-master-IntegrationTests/builds/1299/testng/testng-results-1.xml'
Processing '/x1/jenkins/jenkins-home/jobs/Atlas-master-IntegrationTests/builds/1299/testng/testng-results.xml'
0.609756% of tests failed, which exceeded threshold of 0%. Marking build as UNSTABLE
TestNG Reports Processing: FINISH

Mime
View raw message