atlas-dev mailing list archives

Site index · List index
Message view « Date » · « Thread »
Top « Date » · « Thread »
From Apache Jenkins Server <jenk...@builds.apache.org>
Subject Build failed in Jenkins: Atlas-master-UnitTests #1387
Date Thu, 17 May 2018 00:27:32 GMT
See <https://builds.apache.org/job/Atlas-master-UnitTests/1387/display/redirect?page=changes>

Changes:

[madhan] ATLAS-2666: added unit tests to KafkaBridge

------------------------------------------
[...truncated 121.69 KB...]
[INFO] Exclude: **/*.json
[INFO] Exclude: **/*.log
[INFO] Exclude: **/target/**
[INFO] Exclude: **/target*/**
[INFO] Exclude: **/build/**
[INFO] Exclude: **/*.patch
[INFO] Exclude: derby.log
[INFO] Exclude: **/logs/**
[INFO] Exclude: **/.classpath
[INFO] Exclude: **/.project
[INFO] Exclude: **/.settings/**
[INFO] Exclude: **/test-output/**
[INFO] Exclude: **/mock/**
[INFO] Exclude: **/data/**
[INFO] Exclude: **/maven-eclipse.xml
[INFO] Exclude: **/.externalToolBuilders/**
[INFO] Exclude: **/build.log
[INFO] Exclude: **/.bowerrc
[INFO] Exclude: *.json
[INFO] Exclude: **/overlays/**
[INFO] Exclude: dev-support/**
[INFO] Exclude: **/users-credentials.properties
[INFO] Exclude: **/public/css/animate.min.css
[INFO] Exclude: **/public/css/bootstrap-sidebar.css
[INFO] Exclude: **/public/js/external_lib/**
[INFO] Exclude: **/node_modules/**
[INFO] Exclude: **/public/js/libs/**
[INFO] Exclude: **/atlas.data/**
[INFO] Exclude: **/${sys:atlas.data}/**
[INFO] Exclude: **/policy-store.txt
[INFO] Exclude: **/*rebel*.xml
[INFO] Exclude: **/*rebel*.xml.bak
[INFO] Exclude: **/test/resources/**
[INFO] 12 resources included (use -debug for more details)
[INFO] Rat check: Summary over all files. Unapproved: 0, unknown: 0, generated: 0, approved:
12 licenses.
[INFO] 
[INFO] --- maven-remote-resources-plugin:1.5:process (default) @ atlas-graphdb-common ---
[INFO] 
[INFO] --- maven-resources-plugin:2.7:resources (default-resources) @ atlas-graphdb-common
---
[INFO] Using 'UTF-8' encoding to copy filtered resources.
[INFO] skip non existing resourceDirectory <https://builds.apache.org/job/Atlas-master-UnitTests/ws/graphdb/common/src/main/resources>
[INFO] Copying 0 resource to META-INF
[INFO] Copying 3 resources
[INFO] 
[INFO] --- maven-compiler-plugin:3.7.0:compile (default-compile) @ atlas-graphdb-common ---
[INFO] Changes detected - recompiling the module!
[INFO] Compiling 10 source files to <https://builds.apache.org/job/Atlas-master-UnitTests/ws/graphdb/common/target/classes>
[INFO] <https://builds.apache.org/job/Atlas-master-UnitTests/ws/graphdb/common/src/main/java/org/apache/atlas/repository/graphdb/tinkerpop/query/expr/InPredicate.java>:
<https://builds.apache.org/job/Atlas-master-UnitTests/ws/graphdb/common/src/main/java/org/apache/atlas/repository/graphdb/tinkerpop/query/expr/InPredicate.java>
uses unchecked or unsafe operations.
[INFO] <https://builds.apache.org/job/Atlas-master-UnitTests/ws/graphdb/common/src/main/java/org/apache/atlas/repository/graphdb/tinkerpop/query/expr/InPredicate.java>:
Recompile with -Xlint:unchecked for details.
[INFO] 
[INFO] --- maven-resources-plugin:2.7:testResources (default-testResources) @ atlas-graphdb-common
---
[INFO] Using 'UTF-8' encoding to copy filtered resources.
[INFO] skip non existing resourceDirectory <https://builds.apache.org/job/Atlas-master-UnitTests/ws/graphdb/common/src/test/resources>
[INFO] Copying 3 resources
[INFO] 
[INFO] --- maven-compiler-plugin:3.7.0:testCompile (default-testCompile) @ atlas-graphdb-common
---
[INFO] Changes detected - recompiling the module!
[INFO] Compiling 1 source file to <https://builds.apache.org/job/Atlas-master-UnitTests/ws/graphdb/common/target/test-classes>
[INFO] 
[INFO] --- maven-surefire-plugin:2.18.1:test (default-test) @ atlas-graphdb-common ---
[INFO] 
[INFO] --- maven-jar-plugin:2.4:jar (default-jar) @ atlas-graphdb-common ---
[INFO] Building jar: <https://builds.apache.org/job/Atlas-master-UnitTests/ws/graphdb/common/target/atlas-graphdb-common-1.0.0-SNAPSHOT.jar>
[INFO] 
[INFO] --- maven-site-plugin:3.7:attach-descriptor (attach-descriptor) @ atlas-graphdb-common
---
[INFO] Skipping because packaging 'jar' is not pom.
[INFO] 
[INFO] --- maven-jar-plugin:2.4:test-jar (default) @ atlas-graphdb-common ---
[INFO] Building jar: <https://builds.apache.org/job/Atlas-master-UnitTests/ws/graphdb/common/target/atlas-graphdb-common-1.0.0-SNAPSHOT-tests.jar>
[INFO] 
[INFO] ------------------------------------------------------------------------
[INFO] Building Apache Atlas JanusGraph DB Impl 1.0.0-SNAPSHOT
[INFO] ------------------------------------------------------------------------
[INFO] 
[INFO] --- maven-clean-plugin:2.5:clean (default-clean) @ atlas-graphdb-janus ---
[INFO] Deleting <https://builds.apache.org/job/Atlas-master-UnitTests/ws/graphdb/janus>
(includes = [**/*.pyc], excludes = [])
[INFO] 
[INFO] --- maven-enforcer-plugin:3.0.0-M1:enforce (enforce-versions) @ atlas-graphdb-janus
---
[INFO] 
[INFO] --- buildnumber-maven-plugin:1.4:create (default) @ atlas-graphdb-janus ---
[INFO] Executing: /bin/sh -c cd '<https://builds.apache.org/job/Atlas-master-UnitTests/ws/graphdb/janus'>
&& 'git' 'rev-parse' '--verify' 'HEAD'
[INFO] Working directory: <https://builds.apache.org/job/Atlas-master-UnitTests/ws/graphdb/janus>
[INFO] Storing buildNumber: 2798234dfb8e7a6781b28cc1dbb8d3547591e336 at timestamp: 1526516841572
[WARNING] Cannot get the branch information from the git repository: 
Detecting the current branch failed: fatal: ref HEAD is not a symbolic ref

[INFO] Executing: /bin/sh -c cd '<https://builds.apache.org/job/Atlas-master-UnitTests/ws/graphdb/janus'>
&& 'git' 'rev-parse' '--verify' 'HEAD'
[INFO] Working directory: <https://builds.apache.org/job/Atlas-master-UnitTests/ws/graphdb/janus>
[INFO] Storing buildScmBranch: UNKNOWN
[INFO] 
[INFO] --- apache-rat-plugin:0.12:check (rat-check) @ atlas-graphdb-janus ---
[INFO] Enabled default license matchers.
[INFO] Will parse SCM ignores for exclusions...
[INFO] Finished adding exclusions from SCM ignore files.
[INFO] 61 implicit excludes (use -debug for more details).
[INFO] Exclude: **/antlr4/**
[INFO] Exclude: **/dependency-reduced-pom.xml
[INFO] Exclude: **/javax.script.ScriptEngineFactory
[INFO] Exclude: .reviewboardrc
[INFO] Exclude: 3party-licenses/**
[INFO] Exclude: **/.cache
[INFO] Exclude: **/.cache-main
[INFO] Exclude: **/.cache-tests
[INFO] Exclude: **/.checkstyle
[INFO] Exclude: **/*.txt
[INFO] Exclude: **/*.json
[INFO] Exclude: .pc/**
[INFO] Exclude: debian/**
[INFO] Exclude: .svn/**
[INFO] Exclude: .git/**
[INFO] Exclude: .gitignore
[INFO] Exclude: **/.idea/**
[INFO] Exclude: **/*.twiki
[INFO] Exclude: **/*.iml
[INFO] Exclude: **/*.json
[INFO] Exclude: **/*.log
[INFO] Exclude: **/target/**
[INFO] Exclude: **/target*/**
[INFO] Exclude: **/build/**
[INFO] Exclude: **/*.patch
[INFO] Exclude: derby.log
[INFO] Exclude: **/logs/**
[INFO] Exclude: **/.classpath
[INFO] Exclude: **/.project
[INFO] Exclude: **/.settings/**
[INFO] Exclude: **/test-output/**
[INFO] Exclude: **/mock/**
[INFO] Exclude: **/data/**
[INFO] Exclude: **/maven-eclipse.xml
[INFO] Exclude: **/.externalToolBuilders/**
[INFO] Exclude: **/build.log
[INFO] Exclude: **/.bowerrc
[INFO] Exclude: *.json
[INFO] Exclude: **/overlays/**
[INFO] Exclude: dev-support/**
[INFO] Exclude: **/users-credentials.properties
[INFO] Exclude: **/public/css/animate.min.css
[INFO] Exclude: **/public/css/bootstrap-sidebar.css
[INFO] Exclude: **/public/js/external_lib/**
[INFO] Exclude: **/node_modules/**
[INFO] Exclude: **/public/js/libs/**
[INFO] Exclude: **/atlas.data/**
[INFO] Exclude: **/${sys:atlas.data}/**
[INFO] Exclude: **/policy-store.txt
[INFO] Exclude: **/*rebel*.xml
[INFO] Exclude: **/*rebel*.xml.bak
[INFO] Exclude: **/test/resources/**
[INFO] 47 resources included (use -debug for more details)
[INFO] Rat check: Summary over all files. Unapproved: 0, unknown: 0, generated: 0, approved:
47 licenses.
[INFO] 
[INFO] --- maven-resources-plugin:2.7:copy-resources (copy-resources) @ atlas-graphdb-janus
---
[INFO] Using 'UTF-8' encoding to copy filtered resources.
[INFO] Copying 9 resources
[INFO] 
[INFO] --- maven-remote-resources-plugin:1.5:process (default) @ atlas-graphdb-janus ---
Downloading from central: http://repo1.maven.org/maven2/com/sleepycat/je/7.3.7/je-7.3.7.pom
Downloading from hortonworks.repo: http://repo.hortonworks.com/content/repositories/releases/com/sleepycat/je/7.3.7/je-7.3.7.pom
Downloading from apache.snapshots.repo: https://repository.apache.org/content/groups/snapshots/com/sleepycat/je/7.3.7/je-7.3.7.pom
Downloading from apache-staging: https://repository.apache.org/content/groups/staging/com/sleepycat/je/7.3.7/je-7.3.7.pom
Downloading from default: https://repository.apache.org/content/groups/public/com/sleepycat/je/7.3.7/je-7.3.7.pom
Downloading from java.net-Public: https://maven.java.net/content/groups/public/com/sleepycat/je/7.3.7/je-7.3.7.pom
Downloading from repository.jboss.org-public: https://repository.jboss.org/nexus/content/groups/public/com/sleepycat/je/7.3.7/je-7.3.7.pom
Downloading from typesafe: http://repo.typesafe.com/typesafe/releases/com/sleepycat/je/7.3.7/je-7.3.7.pom
[INFO] ------------------------------------------------------------------------
[INFO] Reactor Summary:
[INFO] 
[INFO] Apache Atlas Server Build Tools .................... SUCCESS [  0.504 s]
[INFO] apache-atlas ....................................... SUCCESS [  1.766 s]
[INFO] Apache Atlas Test Utility Tools .................... SUCCESS [  4.124 s]
[INFO] Open Connector Framework (OCF) ..................... SUCCESS [  1.498 s]
[INFO] Open Metadata Repository Services (OMRS) ........... SUCCESS [  5.326 s]
[INFO] Open Metadata and Governance (OMAG) Server APIs .... SUCCESS [  0.842 s]
[INFO] Connected Asset Open Metadata Access Service (OMAS)  SUCCESS [  0.873 s]
[INFO] Asset Consumer Open Metadata Access Service (OMAS) . SUCCESS [  0.835 s]
[INFO] Open Metadata and Governance (OMAG) Server ......... SUCCESS [  0.948 s]
[INFO] Apache Atlas Integration ........................... SUCCESS [ 30.999 s]
[INFO] Apache Atlas Common ................................ SUCCESS [  2.008 s]
[INFO] Apache Atlas Client ................................ SUCCESS [  0.111 s]
[INFO] atlas-client-common ................................ SUCCESS [  0.541 s]
[INFO] atlas-client-v1 .................................... SUCCESS [  2.538 s]
[INFO] Apache Atlas Server API ............................ SUCCESS [  0.705 s]
[INFO] Apache Atlas Notification .......................... SUCCESS [ 14.280 s]
[INFO] atlas-client-v2 .................................... SUCCESS [  0.645 s]
[INFO] Apache Atlas Graph Database Projects ............... SUCCESS [  0.071 s]
[INFO] Apache Atlas Graph Database API .................... SUCCESS [  0.516 s]
[INFO] Graph Database Common Code ......................... SUCCESS [  0.630 s]
[INFO] Apache Atlas JanusGraph DB Impl .................... FAILURE [  5.088 s]
[INFO] Apache Atlas Graph Database Implementation Dependencies SKIPPED
[INFO] Shaded version of Apache hbase client .............. SKIPPED
[INFO] Shaded version of Apache hbase server .............. SKIPPED
[INFO] Apache Atlas Authorization ......................... SKIPPED
[INFO] Apache Atlas Repository ............................ SKIPPED
[INFO] Apache Atlas UI .................................... SKIPPED
[INFO] Apache Atlas Web Application ....................... SKIPPED
[INFO] Apache Atlas Documentation ......................... SKIPPED
[INFO] Apache Atlas FileSystem Model ...................... SKIPPED
[INFO] Apache Atlas Plugin Classloader .................... SKIPPED
[INFO] Apache Atlas Hive Bridge Shim ...................... SKIPPED
[INFO] Apache Atlas Hive Bridge ........................... SKIPPED
[INFO] Apache Atlas Falcon Bridge Shim .................... SKIPPED
[INFO] Apache Atlas Falcon Bridge ......................... SKIPPED
[INFO] Apache Atlas Sqoop Bridge Shim ..................... SKIPPED
[INFO] Apache Atlas Sqoop Bridge .......................... SKIPPED
[INFO] Apache Atlas Storm Bridge Shim ..................... SKIPPED
[INFO] Apache Atlas Storm Bridge .......................... SKIPPED
[INFO] Apache Atlas Hbase Bridge Shim ..................... SKIPPED
[INFO] Apache Atlas Hbase Bridge .......................... SKIPPED
[INFO] Apache Atlas Kafka Bridge .......................... SKIPPED
[INFO] Apache Atlas Distribution .......................... SKIPPED
[INFO] ------------------------------------------------------------------------
[INFO] BUILD FAILURE
[INFO] ------------------------------------------------------------------------
[INFO] Total time: 01:16 min
[INFO] Finished at: 2018-05-17T00:27:26Z
[INFO] Final Memory: 121M/1998M
[INFO] ------------------------------------------------------------------------
[ERROR] Failed to execute goal org.apache.maven.plugins:maven-remote-resources-plugin:1.5:process
(default) on project atlas-graphdb-janus: Error resolving project artifact: Could not transfer
artifact com.sleepycat:je:pom:7.3.7 from/to java.net-Public (https://maven.java.net/content/groups/public/):
Failed to transfer file: https://maven.java.net/content/groups/public/com/sleepycat/je/7.3.7/je-7.3.7.pom.
Return code is: 402, ReasonPhrase: Payment Required. for project com.sleepycat:je:jar:7.3.7
-> [Help 1]
[ERROR] 
[ERROR] To see the full stack trace of the errors, re-run Maven with the -e switch.
[ERROR] Re-run Maven using the -X switch to enable full debug logging.
[ERROR] 
[ERROR] For more information about the errors and possible solutions, please read the following
articles:
[ERROR] [Help 1] http://cwiki.apache.org/confluence/display/MAVEN/MojoExecutionException
[ERROR] 
[ERROR] After correcting the problems, you can resume the build with the command
[ERROR]   mvn <goals> -rf :atlas-graphdb-janus
Build step 'Execute shell' marked build as failure
[CHECKSTYLE] Collecting checkstyle analysis files...
[CHECKSTYLE] Searching for all files in <https://builds.apache.org/job/Atlas-master-UnitTests/ws/>
that match the pattern **/target/checkstyle-result.xml
[CHECKSTYLE] No files found. Configuration error?
<Git Blamer> Using GitBlamer to create author and commit information for all warnings.
<Git Blamer> GIT_COMMIT=2798234dfb8e7a6781b28cc1dbb8d3547591e336, workspace=<https://builds.apache.org/job/Atlas-master-UnitTests/ws/>
[CHECKSTYLE] Computing warning deltas based on reference build #1386
[FINDBUGS] Collecting findbugs analysis files...
[FINDBUGS] Searching for all files in <https://builds.apache.org/job/Atlas-master-UnitTests/ws/>
that match the pattern **/target/findbugs.xml
[FINDBUGS] No files found. Configuration error?
<Git Blamer> Using GitBlamer to create author and commit information for all warnings.
<Git Blamer> GIT_COMMIT=2798234dfb8e7a6781b28cc1dbb8d3547591e336, workspace=<https://builds.apache.org/job/Atlas-master-UnitTests/ws/>
[FINDBUGS] Computing warning deltas based on reference build #1386
Archiving artifacts
TestNG Reports Processing: START
Looking for TestNG results report in workspace using pattern: **/target/surefire-reports/testng-results.xml,**/target/failsafe-reports/testng-results.xml
Saving reports...
Processing '/x1/jenkins/jenkins-home/jobs/Atlas-master-UnitTests/builds/1387/testng/testng-results-1.xml'
Processing '/x1/jenkins/jenkins-home/jobs/Atlas-master-UnitTests/builds/1387/testng/testng-results-2.xml'
Processing '/x1/jenkins/jenkins-home/jobs/Atlas-master-UnitTests/builds/1387/testng/testng-results-3.xml'
Processing '/x1/jenkins/jenkins-home/jobs/Atlas-master-UnitTests/builds/1387/testng/testng-results-4.xml'
Processing '/x1/jenkins/jenkins-home/jobs/Atlas-master-UnitTests/builds/1387/testng/testng-results.xml'
TestNG Reports Processing: FINISH

Mime
View raw message