atlas-dev mailing list archives

Site index · List index
Message view « Date » · « Thread »
Top « Date » · « Thread »
From Apache Jenkins Server <jenk...@builds.apache.org>
Subject Build failed in Jenkins: Atlas-master-UnitTests #1223
Date Tue, 01 May 2018 15:33:34 GMT
See <https://builds.apache.org/job/Atlas-master-UnitTests/1223/display/redirect?page=changes>

Changes:

[graham_wallis] ATLAS-2569: Update maven dependency tree plugin version

[graham_wallis] ATLAS-2571: duplicate declarations

------------------------------------------
[...truncated 208.05 KB...]
[INFO] <https://builds.apache.org/job/Atlas-master-UnitTests/ws/repository/src/main/java/org/apache/atlas/repository/graph/GraphHelper.java>:
Recompile with -Xlint:unchecked for details.
[INFO] 
[INFO] --- maven-resources-plugin:2.7:testResources (default-testResources) @ atlas-repository
---
[INFO] Using 'UTF-8' encoding to copy filtered resources.
[INFO] Copying 35 resources
[INFO] Copying 3 resources
[INFO] 
[INFO] --- maven-compiler-plugin:3.7.0:testCompile (default-testCompile) @ atlas-repository
---
[INFO] Changes detected - recompiling the module!
[INFO] Compiling 43 source files to <https://builds.apache.org/job/Atlas-master-UnitTests/ws/repository/target/test-classes>
[INFO] <https://builds.apache.org/job/Atlas-master-UnitTests/ws/repository/src/test/java/org/apache/atlas/query/BasicTestSetup.java>:
<https://builds.apache.org/job/Atlas-master-UnitTests/ws/repository/src/test/java/org/apache/atlas/query/BasicTestSetup.java>
uses or overrides a deprecated API.
[INFO] <https://builds.apache.org/job/Atlas-master-UnitTests/ws/repository/src/test/java/org/apache/atlas/query/BasicTestSetup.java>:
Recompile with -Xlint:deprecation for details.
[INFO] <https://builds.apache.org/job/Atlas-master-UnitTests/ws/repository/src/test/java/org/apache/atlas/repository/store/graph/v1/InverseReferenceUpdateV1Test.java>:
Some input files use unchecked or unsafe operations.
[INFO] <https://builds.apache.org/job/Atlas-master-UnitTests/ws/repository/src/test/java/org/apache/atlas/repository/store/graph/v1/InverseReferenceUpdateV1Test.java>:
Recompile with -Xlint:unchecked for details.
[INFO] 
[INFO] --- maven-surefire-plugin:2.18.1:test (default-test) @ atlas-repository ---
[INFO] Surefire report directory: <https://builds.apache.org/job/Atlas-master-UnitTests/ws/repository/target/surefire-reports>
[INFO] Using configured provider org.apache.maven.surefire.testng.TestNGProvider

-------------------------------------------------------
 T E S T S
-------------------------------------------------------
Running org.apache.atlas.glossary.GlossaryServiceTest
Running org.apache.atlas.glossary.PaginationHelperTest
Running org.apache.atlas.repository.impexp.UniqueListTest
Running org.apache.atlas.query.DSLQueriesTest
Running org.apache.atlas.repository.impexp.ZipSinkTest
Running org.apache.atlas.repository.impexp.ImportTransformsTest
Running org.apache.atlas.query.DSLParsingTest
Running org.apache.atlas.services.MetricsServiceTest
Running org.apache.atlas.repository.impexp.AtlasImportRequestTest
Running org.apache.atlas.query.GremlinQueryComposerTest
Running org.apache.atlas.repository.impexp.TypeAttributeDifferenceTest
Running org.apache.atlas.repository.impexp.ZipSourceTest
Running org.apache.atlas.repository.store.graph.v1.InverseReferenceUpdateV1Test
Running org.apache.atlas.repository.impexp.ImportServiceTest
Running org.apache.atlas.repository.impexp.ImportTransformerJSONTest
Running org.apache.atlas.repository.store.graph.v1.InverseReferenceUpdateSoftDeleteV1Test
Running org.apache.atlas.repository.tagpropagation.ClassificationPropagationTest
Running org.apache.atlas.repository.impexp.ExportServiceTest
Running org.apache.atlas.repository.userprofile.UserProfileServiceTest
Running org.apache.atlas.repository.store.graph.v1.AtlasRelationshipStoreV1Test
Running org.apache.atlas.repository.store.graph.v1.AtlasRelationshipStoreHardDeleteV1Test
Running org.apache.atlas.repository.store.graph.v1.AtlasRelationshipDefStoreV1Test
Running org.apache.atlas.repository.impexp.ImportTransformerTest
Running org.apache.atlas.repository.store.graph.v1.AtlasEntityStoreV1Test
Running org.apache.atlas.repository.store.graph.v1.InverseReferenceUpdateHardDeleteV1Test
Running org.apache.atlas.repository.store.graph.v1.AtlasEntityStoreV1BulkImportPercentTest
Running org.apache.atlas.repository.migration.HiveStocksTest
Running org.apache.atlas.repository.store.graph.AtlasTypeDefGraphStoreTest
Running org.apache.atlas.repository.store.graph.v1.AtlasEntityDefStoreV1Test
Running org.apache.atlas.TestModules
Running org.apache.atlas.repository.audit.CassandraAuditRepositoryTest
Running org.apache.atlas.repository.migration.PathTest
Running org.apache.atlas.repository.store.graph.v1.AtlasRelationshipStoreSoftDeleteV1Test
Running org.apache.atlas.repository.migration.RelationshipMappingTest
Running org.apache.atlas.repository.migration.HiveParititionTest
Running org.apache.atlas.utils.ObjectUpdateSynchronizerTest
Running org.apache.atlas.utils.TestResourceFileUtils
Running org.apache.atlas.repository.audit.InMemoryAuditRepositoryTest
Tests run: 4, Failures: 0, Errors: 0, Skipped: 0, Time elapsed: 2.291 sec - in org.apache.atlas.repository.impexp.UniqueListTest
Running org.apache.atlas.repository.migration.MigrationProgressServiceTest
Tests run: 0, Failures: 0, Errors: 0, Skipped: 0, Time elapsed: 2.034 sec - in org.apache.atlas.repository.store.graph.v1.AtlasRelationshipStoreV1Test
Tests run: 20, Failures: 0, Errors: 0, Skipped: 0, Time elapsed: 3.333 sec - in org.apache.atlas.glossary.PaginationHelperTest
Tests run: 8, Failures: 0, Errors: 0, Skipped: 0, Time elapsed: 2.448 sec - in org.apache.atlas.repository.impexp.ImportTransformerTest
Tests run: 0, Failures: 0, Errors: 0, Skipped: 0, Time elapsed: 3.011 sec - in org.apache.atlas.repository.store.graph.v1.InverseReferenceUpdateV1Test
Tests run: 0, Failures: 0, Errors: 0, Skipped: 0, Time elapsed: 2.087 sec - in org.apache.atlas.utils.TestResourceFileUtils
Tests run: 0, Failures: 0, Errors: 0, Skipped: 0, Time elapsed: 2.615 sec - in org.apache.atlas.TestModules
Tests run: 6, Failures: 0, Errors: 0, Skipped: 0, Time elapsed: 2.666 sec - in org.apache.atlas.repository.audit.InMemoryAuditRepositoryTest
Tests run: 3, Failures: 0, Errors: 0, Skipped: 0, Time elapsed: 4.755 sec - in org.apache.atlas.repository.impexp.ImportTransformsTest
Tests run: 6, Failures: 0, Errors: 0, Skipped: 0, Time elapsed: 4.877 sec - in org.apache.atlas.repository.impexp.AtlasImportRequestTest
Tests run: 8, Failures: 0, Errors: 0, Skipped: 0, Time elapsed: 5.222 sec - in org.apache.atlas.repository.impexp.ZipSinkTest
Tests run: 8, Failures: 0, Errors: 0, Skipped: 0, Time elapsed: 5.236 sec - in org.apache.atlas.query.DSLParsingTest
Tests run: 6, Failures: 0, Errors: 0, Skipped: 0, Time elapsed: 5.095 sec - in org.apache.atlas.repository.impexp.TypeAttributeDifferenceTest
Tests run: 1, Failures: 0, Errors: 0, Skipped: 0, Time elapsed: 4.898 sec - in org.apache.atlas.repository.impexp.ImportTransformerJSONTest
Tests run: 6, Failures: 0, Errors: 0, Skipped: 0, Time elapsed: 5.251 sec - in org.apache.atlas.repository.impexp.ZipSourceTest
Tests run: 9, Failures: 0, Errors: 0, Skipped: 0, Time elapsed: 4.797 sec - in org.apache.atlas.repository.store.graph.v1.AtlasEntityStoreV1BulkImportPercentTest
Tests run: 9, Failures: 0, Errors: 0, Skipped: 0, Time elapsed: 4.861 sec - in org.apache.atlas.utils.ObjectUpdateSynchronizerTest
Tests run: 4, Failures: 0, Errors: 0, Skipped: 0, Time elapsed: 4.924 sec - in org.apache.atlas.repository.migration.MigrationProgressServiceTest
Tests run: 39, Failures: 0, Errors: 0, Skipped: 0, Time elapsed: 11.71 sec - in org.apache.atlas.query.GremlinQueryComposerTest
Tests run: 1, Failures: 0, Errors: 0, Skipped: 0, Time elapsed: 25.273 sec - in org.apache.atlas.services.MetricsServiceTest
Tests run: 1, Failures: 0, Errors: 0, Skipped: 0, Time elapsed: 44.196 sec - in org.apache.atlas.repository.store.graph.v1.AtlasEntityDefStoreV1Test
Tests run: 6, Failures: 1, Errors: 0, Skipped: 0, Time elapsed: 46.243 sec <<< FAILURE!
- in org.apache.atlas.repository.audit.CassandraAuditRepositoryTest
testListPaginationV2(org.apache.atlas.repository.audit.CassandraAuditRepositoryTest)  Time
elapsed: 23.736 sec  <<< FAILURE!
com.datastax.driver.core.exceptions.OperationTimedOutException: [localhost/127.0.0.1:9042]
Timed out waiting for server response
	at com.datastax.driver.core.exceptions.OperationTimedOutException.copy(OperationTimedOutException.java:44)
	at com.datastax.driver.core.exceptions.OperationTimedOutException.copy(OperationTimedOutException.java:26)
	at com.datastax.driver.core.DriverThrowables.propagateCause(DriverThrowables.java:37)
	at com.datastax.driver.core.DefaultResultSetFuture.getUninterruptibly(DefaultResultSetFuture.java:245)
	at com.datastax.driver.core.AbstractSession.execute(AbstractSession.java:68)
	at org.apache.atlas.repository.audit.CassandraBasedAuditRepository.putEventsV2(CassandraBasedAuditRepository.java:123)
	at org.apache.atlas.repository.audit.AbstractStorageBasedAuditRepository.putEventsV2(AbstractStorageBasedAuditRepository.java:85)
	at org.apache.atlas.repository.audit.AuditRepositoryTestBase.testListPaginationV2(AuditRepositoryTestBase.java:136)
	at sun.reflect.NativeMethodAccessorImpl.invoke0(Native Method)
	at sun.reflect.NativeMethodAccessorImpl.invoke(NativeMethodAccessorImpl.java:62)
	at sun.reflect.DelegatingMethodAccessorImpl.invoke(DelegatingMethodAccessorImpl.java:43)
	at java.lang.reflect.Method.invoke(Method.java:498)
	at org.testng.internal.MethodInvocationHelper.invokeMethod(MethodInvocationHelper.java:85)
	at org.testng.internal.Invoker.invokeMethod(Invoker.java:659)
	at org.testng.internal.Invoker.invokeTestMethod(Invoker.java:845)
	at org.testng.internal.Invoker.invokeTestMethods(Invoker.java:1153)
	at org.testng.internal.TestMethodWorker.invokeTestMethods(TestMethodWorker.java:125)
	at org.testng.internal.TestMethodWorker.run(TestMethodWorker.java:108)
	at org.testng.TestRunner.privateRun(TestRunner.java:771)
	at org.testng.TestRunner.run(TestRunner.java:621)
	at org.testng.SuiteRunner.runTest(SuiteRunner.java:357)
	at org.testng.SuiteRunner.runSequentially(SuiteRunner.java:352)
	at org.testng.SuiteRunner.privateRun(SuiteRunner.java:310)
	at org.testng.SuiteRunner.run(SuiteRunner.java:259)
	at org.testng.SuiteRunnerWorker.runSuite(SuiteRunnerWorker.java:52)
	at org.testng.SuiteRunnerWorker.run(SuiteRunnerWorker.java:86)
	at org.testng.TestNG.runSuitesSequentially(TestNG.java:1199)
	at org.testng.TestNG.runSuitesLocally(TestNG.java:1124)
	at org.testng.TestNG.run(TestNG.java:1032)
	at org.apache.maven.surefire.testng.TestNGExecutor.run(TestNGExecutor.java:115)
	at org.apache.maven.surefire.testng.TestNGDirectoryTestSuite.executeSingleClass(TestNGDirectoryTestSuite.java:129)
	at org.apache.maven.surefire.testng.TestNGDirectoryTestSuite.execute(TestNGDirectoryTestSuite.java:113)
	at org.apache.maven.surefire.testng.TestNGProvider.invoke(TestNGProvider.java:111)
	at org.apache.maven.surefire.booter.ForkedBooter.invokeProviderInSameClassLoader(ForkedBooter.java:203)
	at org.apache.maven.surefire.booter.ForkedBooter.runSuitesInProcess(ForkedBooter.java:155)
	at org.apache.maven.surefire.booter.ForkedBooter.main(ForkedBooter.java:103)
Caused by: com.datastax.driver.core.exceptions.OperationTimedOutException: [localhost/127.0.0.1:9042]
Timed out waiting for server response
	at com.datastax.driver.core.RequestHandler$SpeculativeExecution.onTimeout(RequestHandler.java:772)
	at com.datastax.driver.core.Connection$ResponseHandler$1.run(Connection.java:1374)
	at io.netty.util.HashedWheelTimer$HashedWheelTimeout.expire(HashedWheelTimer.java:581)
	at io.netty.util.HashedWheelTimer$HashedWheelBucket.expireTimeouts(HashedWheelTimer.java:656)
	at io.netty.util.HashedWheelTimer$Worker.run(HashedWheelTimer.java:367)
	at io.netty.util.concurrent.DefaultThreadFactory$DefaultRunnableDecorator.run(DefaultThreadFactory.java:137)
	at java.lang.Thread.run(Thread.java:748)

Tests run: 10, Failures: 0, Errors: 0, Skipped: 0, Time elapsed: 47.419 sec - in org.apache.atlas.repository.store.graph.v1.AtlasRelationshipDefStoreV1Test
Tests run: 1, Failures: 0, Errors: 0, Skipped: 0, Time elapsed: 60.204 sec - in org.apache.atlas.repository.migration.RelationshipMappingTest
Tests run: 5, Failures: 0, Errors: 0, Skipped: 0, Time elapsed: 64.087 sec - in org.apache.atlas.repository.store.graph.v1.InverseReferenceUpdateSoftDeleteV1Test
Tests run: 5, Failures: 0, Errors: 0, Skipped: 0, Time elapsed: 63.899 sec - in org.apache.atlas.repository.store.graph.v1.InverseReferenceUpdateHardDeleteV1Test
Tests run: 4, Failures: 0, Errors: 0, Skipped: 0, Time elapsed: 65.042 sec - in org.apache.atlas.repository.store.graph.v1.AtlasRelationshipStoreHardDeleteV1Test
Tests run: 4, Failures: 0, Errors: 0, Skipped: 0, Time elapsed: 64.532 sec - in org.apache.atlas.repository.store.graph.v1.AtlasRelationshipStoreSoftDeleteV1Test
Tests run: 12, Failures: 0, Errors: 0, Skipped: 0, Time elapsed: 68.093 sec - in org.apache.atlas.repository.impexp.ExportServiceTest
Tests run: 12, Failures: 0, Errors: 0, Skipped: 0, Time elapsed: 68.255 sec - in org.apache.atlas.repository.userprofile.UserProfileServiceTest
Tests run: 14, Failures: 0, Errors: 0, Skipped: 0, Time elapsed: 72.66 sec - in org.apache.atlas.repository.store.graph.v1.AtlasEntityStoreV1Test
Tests run: 18, Failures: 0, Errors: 0, Skipped: 0, Time elapsed: 74.022 sec - in org.apache.atlas.repository.store.graph.AtlasTypeDefGraphStoreTest
Tests run: 34, Failures: 0, Errors: 0, Skipped: 0, Time elapsed: 77.262 sec - in org.apache.atlas.glossary.GlossaryServiceTest
Tests run: 1, Failures: 0, Errors: 0, Skipped: 0, Time elapsed: 81.836 sec - in org.apache.atlas.repository.migration.PathTest
Tests run: 1, Failures: 0, Errors: 0, Skipped: 0, Time elapsed: 82.904 sec - in org.apache.atlas.repository.migration.HiveParititionTest
Tests run: 1, Failures: 0, Errors: 0, Skipped: 0, Time elapsed: 84.051 sec - in org.apache.atlas.repository.migration.HiveStocksTest
Tests run: 14, Failures: 0, Errors: 0, Skipped: 0, Time elapsed: 89.576 sec - in org.apache.atlas.repository.impexp.ImportServiceTest
Tests run: 9, Failures: 0, Errors: 0, Skipped: 0, Time elapsed: 92.255 sec - in org.apache.atlas.repository.tagpropagation.ClassificationPropagationTest
Tests run: 246, Failures: 0, Errors: 0, Skipped: 0, Time elapsed: 143.223 sec - in org.apache.atlas.query.DSLQueriesTest

Results :

Failed tests: 
  CassandraAuditRepositoryTest>AuditRepositoryTestBase.testListPaginationV2:136 » OperationTimedOut

Tests run: 536, Failures: 1, Errors: 0, Skipped: 0

[INFO] ------------------------------------------------------------------------
[INFO] Reactor Summary:
[INFO] 
[INFO] Apache Atlas Server Build Tools .................... SUCCESS [  0.680 s]
[INFO] apache-atlas ....................................... SUCCESS [  2.051 s]
[INFO] Apache Atlas Test Utility Tools .................... SUCCESS [  4.450 s]
[INFO] Open Connector Framework (OCF) ..................... SUCCESS [  1.459 s]
[INFO] Open Metadata Repository Services (OMRS) ........... SUCCESS [  6.548 s]
[INFO] Open Metadata and Governance (OMAG) Server APIs .... SUCCESS [  0.809 s]
[INFO] Connected Asset Open Metadata Access Service (OMAS)  SUCCESS [  0.833 s]
[INFO] Asset Consumer Open Metadata Access Service (OMAS) . SUCCESS [  1.002 s]
[INFO] Open Metadata and Governance (OMAG) Server ......... SUCCESS [  0.736 s]
[INFO] Apache Atlas Integration ........................... SUCCESS [ 31.920 s]
[INFO] Apache Atlas Common ................................ SUCCESS [  2.387 s]
[INFO] Apache Atlas Client ................................ SUCCESS [  0.123 s]
[INFO] atlas-client-common ................................ SUCCESS [  0.693 s]
[INFO] atlas-client-v1 .................................... SUCCESS [  2.757 s]
[INFO] Apache Atlas Server API ............................ SUCCESS [  0.764 s]
[INFO] Apache Atlas Notification .......................... SUCCESS [ 18.057 s]
[INFO] atlas-client-v2 .................................... SUCCESS [  0.655 s]
[INFO] Apache Atlas Graph Database Projects ............... SUCCESS [  0.070 s]
[INFO] Apache Atlas Graph Database API .................... SUCCESS [  0.535 s]
[INFO] Graph Database Common Code ......................... SUCCESS [  0.754 s]
[INFO] Apache Atlas JanusGraph DB Impl .................... SUCCESS [02:13 min]
[INFO] Apache Atlas Graph Database Implementation Dependencies SUCCESS [  2.124 s]
[INFO] Shaded version of Apache hbase client .............. SUCCESS [  7.184 s]
[INFO] Apache Atlas Titan 0.5.4 Graph DB Impl ............. SUCCESS [ 25.901 s]
[INFO] Shaded version of Apache hbase server .............. SUCCESS [ 18.689 s]
[INFO] Apache Atlas Authorization ......................... SUCCESS [  2.734 s]
[INFO] Apache Atlas Repository ............................ FAILURE [02:32 min]
[INFO] Apache Atlas UI .................................... SKIPPED
[INFO] Apache Atlas Web Application ....................... SKIPPED
[INFO] Apache Atlas Documentation ......................... SKIPPED
[INFO] Apache Atlas FileSystem Model ...................... SKIPPED
[INFO] Apache Atlas Plugin Classloader .................... SKIPPED
[INFO] Apache Atlas Hive Bridge Shim ...................... SKIPPED
[INFO] Apache Atlas Hive Bridge ........................... SKIPPED
[INFO] Apache Atlas Falcon Bridge Shim .................... SKIPPED
[INFO] Apache Atlas Falcon Bridge ......................... SKIPPED
[INFO] Apache Atlas Sqoop Bridge Shim ..................... SKIPPED
[INFO] Apache Atlas Sqoop Bridge .......................... SKIPPED
[INFO] Apache Atlas Storm Bridge Shim ..................... SKIPPED
[INFO] Apache Atlas Storm Bridge .......................... SKIPPED
[INFO] Apache Atlas Hbase Bridge Shim ..................... SKIPPED
[INFO] Apache Atlas Hbase Bridge .......................... SKIPPED
[INFO] Apache Atlas Kafka Bridge .......................... SKIPPED
[INFO] Apache Atlas Migration Exporter .................... SKIPPED
[INFO] Apache Atlas Distribution .......................... SKIPPED
[INFO] ------------------------------------------------------------------------
[INFO] BUILD FAILURE
[INFO] ------------------------------------------------------------------------
[INFO] Total time: 07:01 min
[INFO] Finished at: 2018-05-01T15:33:17Z
[INFO] Final Memory: 152M/1954M
[INFO] ------------------------------------------------------------------------
[ERROR] Failed to execute goal org.apache.maven.plugins:maven-surefire-plugin:2.18.1:test
(default-test) on project atlas-repository: There are test failures.
[ERROR] 
[ERROR] Please refer to <https://builds.apache.org/job/Atlas-master-UnitTests/ws/repository/target/surefire-reports>
for the individual test results.
[ERROR] -> [Help 1]
[ERROR] 
[ERROR] To see the full stack trace of the errors, re-run Maven with the -e switch.
[ERROR] Re-run Maven using the -X switch to enable full debug logging.
[ERROR] 
[ERROR] For more information about the errors and possible solutions, please read the following
articles:
[ERROR] [Help 1] http://cwiki.apache.org/confluence/display/MAVEN/MojoFailureException
[ERROR] 
[ERROR] After correcting the problems, you can resume the build with the command
[ERROR]   mvn <goals> -rf :atlas-repository
Build step 'Execute shell' marked build as failure
[CHECKSTYLE] Collecting checkstyle analysis files...
[CHECKSTYLE] Searching for all files in <https://builds.apache.org/job/Atlas-master-UnitTests/ws/>
that match the pattern **/target/checkstyle-result.xml
[CHECKSTYLE] No files found. Configuration error?
<Git Blamer> Using GitBlamer to create author and commit information for all warnings.
<Git Blamer> GIT_COMMIT=efe0935eb2affc2358f4298d20b7c3952cdba20c, workspace=<https://builds.apache.org/job/Atlas-master-UnitTests/ws/>
[CHECKSTYLE] Computing warning deltas based on reference build #1222
[FINDBUGS] Collecting findbugs analysis files...
[FINDBUGS] Searching for all files in <https://builds.apache.org/job/Atlas-master-UnitTests/ws/>
that match the pattern **/target/findbugs.xml
[FINDBUGS] No files found. Configuration error?
<Git Blamer> Using GitBlamer to create author and commit information for all warnings.
<Git Blamer> GIT_COMMIT=efe0935eb2affc2358f4298d20b7c3952cdba20c, workspace=<https://builds.apache.org/job/Atlas-master-UnitTests/ws/>
[FINDBUGS] Computing warning deltas based on reference build #1222
Archiving artifacts
TestNG Reports Processing: START
Looking for TestNG results report in workspace using pattern: **/target/surefire-reports/testng-results.xml,**/target/failsafe-reports/testng-results.xml
Saving reports...
Processing '/x1/jenkins/jenkins-home/jobs/Atlas-master-UnitTests/builds/1223/testng/testng-results-1.xml'
Processing '/x1/jenkins/jenkins-home/jobs/Atlas-master-UnitTests/builds/1223/testng/testng-results-2.xml'
Processing '/x1/jenkins/jenkins-home/jobs/Atlas-master-UnitTests/builds/1223/testng/testng-results-3.xml'
Processing '/x1/jenkins/jenkins-home/jobs/Atlas-master-UnitTests/builds/1223/testng/testng-results-4.xml'
Processing '/x1/jenkins/jenkins-home/jobs/Atlas-master-UnitTests/builds/1223/testng/testng-results-5.xml'
Processing '/x1/jenkins/jenkins-home/jobs/Atlas-master-UnitTests/builds/1223/testng/testng-results-6.xml'
Processing '/x1/jenkins/jenkins-home/jobs/Atlas-master-UnitTests/builds/1223/testng/testng-results-7.xml'
Processing '/x1/jenkins/jenkins-home/jobs/Atlas-master-UnitTests/builds/1223/testng/testng-results.xml'
TestNG Reports Processing: FINISH

Mime
View raw message