atlas-dev mailing list archives

Site index · List index
Message view « Date » · « Thread »
Top « Date » · « Thread »
From Apache Jenkins Server <jenk...@builds.apache.org>
Subject Build failed in Jenkins: PreCommit-ATLAS-Build-Test #333-master-ATLAS-2637-Data-Migration-Infer-types-that-store-edg.patch
Date Wed, 02 May 2018 18:05:12 GMT
See <https://builds.apache.org/job/PreCommit-ATLAS-Build-Test/333/display/redirect>

------------------------------------------
[...truncated 483.27 KB...]
127.0.0.1 - - [02/May/2018:18:04:15 +0000] "DELETE //localhost:31000/api/atlas/v2/entity/guid/random/classification/blah_trait
HTTP/1.1" 400 105 "-" "Java/1.8.0_172"
127.0.0.1 - - [02/May/2018:18:04:15 +0000] "GET //localhost:31000/api/atlas/discovery/search/dsl?query=hive_db_v2+where+name%3D'dbQ32FtGgEZ4'&limit=10&offset=0
HTTP/1.1" 200 1660 "-" "Java/1.8.0_172"
127.0.0.1 - - [02/May/2018:18:04:15 +0000] "GET //localhost:31000/api/atlas/discovery/search/dsl?query=hive_db_v2+where+name%3D'dbQ32FtGgEZ4'&limit=10&offset=0
HTTP/1.1" 200 1660 "-" "Java/1.8.0_172"
127.0.0.1 - - [02/May/2018:18:04:15 +0000] "POST //localhost:31000/api/atlas/v2/entity/ HTTP/1.1"
200 387 "-" "Java/1.8.0_172"
127.0.0.1 - - [02/May/2018:18:04:16 +0000] "GET //localhost:31000/api/atlas/discovery/search/dsl?query=hive_db_v2+where+name%3D'dbQ32FtGgEZ4'&limit=10&offset=0
HTTP/1.1" 200 2728 "-" "Java/1.8.0_172"
127.0.0.1 - - [02/May/2018:18:04:16 +0000] "POST //localhost:31000/api/atlas/v2/types/typedefs/
HTTP/1.1" 200 532 "-" "Java/1.8.0_172"
127.0.0.1 - - [02/May/2018:18:04:16 +0000] "POST //localhost:31000/api/atlas/v2/entity/ HTTP/1.1"
200 237 "-" "Java/1.8.0_172"
127.0.0.1 - - [02/May/2018:18:04:16 +0000] "PUT //localhost:31000/api/atlas/v2/types/typedefs/
HTTP/1.1" 200 691 "-" "Java/1.8.0_172"
127.0.0.1 - - [02/May/2018:18:04:17 +0000] "GET //localhost:31000/api/atlas/v2/entity/guid/89bbe0dc-f444-43c8-96cf-254796aede6b
HTTP/1.1" 200 282 "-" "Java/1.8.0_172"
127.0.0.1 - - [02/May/2018:18:04:17 +0000] "POST //localhost:31000/api/atlas/v2/entity/ HTTP/1.1"
404 181 "-" "Java/1.8.0_172"
127.0.0.1 - - [02/May/2018:18:04:17 +0000] "POST //localhost:31000/api/atlas/v2/entity/ HTTP/1.1"
200 237 "-" "Java/1.8.0_172"
127.0.0.1 - - [02/May/2018:18:04:17 +0000] "POST //localhost:31000/api/atlas/v2/entity/ HTTP/1.1"
200 178 "-" "Java/1.8.0_172"
127.0.0.1 - - [02/May/2018:18:04:17 +0000] "GET //localhost:31000/api/atlas/v2/entity/uniqueAttribute/type/hive_db_v2?attr:name=dbQ32FtGgEZ4
HTTP/1.1" 200 3537 "-" "Java/1.8.0_172"
127.0.0.1 - - [02/May/2018:18:04:17 +0000] "GET //localhost:31000/api/atlas/v2/entity/guid/blah
HTTP/1.1" 404 95 "-" "Java/1.8.0_172"
127.0.0.1 - - [02/May/2018:18:04:17 +0000] "POST //localhost:31000/api/atlas/v2/entity/ HTTP/1.1"
200 237 "-" "Java/1.8.0_172"
127.0.0.1 - - [02/May/2018:18:04:17 +0000] "GET //localhost:31000/api/atlas/entities/cb7f60fd-d751-4021-8084-2ce74fc53e5a/audit?count=10
HTTP/1.1" 200 954 "-" "Java/1.8.0_172"
127.0.0.1 - - [02/May/2018:18:04:17 +0000] "POST //localhost:31000/api/atlas/v2/entity/ HTTP/1.1"
200 239 "-" "Java/1.8.0_172"
127.0.0.1 - - [02/May/2018:18:04:17 +0000] "POST //localhost:31000/api/atlas/v2/entity/ HTTP/1.1"
200 392 "-" "Java/1.8.0_172"
127.0.0.1 - - [02/May/2018:18:04:17 +0000] "GET //localhost:31000/api/atlas/v2/types/typedef/name/WRKTy3uaVe
HTTP/1.1" 404 87 "-" "Java/1.8.0_172"
127.0.0.1 - - [02/May/2018:18:04:17 +0000] "POST //localhost:31000/api/atlas/v2/types/typedefs/
HTTP/1.1" 200 558 "-" "Java/1.8.0_172"
127.0.0.1 - - [02/May/2018:18:04:18 +0000] "POST //localhost:31000/api/atlas/v2/entity/ HTTP/1.1"
200 282 "-" "Java/1.8.0_172"
127.0.0.1 - - [02/May/2018:18:04:18 +0000] "GET //localhost:31000/api/atlas/v2/entity/guid/f34879d7-b464-4896-98ac-692116852a85
HTTP/1.1" 200 308 "-" "Java/1.8.0_172"
127.0.0.1 - - [02/May/2018:18:04:18 +0000] "GET //localhost:31000/api/atlas/types/database
HTTP/1.1" 200 750 "-" "Java/1.8.0_172"
127.0.0.1 - - [02/May/2018:18:04:18 +0000] "GET //localhost:31000/api/atlas/types/table HTTP/1.1"
200 1727 "-" "Java/1.8.0_172"
127.0.0.1 - - [02/May/2018:18:04:18 +0000] "GET //localhost:31000/api/atlas/types/fetl HTTP/1.1"
200 541 "-" "Java/1.8.0_172"
127.0.0.1 - - [02/May/2018:18:04:18 +0000] "GET //localhost:31000/api/atlas/types HTTP/1.1"
200 2410 "-" "Java/1.8.0_172"
127.0.0.1 - - [02/May/2018:18:04:18 +0000] "GET //localhost:31000/api/atlas/v2/entity/guid/d2aa0d17-c7a6-4e55-a48e-c967fa1abab5
HTTP/1.1" 200 1506 "-" "Java/1.8.0_172"
127.0.0.1 - - [02/May/2018:18:04:18 +0000] "POST //localhost:31000/api/atlas/v2/entity/ HTTP/1.1"
200 195 "-" "Java/1.8.0_172"
127.0.0.1 - - [02/May/2018:18:04:18 +0000] "GET //localhost:31000/api/atlas/v2/entity/guid/d2aa0d17-c7a6-4e55-a48e-c967fa1abab5
HTTP/1.1" 200 1524 "-" "Java/1.8.0_172"
127.0.0.1 - - [02/May/2018:18:04:18 +0000] "GET //localhost:31000/api/atlas/v2/entity/guid/d2aa0d17-c7a6-4e55-a48e-c967fa1abab5
HTTP/1.1" 200 1524 "-" "Java/1.8.0_172"
127.0.0.1 - - [02/May/2018:18:04:18 +0000] "POST //localhost:31000/api/atlas/v2/entity/ HTTP/1.1"
200 195 "-" "Java/1.8.0_172"
127.0.0.1 - - [02/May/2018:18:04:18 +0000] "GET //localhost:31000/api/atlas/v2/entity/guid/d2aa0d17-c7a6-4e55-a48e-c967fa1abab5
HTTP/1.1" 200 1536 "-" "Java/1.8.0_172"
127.0.0.1 - - [02/May/2018:18:04:18 +0000] "GET //localhost:31000/api/atlas/v2/entity/guid/d2aa0d17-c7a6-4e55-a48e-c967fa1abab5
HTTP/1.1" 200 1536 "-" "Java/1.8.0_172"
127.0.0.1 - - [02/May/2018:18:04:18 +0000] "POST //localhost:31000/api/atlas/v2/entity/ HTTP/1.1"
200 513 "-" "Java/1.8.0_172"
127.0.0.1 - - [02/May/2018:18:04:18 +0000] "GET //localhost:31000/api/atlas/v2/entity/guid/d2aa0d17-c7a6-4e55-a48e-c967fa1abab5
HTTP/1.1" 200 1674 "-" "Java/1.8.0_172"
127.0.0.1 - - [02/May/2018:18:04:18 +0000] "GET //localhost:31000/api/atlas/v2/types/typedef/name/PII_Traitda7wWaJeTQ
HTTP/1.1" 404 96 "-" "Java/1.8.0_172"
127.0.0.1 - - [02/May/2018:18:04:18 +0000] "POST //localhost:31000/api/atlas/v2/types/typedefs/
HTTP/1.1" 200 576 "-" "Java/1.8.0_172"
127.0.0.1 - - [02/May/2018:18:04:18 +0000] "DELETE //localhost:31000/api/atlas/v2/entity/guid/d2aa0d17-c7a6-4e55-a48e-c967fa1abab5/classification/PII_Traitda7wWaJeTQ
HTTP/1.1" 400 114 "-" "Java/1.8.0_172"
127.0.0.1 - - [02/May/2018:18:04:18 +0000] "GET //localhost:31000/api/atlas/v2/types/typedef/name/PII_TraitQiP2Bt8nSk
HTTP/1.1" 404 96 "-" "Java/1.8.0_172"
127.0.0.1 - - [02/May/2018:18:04:18 +0000] "POST //localhost:31000/api/atlas/v2/types/typedefs/
HTTP/1.1" 200 425 "-" "Java/1.8.0_172"
127.0.0.1 - - [02/May/2018:18:04:18 +0000] "GET //localhost:31000/api/atlas/v2/types/classificationdef/name/PII_TraitQiP2Bt8nSk
HTTP/1.1" 200 332 "-" "Java/1.8.0_172"
127.0.0.1 - - [02/May/2018:18:04:18 +0000] "POST //localhost:31000/api/atlas/v2/entity/guid/d2aa0d17-c7a6-4e55-a48e-c967fa1abab5/classifications
HTTP/1.1" 204 0 "-" "Java/1.8.0_172"
127.0.0.1 - - [02/May/2018:18:04:19 +0000] "GET //localhost:31000/api/atlas/v2/entity/guid/d2aa0d17-c7a6-4e55-a48e-c967fa1abab5/classifications
HTTP/1.1" 200 868 "-" "Java/1.8.0_172"
127.0.0.1 - - [02/May/2018:18:04:19 +0000] "GET //localhost:31000/api/atlas/v2/entity/guid/d2aa0d17-c7a6-4e55-a48e-c967fa1abab5/classifications
HTTP/1.1" 200 868 "-" "Java/1.8.0_172"
127.0.0.1 - - [02/May/2018:18:04:19 +0000] "POST //localhost:31000/api/atlas/v2/entity/ HTTP/1.1"
200 359 "-" "Java/1.8.0_172"
127.0.0.1 - - [02/May/2018:18:04:19 +0000] "GET //localhost:31000/api/atlas/v2/entity/guid/d2aa0d17-c7a6-4e55-a48e-c967fa1abab5
HTTP/1.1" 200 1854 "-" "Java/1.8.0_172"
127.0.0.1 - - [02/May/2018:18:04:19 +0000] "PUT //localhost:31000/api/atlas/v2/entity/uniqueAttribute/type/hive_table_v2?attr:qualifiedName=tablep1GTv0f35e
HTTP/1.1" 200 510 "-" "Java/1.8.0_172"
127.0.0.1 - - [02/May/2018:18:04:19 +0000] "GET //localhost:31000/api/atlas/v2/entity/guid/d2aa0d17-c7a6-4e55-a48e-c967fa1abab5
HTTP/1.1" 200 1930 "-" "Java/1.8.0_172"
127.0.0.1 - - [02/May/2018:18:04:38 +0000] "GET //localhost:31000/api/atlas/v2/types/typedef/name/PII_TraitrBhQFn5NvU
HTTP/1.1" 404 96 "-" "Java/1.8.0_172"
127.0.0.1 - - [02/May/2018:18:04:38 +0000] "POST //localhost:31000/api/atlas/v2/types/typedefs/
HTTP/1.1" 200 425 "-" "Java/1.8.0_172"
127.0.0.1 - - [02/May/2018:18:04:38 +0000] "POST //localhost:31000/api/atlas/v2/entity/guid/d2aa0d17-c7a6-4e55-a48e-c967fa1abab5/classifications
HTTP/1.1" 204 0 "-" "Java/1.8.0_172"
127.0.0.1 - - [02/May/2018:18:04:39 +0000] "GET //localhost:31000/api/atlas/entities/d2aa0d17-c7a6-4e55-a48e-c967fa1abab5/audit?count=100
HTTP/1.1" 200 21393 "-" "Java/1.8.0_172"
127.0.0.1 - - [02/May/2018:18:04:39 +0000] "GET //localhost:31000/api/atlas/v2/types/typedef/name/PII_TraitCrC7zlcqgH
HTTP/1.1" 404 96 "-" "Java/1.8.0_172"
127.0.0.1 - - [02/May/2018:18:04:39 +0000] "POST //localhost:31000/api/atlas/v2/types/typedefs/
HTTP/1.1" 200 576 "-" "Java/1.8.0_172"
127.0.0.1 - - [02/May/2018:18:04:39 +0000] "POST //localhost:31000/api/atlas/v2/entity/guid/d2aa0d17-c7a6-4e55-a48e-c967fa1abab5/classifications
HTTP/1.1" 204 0 "-" "Java/1.8.0_172"
127.0.0.1 - - [02/May/2018:18:04:39 +0000] "GET //localhost:31000/api/atlas/v2/entity/guid/d2aa0d17-c7a6-4e55-a48e-c967fa1abab5
HTTP/1.1" 200 2166 "-" "Java/1.8.0_172"
127.0.0.1 - - [02/May/2018:18:04:39 +0000] "GET //localhost:31000/api/atlas/v2/types/typedef/name/PII_Traitfc9R8QDB2p
HTTP/1.1" 404 96 "-" "Java/1.8.0_172"
127.0.0.1 - - [02/May/2018:18:04:39 +0000] "POST //localhost:31000/api/atlas/v2/types/typedefs/
HTTP/1.1" 200 425 "-" "Java/1.8.0_172"
127.0.0.1 - - [02/May/2018:18:04:39 +0000] "POST //localhost:31000/api/atlas/v2/entity/guid/d2aa0d17-c7a6-4e55-a48e-c967fa1abab5/classifications
HTTP/1.1" 204 0 "-" "Java/1.8.0_172"
127.0.0.1 - - [02/May/2018:18:04:40 +0000] "GET //localhost:31000/api/atlas/entities/d2aa0d17-c7a6-4e55-a48e-c967fa1abab5/audit?count=100
HTTP/1.1" 200 22091 "-" "Java/1.8.0_172"
127.0.0.1 - - [02/May/2018:18:04:40 +0000] "GET //localhost:31000/api/atlas/v2/entity/guid/d2aa0d17-c7a6-4e55-a48e-c967fa1abab5/classifications
HTTP/1.1" 200 1315 "-" "Java/1.8.0_172"
127.0.0.1 - - [02/May/2018:18:04:40 +0000] "DELETE //localhost:31000/api/atlas/v2/entity/guid/d2aa0d17-c7a6-4e55-a48e-c967fa1abab5/classification/PII_Traitfc9R8QDB2p
HTTP/1.1" 204 0 "-" "Java/1.8.0_172"
127.0.0.1 - - [02/May/2018:18:04:40 +0000] "GET //localhost:31000/api/atlas/entities/d2aa0d17-c7a6-4e55-a48e-c967fa1abab5/audit?count=100
HTTP/1.1" 200 22322 "-" "Java/1.8.0_172"
Tests run: 123, Failures: 4, Errors: 0, Skipped: 0, Time elapsed: 154.083 sec <<<
FAILURE! - in TestSuite
testEnterEmptyValues(org.apache.atlas.CredentialProviderUtilityIT)  Time elapsed: 0.852 sec
 <<< FAILURE!
java.io.IOException: Invalid secret key format
	at com.sun.crypto.provider.JceKeyStore.engineLoad(JceKeyStore.java:856)
	at java.security.KeyStore.load(KeyStore.java:1445)
	at org.apache.hadoop.security.alias.AbstractJavaKeyStoreProvider.<init>(AbstractJavaKeyStoreProvider.java:106)
	at org.apache.hadoop.security.alias.JavaKeyStoreProvider.<init>(JavaKeyStoreProvider.java:49)
	at org.apache.hadoop.security.alias.JavaKeyStoreProvider.<init>(JavaKeyStoreProvider.java:41)
	at org.apache.hadoop.security.alias.JavaKeyStoreProvider$Factory.createProvider(JavaKeyStoreProvider.java:100)
	at org.apache.hadoop.security.alias.CredentialProviderFactory.getProviders(CredentialProviderFactory.java:58)
	at org.apache.atlas.CredentialProviderUtilityIT.testEnterEmptyValues(CredentialProviderUtilityIT.java:138)

testEnterMismatchedValues(org.apache.atlas.CredentialProviderUtilityIT)  Time elapsed: 0.574
sec  <<< FAILURE!
java.io.IOException: Invalid secret key format
	at com.sun.crypto.provider.JceKeyStore.engineLoad(JceKeyStore.java:856)
	at java.security.KeyStore.load(KeyStore.java:1445)
	at org.apache.hadoop.security.alias.AbstractJavaKeyStoreProvider.<init>(AbstractJavaKeyStoreProvider.java:106)
	at org.apache.hadoop.security.alias.JavaKeyStoreProvider.<init>(JavaKeyStoreProvider.java:49)
	at org.apache.hadoop.security.alias.JavaKeyStoreProvider.<init>(JavaKeyStoreProvider.java:41)
	at org.apache.hadoop.security.alias.JavaKeyStoreProvider$Factory.createProvider(JavaKeyStoreProvider.java:100)
	at org.apache.hadoop.security.alias.CredentialProviderFactory.getProviders(CredentialProviderFactory.java:58)
	at org.apache.atlas.CredentialProviderUtilityIT.testEnterMismatchedValues(CredentialProviderUtilityIT.java:192)

testEnterValidValues(org.apache.atlas.CredentialProviderUtilityIT)  Time elapsed: 0.596 sec
 <<< FAILURE!
java.io.IOException: Invalid secret key format
	at com.sun.crypto.provider.JceKeyStore.engineLoad(JceKeyStore.java:856)
	at java.security.KeyStore.load(KeyStore.java:1445)
	at org.apache.hadoop.security.alias.AbstractJavaKeyStoreProvider.<init>(AbstractJavaKeyStoreProvider.java:106)
	at org.apache.hadoop.security.alias.JavaKeyStoreProvider.<init>(JavaKeyStoreProvider.java:49)
	at org.apache.hadoop.security.alias.JavaKeyStoreProvider.<init>(JavaKeyStoreProvider.java:41)
	at org.apache.hadoop.security.alias.JavaKeyStoreProvider$Factory.createProvider(JavaKeyStoreProvider.java:100)
	at org.apache.hadoop.security.alias.CredentialProviderFactory.getProviders(CredentialProviderFactory.java:58)
	at org.apache.atlas.CredentialProviderUtilityIT.testEnterValidValues(CredentialProviderUtilityIT.java:76)

testOverwriteValues(org.apache.atlas.CredentialProviderUtilityIT)  Time elapsed: 0.57 sec
 <<< FAILURE!
java.io.IOException: Invalid secret key format
	at com.sun.crypto.provider.JceKeyStore.engineLoad(JceKeyStore.java:856)
	at java.security.KeyStore.load(KeyStore.java:1445)
	at org.apache.hadoop.security.alias.AbstractJavaKeyStoreProvider.<init>(AbstractJavaKeyStoreProvider.java:106)
	at org.apache.hadoop.security.alias.JavaKeyStoreProvider.<init>(JavaKeyStoreProvider.java:49)
	at org.apache.hadoop.security.alias.JavaKeyStoreProvider.<init>(JavaKeyStoreProvider.java:41)
	at org.apache.hadoop.security.alias.JavaKeyStoreProvider$Factory.createProvider(JavaKeyStoreProvider.java:100)
	at org.apache.hadoop.security.alias.CredentialProviderFactory.getProviders(CredentialProviderFactory.java:58)
	at org.apache.atlas.util.CredentialProviderUtility.getCredentialProvider(CredentialProviderUtility.java:150)
	at org.apache.atlas.util.CredentialProviderUtility.main(CredentialProviderUtility.java:75)
	at org.apache.atlas.CredentialProviderUtilityIT.testOverwriteValues(CredentialProviderUtilityIT.java:251)


Results :

Failed tests: 
  CredentialProviderUtilityIT.testEnterEmptyValues:138 » IO Invalid secret key f...
  CredentialProviderUtilityIT.testEnterMismatchedValues:192 » IO Invalid secret ...
  CredentialProviderUtilityIT.testEnterValidValues:76 » IO Invalid secret key fo...
  CredentialProviderUtilityIT.testOverwriteValues:251 » IO Invalid secret key fo...

Tests run: 123, Failures: 4, Errors: 0, Skipped: 0

[INFO] 
[INFO] --- jetty-maven-plugin:9.3.14.v20161028:stop (stop-jetty) @ atlas-webapp ---
[INFO] Waiting 10 seconds for jetty to stop
[INFO] Stopped ServerConnector@3a6a95de{HTTP/1.1,[http/1.1]}{0.0.0.0:31000}
[INFO] Closing Spring root WebApplicationContext
[INFO] Shutting down log4j
[INFO] Stopped o.e.j.m.p.JettyWebAppContext@124bf418{/,file://<https://builds.apache.org/job/PreCommit-ATLAS-Build-Test/ws/webapp/target/atlas-webapp-1.0.0-SNAPSHOT/,UNAVAILABLE}{/home/jenkins/jenkins-slave/workspace/PreCommit-ATLAS-Build-Test/webapp/target/atlas-webapp-1.0.0-SNAPSHOT.war}>
[INFO] Server reports itself as stopped
[INFO] 
[INFO] --- maven-source-plugin:2.4:jar-no-fork (attach-sources) @ atlas-webapp ---
[INFO] Building jar: <https://builds.apache.org/job/PreCommit-ATLAS-Build-Test/ws/webapp/target/atlas-webapp-1.0.0-SNAPSHOT-sources.jar>
log4j:WARN No appenders could be found for logger (org.apache.zookeeper.ClientCnxn).
log4j:WARN Please initialize the log4j system properly.
log4j:WARN See http://logging.apache.org/log4j/1.2/faq.html#noconfig for more info.
[INFO] 
[INFO] --- maven-source-plugin:2.4:test-jar-no-fork (attach-sources) @ atlas-webapp ---
[INFO] Building jar: <https://builds.apache.org/job/PreCommit-ATLAS-Build-Test/ws/webapp/target/atlas-webapp-1.0.0-SNAPSHOT-test-sources.jar>
[INFO] 
[INFO] --- maven-failsafe-plugin:2.18.1:verify (verify) @ atlas-webapp ---
[INFO] Failsafe report directory: <https://builds.apache.org/job/PreCommit-ATLAS-Build-Test/ws/webapp/target/failsafe-reports>
[INFO] ------------------------------------------------------------------------
[INFO] Reactor Summary:
[INFO] 
[INFO] Apache Atlas Server Build Tools .................... SUCCESS [  1.178 s]
[INFO] apache-atlas ....................................... SUCCESS [  6.752 s]
[INFO] Apache Atlas Test Utility Tools .................... SUCCESS [  5.066 s]
[INFO] Open Connector Framework (OCF) ..................... SUCCESS [  1.918 s]
[INFO] Open Metadata Repository Services (OMRS) ........... SUCCESS [  6.126 s]
[INFO] Open Metadata and Governance (OMAG) Server APIs .... SUCCESS [  1.056 s]
[INFO] Connected Asset Open Metadata Access Service (OMAS)  SUCCESS [  1.172 s]
[INFO] Asset Consumer Open Metadata Access Service (OMAS) . SUCCESS [  1.008 s]
[INFO] Open Metadata and Governance (OMAG) Server ......... SUCCESS [  0.829 s]
[INFO] Apache Atlas Integration ........................... SUCCESS [ 37.856 s]
[INFO] Apache Atlas Common ................................ SUCCESS [  2.826 s]
[INFO] Apache Atlas Client ................................ SUCCESS [  0.191 s]
[INFO] atlas-client-common ................................ SUCCESS [  0.694 s]
[INFO] atlas-client-v1 .................................... SUCCESS [  2.633 s]
[INFO] Apache Atlas Server API ............................ SUCCESS [  0.807 s]
[INFO] Apache Atlas Notification .......................... SUCCESS [ 17.475 s]
[INFO] atlas-client-v2 .................................... SUCCESS [  0.681 s]
[INFO] Apache Atlas Graph Database Projects ............... SUCCESS [  0.110 s]
[INFO] Apache Atlas Graph Database API .................... SUCCESS [  0.671 s]
[INFO] Graph Database Common Code ......................... SUCCESS [  0.848 s]
[INFO] Apache Atlas JanusGraph DB Impl .................... SUCCESS [02:14 min]
[INFO] Apache Atlas Graph Database Implementation Dependencies SUCCESS [  1.868 s]
[INFO] Shaded version of Apache hbase client .............. SUCCESS [  7.534 s]
[INFO] Apache Atlas Titan 0.5.4 Graph DB Impl ............. SUCCESS [ 30.267 s]
[INFO] Shaded version of Apache hbase server .............. SUCCESS [ 20.743 s]
[INFO] Apache Atlas Authorization ......................... SUCCESS [  2.387 s]
[INFO] Apache Atlas Repository ............................ SUCCESS [03:03 min]
[INFO] Apache Atlas UI .................................... SUCCESS [01:48 min]
[INFO] Apache Atlas Web Application ....................... FAILURE [08:48 min]
[INFO] Apache Atlas Documentation ......................... SKIPPED
[INFO] Apache Atlas FileSystem Model ...................... SKIPPED
[INFO] Apache Atlas Plugin Classloader .................... SKIPPED
[INFO] Apache Atlas Hive Bridge Shim ...................... SKIPPED
[INFO] Apache Atlas Hive Bridge ........................... SKIPPED
[INFO] Apache Atlas Falcon Bridge Shim .................... SKIPPED
[INFO] Apache Atlas Falcon Bridge ......................... SKIPPED
[INFO] Apache Atlas Sqoop Bridge Shim ..................... SKIPPED
[INFO] Apache Atlas Sqoop Bridge .......................... SKIPPED
[INFO] Apache Atlas Storm Bridge Shim ..................... SKIPPED
[INFO] Apache Atlas Storm Bridge .......................... SKIPPED
[INFO] Apache Atlas Hbase Bridge Shim ..................... SKIPPED
[INFO] Apache Atlas Hbase Bridge .......................... SKIPPED
[INFO] Apache Atlas Kafka Bridge .......................... SKIPPED
[INFO] Apache Atlas Migration Exporter .................... SKIPPED
[INFO] Apache Atlas Distribution .......................... SKIPPED
[INFO] ------------------------------------------------------------------------
[INFO] BUILD FAILURE
[INFO] ------------------------------------------------------------------------
[INFO] Total time: 18:29 min
[INFO] Finished at: 2018-05-02T18:04:43Z
[INFO] Final Memory: 386M/2358M
[INFO] ------------------------------------------------------------------------
[ERROR] Failed to execute goal org.apache.maven.plugins:maven-failsafe-plugin:2.18.1:verify
(verify) on project atlas-webapp: There are test failures.
[ERROR] 
[ERROR] Please refer to <https://builds.apache.org/job/PreCommit-ATLAS-Build-Test/ws/webapp/target/failsafe-reports>
for the individual test results.
[ERROR] -> [Help 1]
[ERROR] 
[ERROR] To see the full stack trace of the errors, re-run Maven with the -e switch.
[ERROR] Re-run Maven using the -X switch to enable full debug logging.
[ERROR] 
[ERROR] For more information about the errors and possible solutions, please read the following
articles:
[ERROR] [Help 1] http://cwiki.apache.org/confluence/display/MAVEN/MojoFailureException
[ERROR] 
[ERROR] After correcting the problems, you can resume the build with the command
[ERROR]   mvn <goals> -rf :atlas-webapp




{color:red}-1 overall{color}.  

    {color:green}+1 @author{color}.  The patch does not contain any @author tags.

Console output: https://builds.apache.org/job/PreCommit-ATLAS-Build-Test/333//console

This message is automatically generated.


======================================================================
======================================================================
    Adding comment to Jira.
======================================================================
======================================================================




======================================================================
======================================================================
    Finished build.
======================================================================
======================================================================


+ EXIT_CODE=1
+ '[' -d <https://builds.apache.org/job/PreCommit-ATLAS-Build-Test/ws/../atlas_patchprocess_12815>
']'
+ '[' -d <https://builds.apache.org/job/PreCommit-ATLAS-Build-Test/ws/atlas_patchprocess_12815>
']'
+ mv <https://builds.apache.org/job/PreCommit-ATLAS-Build-Test/ws/atlas_patchprocess_12815>
<https://builds.apache.org/job/PreCommit-ATLAS-Build-Test/ws/patchprocess>
+ rm -f <https://builds.apache.org/job/PreCommit-ATLAS-Build-Test/ws/../atlas_patchprocess_12815>
+ exit 1
Build step 'Execute shell' marked build as failure
Set build name.
New build name is '#333-master-ATLAS-2637-Data-Migration-Infer-types-that-store-edg.patch'
Archiving artifacts
[Fast Archiver] Compressed 164.78 MB of artifacts by 84.5% relative to #331

Mime
View raw message