atlas-dev mailing list archives

Site index · List index
Message view « Date » · « Thread »
Top « Date » · « Thread »
From Apache Jenkins Server <jenk...@builds.apache.org>
Subject Build failed in Jenkins: PreCommit-ATLAS-Build-Test #274-master-ATLAS-2422-Added-to-master-from-Master.patch
Date Tue, 17 Apr 2018 02:38:09 GMT
See <https://builds.apache.org/job/PreCommit-ATLAS-Build-Test/274/display/redirect>

------------------------------------------
[...truncated 237.74 KB...]
[INFO] Exclude: **/${sys:atlas.data}/**
[INFO] Exclude: **/policy-store.txt
[INFO] Exclude: **/*rebel*.xml
[INFO] Exclude: **/*rebel*.xml.bak
[INFO] Exclude: **/test/resources/**
[INFO] 171 resources included (use -debug for more details)
[INFO] Rat check: Summary over all files. Unapproved: 0, unknown: 0, generated: 0, approved:
171 licenses.
[INFO] 
[INFO] --- maven-resources-plugin:2.7:copy-resources (copy-resources-solr) @ atlas-repository
---
[INFO] Using 'UTF-8' encoding to copy filtered resources.
[INFO] Copying 9 resources
[INFO] 
[INFO] --- maven-remote-resources-plugin:1.5:process (default) @ atlas-repository ---
[INFO] 
[INFO] --- maven-resources-plugin:2.7:resources (default-resources) @ atlas-repository ---
[INFO] Using 'UTF-8' encoding to copy filtered resources.
[INFO] skip non existing resourceDirectory <https://builds.apache.org/job/PreCommit-ATLAS-Build-Test/ws/repository/src/main/resources>
[INFO] Copying 2 resources to META-INF
[INFO] Copying 3 resources
[INFO] 
[INFO] --- maven-compiler-plugin:3.7.0:compile (default-compile) @ atlas-repository ---
[INFO] Changes detected - recompiling the module!
[INFO] Compiling 132 source files to <https://builds.apache.org/job/PreCommit-ATLAS-Build-Test/ws/repository/target/classes>
[INFO] <https://builds.apache.org/job/PreCommit-ATLAS-Build-Test/ws/repository/src/main/java/org/apache/atlas/repository/converters/AtlasInstanceConverter.java>:
Some input files use or override a deprecated API.
[INFO] <https://builds.apache.org/job/PreCommit-ATLAS-Build-Test/ws/repository/src/main/java/org/apache/atlas/repository/converters/AtlasInstanceConverter.java>:
Recompile with -Xlint:deprecation for details.
[INFO] <https://builds.apache.org/job/PreCommit-ATLAS-Build-Test/ws/repository/src/main/java/org/apache/atlas/util/SearchPredicateUtil.java>:
Some input files use unchecked or unsafe operations.
[INFO] <https://builds.apache.org/job/PreCommit-ATLAS-Build-Test/ws/repository/src/main/java/org/apache/atlas/util/SearchPredicateUtil.java>:
Recompile with -Xlint:unchecked for details.
[INFO] 
[INFO] --- maven-resources-plugin:2.7:testResources (default-testResources) @ atlas-repository
---
[INFO] Using 'UTF-8' encoding to copy filtered resources.
[INFO] Copying 32 resources
[INFO] Copying 3 resources
[INFO] 
[INFO] --- maven-compiler-plugin:3.7.0:testCompile (default-testCompile) @ atlas-repository
---
[INFO] Changes detected - recompiling the module!
[INFO] Compiling 42 source files to <https://builds.apache.org/job/PreCommit-ATLAS-Build-Test/ws/repository/target/test-classes>
[INFO] <https://builds.apache.org/job/PreCommit-ATLAS-Build-Test/ws/repository/src/test/java/org/apache/atlas/query/BasicTestSetup.java>:
<https://builds.apache.org/job/PreCommit-ATLAS-Build-Test/ws/repository/src/test/java/org/apache/atlas/query/BasicTestSetup.java>
uses or overrides a deprecated API.
[INFO] <https://builds.apache.org/job/PreCommit-ATLAS-Build-Test/ws/repository/src/test/java/org/apache/atlas/query/BasicTestSetup.java>:
Recompile with -Xlint:deprecation for details.
[INFO] <https://builds.apache.org/job/PreCommit-ATLAS-Build-Test/ws/repository/src/test/java/org/apache/atlas/repository/impexp/UniqueListTest.java>:
Some input files use unchecked or unsafe operations.
[INFO] <https://builds.apache.org/job/PreCommit-ATLAS-Build-Test/ws/repository/src/test/java/org/apache/atlas/repository/impexp/UniqueListTest.java>:
Recompile with -Xlint:unchecked for details.
[INFO] 
[INFO] --- maven-surefire-plugin:2.18.1:test (default-test) @ atlas-repository ---
[INFO] Surefire report directory: <https://builds.apache.org/job/PreCommit-ATLAS-Build-Test/ws/repository/target/surefire-reports>
[INFO] Using configured provider org.apache.maven.surefire.testng.TestNGProvider

-------------------------------------------------------
 T E S T S
-------------------------------------------------------
Running org.apache.atlas.repository.impexp.TypeAttributeDifferenceTest
Running org.apache.atlas.repository.audit.InMemoryAuditRepositoryTest
Running org.apache.atlas.repository.store.graph.v1.AtlasEntityStoreV1BulkImportPercentTest
Running org.apache.atlas.repository.impexp.ZipSourceTest
Running org.apache.atlas.repository.impexp.AtlasImportRequestTest
Running org.apache.atlas.repository.impexp.ImportTransformsTest
Running org.apache.atlas.repository.impexp.ImportTransformerTest
Running org.apache.atlas.repository.store.graph.v1.AtlasRelationshipStoreHardDeleteV1Test
Running org.apache.atlas.repository.store.graph.v1.InverseReferenceUpdateSoftDeleteV1Test
Running org.apache.atlas.repository.impexp.ZipSinkTest
Running org.apache.atlas.repository.audit.CassandraAuditRepositoryTest
Running org.apache.atlas.repository.store.graph.v1.AtlasRelationshipStoreV1Test
Running org.apache.atlas.repository.migration.RelationshipMappingTest
Running org.apache.atlas.repository.store.graph.AtlasTypeDefGraphStoreTest
Running org.apache.atlas.repository.store.graph.v1.InverseReferenceUpdateV1Test
Running org.apache.atlas.repository.migration.HiveStocksTest
Running org.apache.atlas.repository.migration.HiveParititionTest
Running org.apache.atlas.repository.impexp.ExportServiceTest
Running org.apache.atlas.repository.store.graph.v1.AtlasEntityDefStoreV1Test
Running org.apache.atlas.repository.store.graph.v1.AtlasRelationshipDefStoreV1Test
Running org.apache.atlas.utils.TestResourceFileUtils
Running org.apache.atlas.repository.impexp.UniqueListTest
Running org.apache.atlas.repository.store.graph.v1.InverseReferenceUpdateHardDeleteV1Test
Running org.apache.atlas.repository.store.graph.v1.AtlasEntityStoreV1Test
Running org.apache.atlas.repository.impexp.ImportTransformerJSONTest
Running org.apache.atlas.repository.userprofile.UserProfileServiceTest
Running org.apache.atlas.repository.migration.MigrationProgressServiceTest
Running org.apache.atlas.repository.store.graph.v1.AtlasRelationshipStoreSoftDeleteV1Test
Running org.apache.atlas.services.MetricsServiceTest
Running org.apache.atlas.repository.impexp.ImportServiceTest
Tests run: 0, Failures: 0, Errors: 0, Skipped: 0, Time elapsed: 2.461 sec - in org.apache.atlas.repository.store.graph.v1.AtlasRelationshipStoreV1Test
Running org.apache.atlas.utils.ObjectUpdateSynchronizerTest
Running org.apache.atlas.repository.migration.PathTest
Tests run: 0, Failures: 0, Errors: 0, Skipped: 0, Time elapsed: 2.819 sec - in org.apache.atlas.repository.store.graph.v1.InverseReferenceUpdateV1Test
Tests run: 8, Failures: 0, Errors: 0, Skipped: 0, Time elapsed: 3.129 sec - in org.apache.atlas.repository.impexp.ImportTransformerTest
Tests run: 6, Failures: 0, Errors: 0, Skipped: 0, Time elapsed: 3.509 sec - in org.apache.atlas.repository.audit.InMemoryAuditRepositoryTest
Tests run: 0, Failures: 0, Errors: 0, Skipped: 0, Time elapsed: 2.153 sec - in org.apache.atlas.utils.TestResourceFileUtils
Running org.apache.atlas.TestModules
Tests run: 4, Failures: 0, Errors: 0, Skipped: 0, Time elapsed: 3.557 sec - in org.apache.atlas.repository.impexp.UniqueListTest
Tests run: 6, Failures: 0, Errors: 0, Skipped: 0, Time elapsed: 5.126 sec - in org.apache.atlas.repository.impexp.TypeAttributeDifferenceTest
Running org.apache.atlas.glossary.GlossaryServiceTest
Tests run: 3, Failures: 0, Errors: 0, Skipped: 0, Time elapsed: 5.3 sec - in org.apache.atlas.repository.impexp.ImportTransformsTest
Running org.apache.atlas.query.DSLQueriesTest
Running org.apache.atlas.query.DSLParsingTest
Tests run: 6, Failures: 0, Errors: 0, Skipped: 0, Time elapsed: 5.948 sec - in org.apache.atlas.repository.impexp.AtlasImportRequestTest
Running org.apache.atlas.query.GremlinQueryComposerTest
Tests run: 0, Failures: 0, Errors: 0, Skipped: 0, Time elapsed: 1.73 sec - in org.apache.atlas.TestModules
Tests run: 9, Failures: 0, Errors: 0, Skipped: 0, Time elapsed: 7.429 sec - in org.apache.atlas.repository.store.graph.v1.AtlasEntityStoreV1BulkImportPercentTest
Tests run: 6, Failures: 0, Errors: 0, Skipped: 0, Time elapsed: 7.623 sec - in org.apache.atlas.repository.impexp.ZipSourceTest
Running org.apache.atlas.glossary.PaginationHelperTest
Tests run: 1, Failures: 0, Errors: 0, Skipped: 0, Time elapsed: 6.385 sec - in org.apache.atlas.repository.impexp.ImportTransformerJSONTest
Tests run: 8, Failures: 0, Errors: 0, Skipped: 0, Time elapsed: 8.425 sec - in org.apache.atlas.repository.impexp.ZipSinkTest
Tests run: 4, Failures: 0, Errors: 0, Skipped: 0, Time elapsed: 6.585 sec - in org.apache.atlas.repository.migration.MigrationProgressServiceTest
Tests run: 9, Failures: 0, Errors: 0, Skipped: 0, Time elapsed: 5.769 sec - in org.apache.atlas.utils.ObjectUpdateSynchronizerTest
Tests run: 8, Failures: 0, Errors: 0, Skipped: 0, Time elapsed: 3.526 sec - in org.apache.atlas.query.DSLParsingTest
Tests run: 20, Failures: 0, Errors: 0, Skipped: 0, Time elapsed: 1.602 sec - in org.apache.atlas.glossary.PaginationHelperTest
Tests run: 39, Failures: 0, Errors: 0, Skipped: 0, Time elapsed: 12.71 sec - in org.apache.atlas.query.GremlinQueryComposerTest
Tests run: 7, Failures: 0, Errors: 0, Skipped: 7, Time elapsed: 20.78 sec - in org.apache.atlas.repository.audit.CassandraAuditRepositoryTest
Tests run: 10, Failures: 0, Errors: 0, Skipped: 0, Time elapsed: 55.534 sec - in org.apache.atlas.repository.store.graph.v1.AtlasRelationshipDefStoreV1Test
Tests run: 1, Failures: 0, Errors: 0, Skipped: 0, Time elapsed: 59.611 sec - in org.apache.atlas.repository.store.graph.v1.AtlasEntityDefStoreV1Test
Tests run: 1, Failures: 0, Errors: 0, Skipped: 0, Time elapsed: 62.649 sec - in org.apache.atlas.repository.migration.RelationshipMappingTest
Tests run: 1, Failures: 0, Errors: 0, Skipped: 0, Time elapsed: 62.499 sec - in org.apache.atlas.services.MetricsServiceTest
Tests run: 5, Failures: 0, Errors: 0, Skipped: 0, Time elapsed: 67.563 sec - in org.apache.atlas.repository.store.graph.v1.InverseReferenceUpdateSoftDeleteV1Test
Tests run: 4, Failures: 0, Errors: 0, Skipped: 0, Time elapsed: 70.13 sec - in org.apache.atlas.repository.store.graph.v1.AtlasRelationshipStoreHardDeleteV1Test
Tests run: 4, Failures: 0, Errors: 0, Skipped: 0, Time elapsed: 77.439 sec - in org.apache.atlas.repository.store.graph.v1.AtlasRelationshipStoreSoftDeleteV1Test
Tests run: 5, Failures: 0, Errors: 0, Skipped: 0, Time elapsed: 79.084 sec - in org.apache.atlas.repository.store.graph.v1.InverseReferenceUpdateHardDeleteV1Test
Tests run: 12, Failures: 0, Errors: 0, Skipped: 0, Time elapsed: 80.195 sec - in org.apache.atlas.repository.userprofile.UserProfileServiceTest
Tests run: 12, Failures: 1, Errors: 0, Skipped: 0, Time elapsed: 81.105 sec <<< FAILURE!
- in org.apache.atlas.repository.impexp.ExportServiceTest
verifyTypeFull(org.apache.atlas.repository.impexp.ExportServiceTest)  Time elapsed: 0.739
sec  <<< FAILURE!
java.lang.AssertionError: expected [3] but found [4]
	at org.testng.Assert.fail(Assert.java:94)
	at org.testng.Assert.failNotEquals(Assert.java:496)
	at org.testng.Assert.assertEquals(Assert.java:125)
	at org.testng.Assert.assertEquals(Assert.java:372)
	at org.testng.Assert.assertEquals(Assert.java:382)
	at org.apache.atlas.repository.impexp.ExportServiceTest.verifyExportForFullEmployeeData(ExportServiceTest.java:355)
	at org.apache.atlas.repository.impexp.ExportServiceTest.verifyTypeFull(ExportServiceTest.java:319)

Tests run: 14, Failures: 0, Errors: 0, Skipped: 0, Time elapsed: 85.286 sec - in org.apache.atlas.repository.store.graph.v1.AtlasEntityStoreV1Test
Tests run: 18, Failures: 0, Errors: 0, Skipped: 0, Time elapsed: 87.872 sec - in org.apache.atlas.repository.store.graph.AtlasTypeDefGraphStoreTest
Tests run: 34, Failures: 0, Errors: 0, Skipped: 0, Time elapsed: 86.196 sec - in org.apache.atlas.glossary.GlossaryServiceTest
Tests run: 1, Failures: 0, Errors: 0, Skipped: 0, Time elapsed: 89.657 sec - in org.apache.atlas.repository.migration.PathTest
Tests run: 1, Failures: 0, Errors: 0, Skipped: 0, Time elapsed: 96.673 sec - in org.apache.atlas.repository.migration.HiveParititionTest
Tests run: 1, Failures: 0, Errors: 0, Skipped: 0, Time elapsed: 97.866 sec - in org.apache.atlas.repository.migration.HiveStocksTest
Tests run: 11, Failures: 0, Errors: 0, Skipped: 0, Time elapsed: 97.381 sec - in org.apache.atlas.repository.impexp.ImportServiceTest
Tests run: 246, Failures: 0, Errors: 0, Skipped: 0, Time elapsed: 160.775 sec - in org.apache.atlas.query.DSLQueriesTest

Results :

Failed tests: 
  ExportServiceTest.verifyTypeFull:319->verifyExportForFullEmployeeData:355 expected [3]
but found [4]

Tests run: 525, Failures: 1, Errors: 0, Skipped: 7

[INFO] ------------------------------------------------------------------------
[INFO] Reactor Summary:
[INFO] 
[INFO] Apache Atlas Server Build Tools .................... SUCCESS [  0.746 s]
[INFO] apache-atlas ....................................... SUCCESS [  3.329 s]
[INFO] Apache Atlas Test Utility Tools .................... SUCCESS [  4.543 s]
[INFO] Open Connector Framework (OCF) ..................... SUCCESS [  1.805 s]
[INFO] Open Metadata Repository Services (OMRS) ........... SUCCESS [  4.459 s]
[INFO] Open Metadata and Governance (OMAG) Server APIs .... SUCCESS [  0.987 s]
[INFO] Apache Atlas Integration ........................... SUCCESS [ 38.186 s]
[INFO] Apache Atlas Common ................................ SUCCESS [  2.346 s]
[INFO] Apache Atlas Client ................................ SUCCESS [  0.132 s]
[INFO] atlas-client-common ................................ SUCCESS [  0.704 s]
[INFO] atlas-client-v1 .................................... SUCCESS [  2.891 s]
[INFO] Apache Atlas Server API ............................ SUCCESS [  0.803 s]
[INFO] Apache Atlas Notification .......................... SUCCESS [ 16.821 s]
[INFO] atlas-client-v2 .................................... SUCCESS [  0.643 s]
[INFO] Apache Atlas Graph Database Projects ............... SUCCESS [  0.090 s]
[INFO] Apache Atlas Graph Database API .................... SUCCESS [  0.697 s]
[INFO] Graph Database Common Code ......................... SUCCESS [  0.789 s]
[INFO] Apache Atlas JanusGraph DB Impl .................... SUCCESS [02:40 min]
[INFO] Apache Atlas Graph Database Implementation Dependencies SUCCESS [  1.988 s]
[INFO] Shaded version of Apache hbase client .............. SUCCESS [  7.711 s]
[INFO] Apache Atlas Titan 0.5.4 Graph DB Impl ............. SUCCESS [ 28.708 s]
[INFO] Shaded version of Apache hbase server .............. SUCCESS [ 20.525 s]
[INFO] Apache Atlas Authorization ......................... SUCCESS [  2.311 s]
[INFO] Apache Atlas Repository ............................ FAILURE [02:55 min]
[INFO] Apache Atlas UI .................................... SKIPPED
[INFO] Apache Atlas Web Application ....................... SKIPPED
[INFO] Apache Atlas Documentation ......................... SKIPPED
[INFO] Apache Atlas FileSystem Model ...................... SKIPPED
[INFO] Apache Atlas Plugin Classloader .................... SKIPPED
[INFO] Apache Atlas Hive Bridge Shim ...................... SKIPPED
[INFO] Apache Atlas Hive Bridge ........................... SKIPPED
[INFO] Apache Atlas Falcon Bridge Shim .................... SKIPPED
[INFO] Apache Atlas Falcon Bridge ......................... SKIPPED
[INFO] Apache Atlas Sqoop Bridge Shim ..................... SKIPPED
[INFO] Apache Atlas Sqoop Bridge .......................... SKIPPED
[INFO] Apache Atlas Storm Bridge Shim ..................... SKIPPED
[INFO] Apache Atlas Storm Bridge .......................... SKIPPED
[INFO] Apache Atlas Hbase Bridge Shim ..................... SKIPPED
[INFO] Apache Atlas Hbase Bridge .......................... SKIPPED
[INFO] Apache Atlas Migration Exporter .................... SKIPPED
[INFO] Apache Atlas Distribution .......................... SKIPPED
[INFO] ------------------------------------------------------------------------
[INFO] BUILD FAILURE
[INFO] ------------------------------------------------------------------------
[INFO] Total time: 07:58 min
[INFO] Finished at: 2018-04-17T02:38:07Z
[INFO] Final Memory: 155M/1697M
[INFO] ------------------------------------------------------------------------
[ERROR] Failed to execute goal org.apache.maven.plugins:maven-surefire-plugin:2.18.1:test
(default-test) on project atlas-repository: There are test failures.
[ERROR] 
[ERROR] Please refer to <https://builds.apache.org/job/PreCommit-ATLAS-Build-Test/ws/repository/target/surefire-reports>
for the individual test results.
[ERROR] -> [Help 1]
[ERROR] 
[ERROR] To see the full stack trace of the errors, re-run Maven with the -e switch.
[ERROR] Re-run Maven using the -X switch to enable full debug logging.
[ERROR] 
[ERROR] For more information about the errors and possible solutions, please read the following
articles:
[ERROR] [Help 1] http://cwiki.apache.org/confluence/display/MAVEN/MojoFailureException
[ERROR] 
[ERROR] After correcting the problems, you can resume the build with the command
[ERROR]   mvn <goals> -rf :atlas-repository




{color:green}+1 overall{color}.  

    {color:green}+1 @author{color}.  The patch does not contain any @author tags.

Test results: https://builds.apache.org/job/PreCommit-ATLAS-Build-Test/274//testReport/
Console output: https://builds.apache.org/job/PreCommit-ATLAS-Build-Test/274//console

This message is automatically generated.


======================================================================
======================================================================
    Adding comment to Jira.
======================================================================
======================================================================




======================================================================
======================================================================
    Finished build.
======================================================================
======================================================================


+ EXIT_CODE=0
+ '[' -d <https://builds.apache.org/job/PreCommit-ATLAS-Build-Test/ws/../atlas_patchprocess_12684>
']'
+ '[' -d <https://builds.apache.org/job/PreCommit-ATLAS-Build-Test/ws/atlas_patchprocess_12684>
']'
+ mv <https://builds.apache.org/job/PreCommit-ATLAS-Build-Test/ws/atlas_patchprocess_12684>
<https://builds.apache.org/job/PreCommit-ATLAS-Build-Test/ws/patchprocess>
+ rm -f <https://builds.apache.org/job/PreCommit-ATLAS-Build-Test/ws/../atlas_patchprocess_12684>
+ exit 0
[description-setter] Description set: ATLAS-2422-Added-to-master-from-Master.patch
Set build name.
New build name is '#274-master-ATLAS-2422-Added-to-master-from-Master.patch'
Archiving artifacts
ERROR: No artifacts found that match the file pattern "distro/target/*.tar.gz, webapp/target/*.war,
**/target/**/*application.log". Configuration error?
ERROR: ?distro/target/*.tar.gz? doesn?t match anything: ?distro? exists but not ?distro/target/*.tar.gz?
Build step 'Archive the artifacts' changed build result to FAILURE

Mime
View raw message