atlas-dev mailing list archives

Site index · List index
Message view « Date » · « Thread »
Top « Date » · « Thread »
From Apache Jenkins Server <jenk...@builds.apache.org>
Subject Build failed in Jenkins: Atlas-master-UnitTests #988
Date Mon, 09 Apr 2018 09:32:52 GMT
See <https://builds.apache.org/job/Atlas-master-UnitTests/988/display/redirect>

------------------------------------------
[...truncated 183.51 KB...]
[INFO] Exclude: derby.log
[INFO] Exclude: **/logs/**
[INFO] Exclude: **/.classpath
[INFO] Exclude: **/.project
[INFO] Exclude: **/.settings/**
[INFO] Exclude: **/test-output/**
[INFO] Exclude: **/mock/**
[INFO] Exclude: **/data/**
[INFO] Exclude: **/maven-eclipse.xml
[INFO] Exclude: **/.externalToolBuilders/**
[INFO] Exclude: **/build.log
[INFO] Exclude: **/.bowerrc
[INFO] Exclude: *.json
[INFO] Exclude: **/overlays/**
[INFO] Exclude: dev-support/**
[INFO] Exclude: **/users-credentials.properties
[INFO] Exclude: **/public/css/animate.min.css
[INFO] Exclude: **/public/css/bootstrap-sidebar.css
[INFO] Exclude: **/public/js/external_lib/**
[INFO] Exclude: **/node_modules/**
[INFO] Exclude: **/public/js/libs/**
[INFO] Exclude: **/atlas.data/**
[INFO] Exclude: **/${sys:atlas.data}/**
[INFO] Exclude: **/policy-store.txt
[INFO] Exclude: **/*rebel*.xml
[INFO] Exclude: **/*rebel*.xml.bak
[INFO] Exclude: **/test/resources/**
[INFO] 158 resources included (use -debug for more details)
[INFO] Rat check: Summary over all files. Unapproved: 0, unknown: 0, generated: 0, approved:
158 licenses.
[INFO] 
[INFO] --- maven-resources-plugin:2.7:copy-resources (copy-resources-solr) @ atlas-repository
---
[INFO] Using 'UTF-8' encoding to copy filtered resources.
[INFO] Copying 9 resources
[INFO] 
[INFO] --- maven-remote-resources-plugin:1.5:process (default) @ atlas-repository ---
[INFO] 
[INFO] --- maven-resources-plugin:2.7:resources (default-resources) @ atlas-repository ---
[INFO] Using 'UTF-8' encoding to copy filtered resources.
[INFO] skip non existing resourceDirectory <https://builds.apache.org/job/Atlas-master-UnitTests/ws/repository/src/main/resources>
[INFO] Copying 2 resources to META-INF
[INFO] Copying 3 resources
[INFO] 
[INFO] --- maven-compiler-plugin:3.7.0:compile (default-compile) @ atlas-repository ---
[INFO] Changes detected - recompiling the module!
[INFO] Compiling 123 source files to <https://builds.apache.org/job/Atlas-master-UnitTests/ws/repository/target/classes>
[INFO] <https://builds.apache.org/job/Atlas-master-UnitTests/ws/repository/src/main/java/org/apache/atlas/repository/converters/AtlasInstanceConverter.java>:
Some input files use or override a deprecated API.
[INFO] <https://builds.apache.org/job/Atlas-master-UnitTests/ws/repository/src/main/java/org/apache/atlas/repository/converters/AtlasInstanceConverter.java>:
Recompile with -Xlint:deprecation for details.
[INFO] <https://builds.apache.org/job/Atlas-master-UnitTests/ws/repository/src/main/java/org/apache/atlas/repository/graph/GraphHelper.java>:
Some input files use unchecked or unsafe operations.
[INFO] <https://builds.apache.org/job/Atlas-master-UnitTests/ws/repository/src/main/java/org/apache/atlas/repository/graph/GraphHelper.java>:
Recompile with -Xlint:unchecked for details.
[INFO] 
[INFO] --- maven-resources-plugin:2.7:testResources (default-testResources) @ atlas-repository
---
[INFO] Using 'UTF-8' encoding to copy filtered resources.
[INFO] Copying 29 resources
[INFO] Copying 3 resources
[INFO] 
[INFO] --- maven-compiler-plugin:3.7.0:testCompile (default-testCompile) @ atlas-repository
---
[INFO] Changes detected - recompiling the module!
[INFO] Compiling 38 source files to <https://builds.apache.org/job/Atlas-master-UnitTests/ws/repository/target/test-classes>
[INFO] <https://builds.apache.org/job/Atlas-master-UnitTests/ws/repository/src/test/java/org/apache/atlas/query/BasicTestSetup.java>:
<https://builds.apache.org/job/Atlas-master-UnitTests/ws/repository/src/test/java/org/apache/atlas/query/BasicTestSetup.java>
uses or overrides a deprecated API.
[INFO] <https://builds.apache.org/job/Atlas-master-UnitTests/ws/repository/src/test/java/org/apache/atlas/query/BasicTestSetup.java>:
Recompile with -Xlint:deprecation for details.
[INFO] <https://builds.apache.org/job/Atlas-master-UnitTests/ws/repository/src/test/java/org/apache/atlas/repository/store/graph/v1/InverseReferenceUpdateV1Test.java>:
Some input files use unchecked or unsafe operations.
[INFO] <https://builds.apache.org/job/Atlas-master-UnitTests/ws/repository/src/test/java/org/apache/atlas/repository/store/graph/v1/InverseReferenceUpdateV1Test.java>:
Recompile with -Xlint:unchecked for details.
[INFO] 
[INFO] --- maven-surefire-plugin:2.18.1:test (default-test) @ atlas-repository ---
[INFO] Surefire report directory: <https://builds.apache.org/job/Atlas-master-UnitTests/ws/repository/target/surefire-reports>
[INFO] Using configured provider org.apache.maven.surefire.testng.TestNGProvider

-------------------------------------------------------
 T E S T S
-------------------------------------------------------
Running org.apache.atlas.repository.impexp.ImportTransformerJSONTest
Running org.apache.atlas.repository.impexp.ImportServiceTest
Running org.apache.atlas.TestModules
Running org.apache.atlas.repository.impexp.ExportServiceTest
Running org.apache.atlas.repository.userprofile.UserProfileServiceTest
Running org.apache.atlas.repository.impexp.ImportTransformerTest
Running org.apache.atlas.repository.migration.RelationshipMappingTest
Running org.apache.atlas.repository.impexp.ZipSinkTest
Running org.apache.atlas.repository.store.graph.v1.AtlasEntityStoreV1BulkImportPercentTest
Running org.apache.atlas.repository.impexp.UniqueListTest
Running org.apache.atlas.repository.audit.CassandraAuditRepositoryTest
Running org.apache.atlas.query.DSLParsingTest
Running org.apache.atlas.repository.migration.HiveParititionTest
Running org.apache.atlas.repository.audit.InMemoryAuditRepositoryTest
Running org.apache.atlas.repository.store.graph.v1.AtlasRelationshipStoreV1Test
Running org.apache.atlas.repository.impexp.TypeAttributeDifferenceTest
Running org.apache.atlas.repository.impexp.ZipSourceTest
Running org.apache.atlas.query.GremlinQueryComposerTest
Running org.apache.atlas.repository.migration.HiveStocksTest
Running org.apache.atlas.repository.store.graph.AtlasTypeDefGraphStoreTest
Running org.apache.atlas.repository.impexp.AtlasImportRequestTest
Running org.apache.atlas.query.DSLQueriesTest
Running org.apache.atlas.utils.TestResourceFileUtils
Running org.apache.atlas.repository.store.graph.v1.InverseReferenceUpdateHardDeleteV1Test
Running org.apache.atlas.repository.store.graph.v1.AtlasEntityStoreV1Test
Running org.apache.atlas.repository.impexp.ImportTransformsTest
Running org.apache.atlas.repository.store.graph.v1.AtlasRelationshipDefStoreV1Test
Running org.apache.atlas.repository.store.graph.v1.InverseReferenceUpdateSoftDeleteV1Test
Running org.apache.atlas.repository.store.graph.v1.InverseReferenceUpdateV1Test
Running org.apache.atlas.repository.store.graph.v1.AtlasRelationshipStoreHardDeleteV1Test
Running org.apache.atlas.services.MetricsServiceTest
Running org.apache.atlas.repository.store.graph.v1.AtlasEntityDefStoreV1Test
Running org.apache.atlas.repository.store.graph.v1.AtlasRelationshipStoreSoftDeleteV1Test
Running org.apache.atlas.utils.ObjectUpdateSynchronizerTest
Tests run: 0, Failures: 0, Errors: 0, Skipped: 0, Time elapsed: 1.668 sec - in org.apache.atlas.TestModules
Tests run: 8, Failures: 0, Errors: 0, Skipped: 0, Time elapsed: 2.149 sec - in org.apache.atlas.repository.impexp.ImportTransformerTest
Tests run: 0, Failures: 0, Errors: 0, Skipped: 0, Time elapsed: 2.103 sec - in org.apache.atlas.repository.store.graph.v1.AtlasRelationshipStoreV1Test
Tests run: 4, Failures: 0, Errors: 0, Skipped: 0, Time elapsed: 2.447 sec - in org.apache.atlas.repository.impexp.UniqueListTest
Tests run: 0, Failures: 0, Errors: 0, Skipped: 0, Time elapsed: 2.054 sec - in org.apache.atlas.utils.TestResourceFileUtils
Tests run: 0, Failures: 0, Errors: 0, Skipped: 0, Time elapsed: 1.878 sec - in org.apache.atlas.repository.store.graph.v1.InverseReferenceUpdateV1Test
Tests run: 6, Failures: 0, Errors: 0, Skipped: 0, Time elapsed: 2.649 sec - in org.apache.atlas.repository.audit.InMemoryAuditRepositoryTest
Tests run: 6, Failures: 0, Errors: 0, Skipped: 0, Time elapsed: 3.205 sec - in org.apache.atlas.repository.impexp.TypeAttributeDifferenceTest
Tests run: 1, Failures: 0, Errors: 0, Skipped: 0, Time elapsed: 3.701 sec - in org.apache.atlas.repository.impexp.ImportTransformerJSONTest
Tests run: 9, Failures: 0, Errors: 0, Skipped: 0, Time elapsed: 3.773 sec - in org.apache.atlas.repository.store.graph.v1.AtlasEntityStoreV1BulkImportPercentTest
Tests run: 8, Failures: 0, Errors: 0, Skipped: 0, Time elapsed: 4.028 sec - in org.apache.atlas.repository.impexp.ZipSinkTest
Tests run: 3, Failures: 0, Errors: 0, Skipped: 0, Time elapsed: 3.715 sec - in org.apache.atlas.repository.impexp.ImportTransformsTest
Tests run: 9, Failures: 0, Errors: 0, Skipped: 0, Time elapsed: 3.45 sec - in org.apache.atlas.utils.ObjectUpdateSynchronizerTest
Tests run: 6, Failures: 0, Errors: 0, Skipped: 0, Time elapsed: 4.251 sec - in org.apache.atlas.repository.impexp.AtlasImportRequestTest
Tests run: 8, Failures: 0, Errors: 0, Skipped: 0, Time elapsed: 4.602 sec - in org.apache.atlas.query.DSLParsingTest
Tests run: 6, Failures: 0, Errors: 0, Skipped: 0, Time elapsed: 4.558 sec - in org.apache.atlas.repository.impexp.ZipSourceTest
Tests run: 39, Failures: 0, Errors: 0, Skipped: 0, Time elapsed: 8.503 sec - in org.apache.atlas.query.GremlinQueryComposerTest
Tests run: 7, Failures: 1, Errors: 0, Skipped: 6, Time elapsed: 16.356 sec <<< FAILURE!
- in org.apache.atlas.repository.audit.CassandraAuditRepositoryTest
setup(org.apache.atlas.repository.audit.CassandraAuditRepositoryTest)  Time elapsed: 16.258
sec  <<< FAILURE!
org.apache.atlas.AtlasException: com.datastax.driver.core.exceptions.NoHostAvailableException:
All host(s) tried for query failed (tried: localhost/127.0.0.1:9042 (com.datastax.driver.core.exceptions.TransportException:
[localhost/127.0.0.1:9042] Cannot connect))
	at com.datastax.driver.core.ControlConnection.reconnectInternal(ControlConnection.java:233)
	at com.datastax.driver.core.ControlConnection.connect(ControlConnection.java:79)
	at com.datastax.driver.core.Cluster$Manager.init(Cluster.java:1483)
	at com.datastax.driver.core.Cluster.init(Cluster.java:159)
	at com.datastax.driver.core.Cluster.connectAsync(Cluster.java:330)
	at com.datastax.driver.core.Cluster.connectAsync(Cluster.java:305)
	at com.datastax.driver.core.Cluster.connect(Cluster.java:247)
	at org.apache.atlas.repository.audit.CassandraBasedAuditRepository.createSession(CassandraBasedAuditRepository.java:217)
	at org.apache.atlas.repository.audit.CassandraBasedAuditRepository.startInternal(CassandraBasedAuditRepository.java:208)
	at org.apache.atlas.repository.audit.CassandraBasedAuditRepository.start(CassandraBasedAuditRepository.java:196)
	at org.apache.atlas.repository.audit.CassandraAuditRepositoryTest.setup(CassandraAuditRepositoryTest.java:48)

Tests run: 1, Failures: 0, Errors: 0, Skipped: 0, Time elapsed: 54.304 sec - in org.apache.atlas.repository.store.graph.v1.AtlasEntityDefStoreV1Test
Tests run: 1, Failures: 0, Errors: 0, Skipped: 0, Time elapsed: 54.685 sec - in org.apache.atlas.services.MetricsServiceTest
Tests run: 10, Failures: 0, Errors: 0, Skipped: 0, Time elapsed: 55.966 sec - in org.apache.atlas.repository.store.graph.v1.AtlasRelationshipDefStoreV1Test
Tests run: 12, Failures: 0, Errors: 0, Skipped: 0, Time elapsed: 65.838 sec - in org.apache.atlas.repository.userprofile.UserProfileServiceTest
Tests run: 1, Failures: 0, Errors: 0, Skipped: 0, Time elapsed: 66.308 sec - in org.apache.atlas.repository.migration.RelationshipMappingTest
Tests run: 10, Failures: 0, Errors: 0, Skipped: 0, Time elapsed: 69.217 sec - in org.apache.atlas.repository.impexp.ExportServiceTest
Tests run: 4, Failures: 0, Errors: 0, Skipped: 0, Time elapsed: 68.67 sec - in org.apache.atlas.repository.store.graph.v1.AtlasRelationshipStoreSoftDeleteV1Test
Tests run: 4, Failures: 0, Errors: 0, Skipped: 0, Time elapsed: 69.12 sec - in org.apache.atlas.repository.store.graph.v1.AtlasRelationshipStoreHardDeleteV1Test
Tests run: 5, Failures: 0, Errors: 0, Skipped: 0, Time elapsed: 70.733 sec - in org.apache.atlas.repository.store.graph.v1.InverseReferenceUpdateSoftDeleteV1Test
Tests run: 5, Failures: 0, Errors: 0, Skipped: 0, Time elapsed: 72.073 sec - in org.apache.atlas.repository.store.graph.v1.InverseReferenceUpdateHardDeleteV1Test
Tests run: 18, Failures: 0, Errors: 0, Skipped: 0, Time elapsed: 77.852 sec - in org.apache.atlas.repository.store.graph.AtlasTypeDefGraphStoreTest
Tests run: 14, Failures: 0, Errors: 0, Skipped: 0, Time elapsed: 77.969 sec - in org.apache.atlas.repository.store.graph.v1.AtlasEntityStoreV1Test
Tests run: 1, Failures: 0, Errors: 0, Skipped: 0, Time elapsed: 85.667 sec - in org.apache.atlas.repository.migration.HiveStocksTest
Tests run: 1, Failures: 0, Errors: 0, Skipped: 0, Time elapsed: 87.939 sec - in org.apache.atlas.repository.migration.HiveParititionTest
Tests run: 10, Failures: 0, Errors: 0, Skipped: 0, Time elapsed: 88.407 sec - in org.apache.atlas.repository.impexp.ImportServiceTest
Tests run: 246, Failures: 0, Errors: 0, Skipped: 0, Time elapsed: 144.357 sec - in org.apache.atlas.query.DSLQueriesTest

Results :

Failed tests: 
  CassandraAuditRepositoryTest.setup:48 » Atlas com.datastax.driver.core.excepti...

Tests run: 463, Failures: 1, Errors: 0, Skipped: 6

[INFO] ------------------------------------------------------------------------
[INFO] Reactor Summary:
[INFO] 
[INFO] Apache Atlas Server Build Tools .................... SUCCESS [  0.612 s]
[INFO] apache-atlas ....................................... SUCCESS [  1.873 s]
[INFO] Apache Atlas Test Utility Tools .................... SUCCESS [  4.466 s]
[INFO] Open Connector Framework (OCF) ..................... SUCCESS [  1.529 s]
[INFO] Open Metadata Repository Services (OMRS) ........... SUCCESS [  3.668 s]
[INFO] Open Metadata and Governance (OMAG) Server APIs .... SUCCESS [  0.803 s]
[INFO] Apache Atlas Integration ........................... SUCCESS [ 32.333 s]
[INFO] Apache Atlas Common ................................ SUCCESS [  2.139 s]
[INFO] Apache Atlas Client ................................ SUCCESS [  0.136 s]
[INFO] atlas-client-common ................................ SUCCESS [  0.716 s]
[INFO] atlas-client-v1 .................................... SUCCESS [  2.470 s]
[INFO] Apache Atlas Server API ............................ SUCCESS [  0.847 s]
[INFO] Apache Atlas Notification .......................... SUCCESS [ 18.144 s]
[INFO] atlas-client-v2 .................................... SUCCESS [  0.623 s]
[INFO] Apache Atlas Graph Database Projects ............... SUCCESS [  0.113 s]
[INFO] Apache Atlas Graph Database API .................... SUCCESS [  0.536 s]
[INFO] Graph Database Common Code ......................... SUCCESS [  0.801 s]
[INFO] Apache Atlas JanusGraph DB Impl .................... SUCCESS [01:54 min]
[INFO] Apache Atlas Graph Database Implementation Dependencies SUCCESS [  1.947 s]
[INFO] Shaded version of Apache hbase client .............. SUCCESS [  7.130 s]
[INFO] Apache Atlas Titan 0.5.4 Graph DB Impl ............. SUCCESS [ 24.279 s]
[INFO] Shaded version of Apache hbase server .............. SUCCESS [ 17.929 s]
[INFO] Apache Atlas Authorization ......................... SUCCESS [  1.986 s]
[INFO] Apache Atlas Repository ............................ FAILURE [02:33 min]
[INFO] Apache Atlas UI .................................... SKIPPED
[INFO] Apache Atlas Web Application ....................... SKIPPED
[INFO] Apache Atlas Documentation ......................... SKIPPED
[INFO] Apache Atlas FileSystem Model ...................... SKIPPED
[INFO] Apache Atlas Plugin Classloader .................... SKIPPED
[INFO] Apache Atlas Hive Bridge Shim ...................... SKIPPED
[INFO] Apache Atlas Hive Bridge ........................... SKIPPED
[INFO] Apache Atlas Falcon Bridge Shim .................... SKIPPED
[INFO] Apache Atlas Falcon Bridge ......................... SKIPPED
[INFO] Apache Atlas Sqoop Bridge Shim ..................... SKIPPED
[INFO] Apache Atlas Sqoop Bridge .......................... SKIPPED
[INFO] Apache Atlas Storm Bridge Shim ..................... SKIPPED
[INFO] Apache Atlas Storm Bridge .......................... SKIPPED
[INFO] Apache Atlas Hbase Bridge Shim ..................... SKIPPED
[INFO] Apache Atlas Hbase Bridge .......................... SKIPPED
[INFO] Apache Atlas Migration Exporter .................... SKIPPED
[INFO] Apache Atlas Distribution .......................... SKIPPED
[INFO] ------------------------------------------------------------------------
[INFO] BUILD FAILURE
[INFO] ------------------------------------------------------------------------
[INFO] Total time: 06:34 min
[INFO] Finished at: 2018-04-09T09:32:45Z
[INFO] Final Memory: 142M/2002M
[INFO] ------------------------------------------------------------------------
[ERROR] Failed to execute goal org.apache.maven.plugins:maven-surefire-plugin:2.18.1:test
(default-test) on project atlas-repository: There are test failures.
[ERROR] 
[ERROR] Please refer to <https://builds.apache.org/job/Atlas-master-UnitTests/ws/repository/target/surefire-reports>
for the individual test results.
[ERROR] -> [Help 1]
[ERROR] 
[ERROR] To see the full stack trace of the errors, re-run Maven with the -e switch.
[ERROR] Re-run Maven using the -X switch to enable full debug logging.
[ERROR] 
[ERROR] For more information about the errors and possible solutions, please read the following
articles:
[ERROR] [Help 1] http://cwiki.apache.org/confluence/display/MAVEN/MojoFailureException
[ERROR] 
[ERROR] After correcting the problems, you can resume the build with the command
[ERROR]   mvn <goals> -rf :atlas-repository
Build step 'Execute shell' marked build as failure
[CHECKSTYLE] Collecting checkstyle analysis files...
[CHECKSTYLE] Searching for all files in <https://builds.apache.org/job/Atlas-master-UnitTests/ws/>
that match the pattern **/target/checkstyle-result.xml
[CHECKSTYLE] No files found. Configuration error?
<Git Blamer> Using GitBlamer to create author and commit information for all warnings.
<Git Blamer> GIT_COMMIT=dc71d3d42fec60c5bd763054591a6c25a1d01862, workspace=<https://builds.apache.org/job/Atlas-master-UnitTests/ws/>
[CHECKSTYLE] Computing warning deltas based on reference build #987
[FINDBUGS] Collecting findbugs analysis files...
[FINDBUGS] Searching for all files in <https://builds.apache.org/job/Atlas-master-UnitTests/ws/>
that match the pattern **/target/findbugs.xml
[FINDBUGS] No files found. Configuration error?
<Git Blamer> Using GitBlamer to create author and commit information for all warnings.
<Git Blamer> GIT_COMMIT=dc71d3d42fec60c5bd763054591a6c25a1d01862, workspace=<https://builds.apache.org/job/Atlas-master-UnitTests/ws/>
[FINDBUGS] Computing warning deltas based on reference build #987
Archiving artifacts
TestNG Reports Processing: START
Looking for TestNG results report in workspace using pattern: **/target/surefire-reports/testng-results.xml,**/target/failsafe-reports/testng-results.xml
Saving reports...
Processing '/x1/jenkins/jenkins-home/jobs/Atlas-master-UnitTests/builds/988/testng/testng-results-1.xml'
Processing '/x1/jenkins/jenkins-home/jobs/Atlas-master-UnitTests/builds/988/testng/testng-results-2.xml'
Processing '/x1/jenkins/jenkins-home/jobs/Atlas-master-UnitTests/builds/988/testng/testng-results-3.xml'
Processing '/x1/jenkins/jenkins-home/jobs/Atlas-master-UnitTests/builds/988/testng/testng-results-4.xml'
Processing '/x1/jenkins/jenkins-home/jobs/Atlas-master-UnitTests/builds/988/testng/testng-results-5.xml'
Processing '/x1/jenkins/jenkins-home/jobs/Atlas-master-UnitTests/builds/988/testng/testng-results-6.xml'
Processing '/x1/jenkins/jenkins-home/jobs/Atlas-master-UnitTests/builds/988/testng/testng-results.xml'
TestNG Reports Processing: FINISH

Mime
View raw message