atlas-dev mailing list archives

Site index · List index
Message view « Date » · « Thread »
Top « Date » · « Thread »
From Apache Jenkins Server <jenk...@builds.apache.org>
Subject Build failed in Jenkins: Atlas-master-IntegrationTests #1001
Date Mon, 09 Apr 2018 22:49:25 GMT
See <https://builds.apache.org/job/Atlas-master-IntegrationTests/1001/display/redirect>

------------------------------------------
[...truncated 669.08 KB...]
127.0.0.1 - - [09/Apr/2018:22:23:27 +0000] "GET //localhost:31000/api/atlas/v2/entity/uniqueAttribute/type/hive_table?attr:qualifiedName=default.tablecvfgfeg6eq@primary
HTTP/1.1" 200 4767 "-" "Java/1.8.0_152"
127.0.0.1 - - [09/Apr/2018:22:23:27 +0000] "GET //localhost:31000/api/atlas/v2/entity/uniqueAttribute/type/hive_process?attr:qualifiedName=TRUNCATETABLE-%3E:default.tablecvfgfeg6eq@primary:1523312606000
HTTP/1.1" 404 186 "-" "Java/1.8.0_152"
127.0.0.1 - - [09/Apr/2018:22:23:32 +0000] "GET //localhost:31000/api/atlas/v2/entity/uniqueAttribute/type/hive_process?attr:qualifiedName=TRUNCATETABLE-%3E:default.tablecvfgfeg6eq@primary:1523312606000
HTTP/1.1" 200 1132 "-" "Java/1.8.0_152"
127.0.0.1 - - [09/Apr/2018:22:23:32 +0000] "GET //localhost:31000/api/atlas/v2/entity/uniqueAttribute/type/hive_process?attr:qualifiedName=TRUNCATETABLE-%3E:default.tablecvfgfeg6eq@primary:1523312606000
HTTP/1.1" 200 1132 "-" "Java/1.8.0_152"
127.0.0.1 - - [09/Apr/2018:22:23:32 +0000] "GET //localhost:31000/api/atlas/v2/entity/guid/85d78fab-9845-4b79-9426-3903f2042077
HTTP/1.1" 200 1132 "-" "Java/1.8.0_152"
127.0.0.1 - - [09/Apr/2018:22:23:32 +0000] "GET //localhost:31000/api/atlas/v2/entity/guid/348c23e0-0a8f-4da0-b853-676611de9005
HTTP/1.1" 200 5009 "-" "Java/1.8.0_152"
127.0.0.1 - - [09/Apr/2018:22:23:32 +0000] "GET //localhost:31000/api/atlas/v2/lineage/348c23e0-0a8f-4da0-b853-676611de9005?depth=0&direction=INPUT
HTTP/1.1" 200 135 "-" "Java/1.8.0_152"
127.0.0.1 - - [09/Apr/2018:22:23:35 +0000] "GET //localhost:31000/api/atlas/v2/entity/uniqueAttribute/type/hive_process?attr:qualifiedName=QUERY:default.tableocusueu6ez@primary:1523312612000-%3E
HTTP/1.1" 404 178 "-" "Java/1.8.0_152"
127.0.0.1 - - [09/Apr/2018:22:23:40 +0000] "GET //localhost:31000/api/atlas/v2/entity/uniqueAttribute/type/hive_process?attr:qualifiedName=QUERY:default.tableocusueu6ez@primary:1523312612000-%3E
HTTP/1.1" 200 2018 "-" "Java/1.8.0_152"
127.0.0.1 - - [09/Apr/2018:22:23:40 +0000] "GET //localhost:31000/api/atlas/v2/entity/uniqueAttribute/type/hive_process?attr:qualifiedName=QUERY:default.tableocusueu6ez@primary:1523312612000-%3E
HTTP/1.1" 200 2018 "-" "Java/1.8.0_152"
127.0.0.1 - - [09/Apr/2018:22:23:40 +0000] "GET //localhost:31000/api/atlas/v2/entity/guid/8a956165-b465-47fa-8391-1829c2eb8b35
HTTP/1.1" 200 2018 "-" "Java/1.8.0_152"
127.0.0.1 - - [09/Apr/2018:22:23:40 +0000] "GET //localhost:31000/api/atlas/v2/entity/guid/a279734a-8844-431f-96de-50553c024d8e
HTTP/1.1" 200 5176 "-" "Java/1.8.0_152"
127.0.0.1 - - [09/Apr/2018:22:23:40 +0000] "GET //localhost:31000/api/atlas/v2/entity/guid/07f9ab20-2786-4592-8243-c53295ff1f7e
HTTP/1.1" 200 1385 "-" "Java/1.8.0_152"
127.0.0.1 - - [09/Apr/2018:22:23:40 +0000] "GET //localhost:31000/api/atlas/v2/entity/uniqueAttribute/type/hdfs_path?attr:qualifiedName=pfile:/home/jenkins/jenkins-slave/workspace/atlas-master-integrationtests/addons/hive-bridge/target/somedfspath1-data-mgbgcxfx7t
HTTP/1.1" 200 1385 "-" "Java/1.8.0_152"
127.0.0.1 - - [09/Apr/2018:22:23:40 +0000] "GET //localhost:31000/api/atlas/v2/entity/uniqueAttribute/type/hdfs_path?attr:qualifiedName=pfile:/home/jenkins/jenkins-slave/workspace/atlas-master-integrationtests/addons/hive-bridge/target/somedfspath1-data-mgbgcxfx7t
HTTP/1.1" 200 1385 "-" "Java/1.8.0_152"
127.0.0.1 - - [09/Apr/2018:22:23:40 +0000] "GET //localhost:31000/api/atlas/v2/entity/uniqueAttribute/type/hive_table?attr:qualifiedName=default.tableocusueu6ez@primary
HTTP/1.1" 200 5176 "-" "Java/1.8.0_152"
127.0.0.1 - - [09/Apr/2018:22:23:40 +0000] "GET //localhost:31000/api/atlas/v2/entity/uniqueAttribute/type/hive_table?attr:qualifiedName=default.tableocusueu6ez@primary
HTTP/1.1" 200 5176 "-" "Java/1.8.0_152"
127.0.0.1 - - [09/Apr/2018:22:23:40 +0000] "GET //localhost:31000/api/atlas/v2/entity/guid/a279734a-8844-431f-96de-50553c024d8e
HTTP/1.1" 200 5176 "-" "Java/1.8.0_152"
127.0.0.1 - - [09/Apr/2018:22:23:43 +0000] "GET //localhost:31000/api/atlas/v2/entity/uniqueAttribute/type/hive_table?attr:qualifiedName=default.tableocusueu6ez@primary
HTTP/1.1" 200 5176 "-" "Java/1.8.0_152"
127.0.0.1 - - [09/Apr/2018:22:23:43 +0000] "GET //localhost:31000/api/atlas/v2/entity/uniqueAttribute/type/hive_table?attr:qualifiedName=default.tableocusueu6ez@primary
HTTP/1.1" 200 5176 "-" "Java/1.8.0_152"
127.0.0.1 - - [09/Apr/2018:22:23:43 +0000] "GET //localhost:31000/api/atlas/v2/entity/uniqueAttribute/type/hive_process?attr:qualifiedName=QUERY:default.tableocusueu6ez@primary:1523312612000-%3E
HTTP/1.1" 200 2018 "-" "Java/1.8.0_152"
127.0.0.1 - - [09/Apr/2018:22:23:43 +0000] "GET //localhost:31000/api/atlas/v2/entity/uniqueAttribute/type/hive_process?attr:qualifiedName=QUERY:default.tableocusueu6ez@primary:1523312612000-%3E
HTTP/1.1" 200 2018 "-" "Java/1.8.0_152"
127.0.0.1 - - [09/Apr/2018:22:23:43 +0000] "GET //localhost:31000/api/atlas/v2/entity/guid/8a956165-b465-47fa-8391-1829c2eb8b35
HTTP/1.1" 200 2018 "-" "Java/1.8.0_152"
127.0.0.1 - - [09/Apr/2018:22:23:43 +0000] "GET //localhost:31000/api/atlas/v2/entity/guid/a279734a-8844-431f-96de-50553c024d8e
HTTP/1.1" 200 5176 "-" "Java/1.8.0_152"
127.0.0.1 - - [09/Apr/2018:22:23:43 +0000] "GET //localhost:31000/api/atlas/v2/entity/guid/07f9ab20-2786-4592-8243-c53295ff1f7e
HTTP/1.1" 200 1385 "-" "Java/1.8.0_152"
127.0.0.1 - - [09/Apr/2018:22:23:43 +0000] "GET //localhost:31000/api/atlas/v2/entity/uniqueAttribute/type/hdfs_path?attr:qualifiedName=pfile:/home/jenkins/jenkins-slave/workspace/atlas-master-integrationtests/addons/hive-bridge/target/somedfspath1-data-mgbgcxfx7t
HTTP/1.1" 200 1385 "-" "Java/1.8.0_152"
127.0.0.1 - - [09/Apr/2018:22:23:43 +0000] "GET //localhost:31000/api/atlas/v2/entity/uniqueAttribute/type/hdfs_path?attr:qualifiedName=pfile:/home/jenkins/jenkins-slave/workspace/atlas-master-integrationtests/addons/hive-bridge/target/somedfspath1-data-mgbgcxfx7t
HTTP/1.1" 200 1385 "-" "Java/1.8.0_152"
127.0.0.1 - - [09/Apr/2018:22:23:46 +0000] "GET //localhost:31000/api/atlas/v2/entity/uniqueAttribute/type/hive_table?attr:qualifiedName=default.tableocusueu6ez@primary
HTTP/1.1" 200 5176 "-" "Java/1.8.0_152"
127.0.0.1 - - [09/Apr/2018:22:23:46 +0000] "GET //localhost:31000/api/atlas/v2/entity/uniqueAttribute/type/hive_table?attr:qualifiedName=default.tableocusueu6ez@primary
HTTP/1.1" 200 5176 "-" "Java/1.8.0_152"
127.0.0.1 - - [09/Apr/2018:22:23:46 +0000] "GET //localhost:31000/api/atlas/v2/entity/uniqueAttribute/type/hive_process?attr:qualifiedName=QUERY:default.tableocusueu6ez@primary:1523312612000-%3E
HTTP/1.1" 200 2421 "-" "Java/1.8.0_152"
127.0.0.1 - - [09/Apr/2018:22:23:46 +0000] "GET //localhost:31000/api/atlas/v2/entity/uniqueAttribute/type/hive_process?attr:qualifiedName=QUERY:default.tableocusueu6ez@primary:1523312612000-%3E
HTTP/1.1" 200 2421 "-" "Java/1.8.0_152"
127.0.0.1 - - [09/Apr/2018:22:23:46 +0000] "GET //localhost:31000/api/atlas/v2/entity/guid/8a956165-b465-47fa-8391-1829c2eb8b35
HTTP/1.1" 200 2421 "-" "Java/1.8.0_152"
127.0.0.1 - - [09/Apr/2018:22:23:46 +0000] "GET //localhost:31000/api/atlas/v2/entity/guid/a279734a-8844-431f-96de-50553c024d8e
HTTP/1.1" 200 5176 "-" "Java/1.8.0_152"
127.0.0.1 - - [09/Apr/2018:22:23:46 +0000] "GET //localhost:31000/api/atlas/v2/entity/guid/727d13fe-e8b1-433d-9263-3b09d701d43d
HTTP/1.1" 200 1385 "-" "Java/1.8.0_152"
127.0.0.1 - - [09/Apr/2018:22:23:46 +0000] "GET //localhost:31000/api/atlas/v2/entity/guid/07f9ab20-2786-4592-8243-c53295ff1f7e
HTTP/1.1" 200 1385 "-" "Java/1.8.0_152"
127.0.0.1 - - [09/Apr/2018:22:23:46 +0000] "GET //localhost:31000/api/atlas/v2/entity/uniqueAttribute/type/hdfs_path?attr:qualifiedName=pfile:/home/jenkins/jenkins-slave/workspace/atlas-master-integrationtests/addons/hive-bridge/target/somedfspath2-data-2kid7o0sje
HTTP/1.1" 200 1385 "-" "Java/1.8.0_152"
127.0.0.1 - - [09/Apr/2018:22:23:46 +0000] "GET //localhost:31000/api/atlas/v2/entity/uniqueAttribute/type/hdfs_path?attr:qualifiedName=pfile:/home/jenkins/jenkins-slave/workspace/atlas-master-integrationtests/addons/hive-bridge/target/somedfspath2-data-2kid7o0sje
HTTP/1.1" 200 1385 "-" "Java/1.8.0_152"
127.0.0.1 - - [09/Apr/2018:22:23:47 +0000] "GET //localhost:31000/api/atlas/v2/entity/uniqueAttribute/type/hive_db?attr:qualifiedName=default@primary
HTTP/1.1" 200 14242 "-" "Java/1.8.0_152"
127.0.0.1 - - [09/Apr/2018:22:23:47 +0000] "GET //localhost:31000/api/atlas/v2/entity/uniqueAttribute/type/hive_db?attr:qualifiedName=default@primary
HTTP/1.1" 200 14242 "-" "Java/1.8.0_152"
127.0.0.1 - - [09/Apr/2018:22:23:47 +0000] "GET //localhost:31000/api/atlas/v2/entity/uniqueAttribute/type/hive_table?attr:qualifiedName=default.tablebzs77o4euf@primary
HTTP/1.1" 404 154 "-" "Java/1.8.0_152"
127.0.0.1 - - [09/Apr/2018:22:23:52 +0000] "GET //localhost:31000/api/atlas/v2/entity/uniqueAttribute/type/hive_table?attr:qualifiedName=default.tablebzs77o4euf@primary
HTTP/1.1" 200 5159 "-" "Java/1.8.0_152"
127.0.0.1 - - [09/Apr/2018:22:23:52 +0000] "GET //localhost:31000/api/atlas/v2/entity/uniqueAttribute/type/hive_table?attr:qualifiedName=default.tablebzs77o4euf@primary
HTTP/1.1" 200 5159 "-" "Java/1.8.0_152"
127.0.0.1 - - [09/Apr/2018:22:23:52 +0000] "GET //localhost:31000/api/atlas/v2/entity/uniqueAttribute/type/hive_process?attr:qualifiedName=default.tablebzs77o4euf@primary:1523312627000
HTTP/1.1" 200 2017 "-" "Java/1.8.0_152"
127.0.0.1 - - [09/Apr/2018:22:23:52 +0000] "GET //localhost:31000/api/atlas/v2/entity/uniqueAttribute/type/hive_process?attr:qualifiedName=default.tablebzs77o4euf@primary:1523312627000
HTTP/1.1" 200 2017 "-" "Java/1.8.0_152"
127.0.0.1 - - [09/Apr/2018:22:23:52 +0000] "GET //localhost:31000/api/atlas/v2/entity/guid/195bba71-795b-4602-9420-0be30d8d3743
HTTP/1.1" 200 2017 "-" "Java/1.8.0_152"
127.0.0.1 - - [09/Apr/2018:22:23:52 +0000] "GET //localhost:31000/api/atlas/v2/entity/uniqueAttribute/type/hdfs_path?attr:qualifiedName=pfile:/home/jenkins/jenkins-slave/workspace/atlas-master-integrationtests/addons/hive-bridge/target/parentpath-data-lrptxyefzn
HTTP/1.1" 200 1379 "-" "Java/1.8.0_152"
127.0.0.1 - - [09/Apr/2018:22:23:52 +0000] "GET //localhost:31000/api/atlas/v2/entity/uniqueAttribute/type/hdfs_path?attr:qualifiedName=pfile:/home/jenkins/jenkins-slave/workspace/atlas-master-integrationtests/addons/hive-bridge/target/parentpath-data-lrptxyefzn
HTTP/1.1" 200 1379 "-" "Java/1.8.0_152"
127.0.0.1 - - [09/Apr/2018:22:23:52 +0000] "GET //localhost:31000/api/atlas/entities?type=hive_table
HTTP/1.1" 200 2732 "-" "Java/1.8.0_152"
127.0.0.1 - - [09/Apr/2018:22:23:52 +0000] "GET //localhost:31000/api/atlas/v2/entity/guid/f4b73b6a-17fe-4827-aaa7-fba6080a9d75
HTTP/1.1" 200 14459 "-" "Java/1.8.0_152"
127.0.0.1 - - [09/Apr/2018:22:23:52 +0000] "GET //localhost:31000/api/atlas/v2/entity/uniqueAttribute/type/hive_table?attr:qualifiedName=default.tablebzs77o4euf@primary
HTTP/1.1" 200 5159 "-" "Java/1.8.0_152"
127.0.0.1 - - [09/Apr/2018:22:23:52 +0000] "POST //localhost:31000/api/atlas/v2/entity/ HTTP/1.1"
200 384 "-" "Java/1.8.0_152"
127.0.0.1 - - [09/Apr/2018:22:23:52 +0000] "GET //localhost:31000/api/atlas/v2/entity/uniqueAttribute/type/hive_process?attr:qualifiedName=default.tablebzs77o4euf@primary:1523312627000
HTTP/1.1" 200 2017 "-" "Java/1.8.0_152"
127.0.0.1 - - [09/Apr/2018:22:23:52 +0000] "GET //localhost:31000/api/atlas/v2/entity/uniqueAttribute/type/hive_table?attr:qualifiedName=default.tablebzs77o4euf@primary
HTTP/1.1" 200 5157 "-" "Java/1.8.0_152"
127.0.0.1 - - [09/Apr/2018:22:23:53 +0000] "GET //localhost:31000/api/atlas/v2/entity/uniqueAttribute/type/hive_table?attr:qualifiedName=default.tablebzs77o4euf@primary
HTTP/1.1" 200 5157 "-" "Java/1.8.0_152"
127.0.0.1 - - [09/Apr/2018:22:23:53 +0000] "GET //localhost:31000/api/atlas/v2/entity/uniqueAttribute/type/hive_process?attr:qualifiedName=default.tablebzs77o4euf@primary:1523312627000
HTTP/1.1" 200 2017 "-" "Java/1.8.0_152"
127.0.0.1 - - [09/Apr/2018:22:23:53 +0000] "GET //localhost:31000/api/atlas/v2/entity/uniqueAttribute/type/hive_process?attr:qualifiedName=default.tablebzs77o4euf@primary:1523312627000
HTTP/1.1" 200 2017 "-" "Java/1.8.0_152"
127.0.0.1 - - [09/Apr/2018:22:23:53 +0000] "GET //localhost:31000/api/atlas/entities?type=hive_table
HTTP/1.1" 200 2732 "-" "Java/1.8.0_152"
127.0.0.1 - - [09/Apr/2018:22:23:53 +0000] "GET //localhost:31000/api/atlas/v2/entity/uniqueAttribute/type/hive_db?attr:qualifiedName=default@primary
HTTP/1.1" 200 14459 "-" "Java/1.8.0_152"
127.0.0.1 - - [09/Apr/2018:22:23:53 +0000] "GET //localhost:31000/api/atlas/v2/entity/uniqueAttribute/type/hive_db?attr:qualifiedName=default@primary
HTTP/1.1" 200 14459 "-" "Java/1.8.0_152"
127.0.0.1 - - [09/Apr/2018:22:23:53 +0000] "GET //localhost:31000/api/atlas/v2/entity/guid/f4b73b6a-17fe-4827-aaa7-fba6080a9d75
HTTP/1.1" 200 14459 "-" "Java/1.8.0_152"
127.0.0.1 - - [09/Apr/2018:22:23:53 +0000] "GET //localhost:31000/api/atlas/v2/entity/uniqueAttribute/type/hive_table?attr:qualifiedName=default.tableln8gtkn3y4@primary
HTTP/1.1" 404 154 "-" "Java/1.8.0_152"
127.0.0.1 - - [09/Apr/2018:22:23:53 +0000] "POST //localhost:31000/api/atlas/v2/entity/ HTTP/1.1"
200 859 "-" "Java/1.8.0_152"
127.0.0.1 - - [09/Apr/2018:22:23:53 +0000] "GET //localhost:31000/api/atlas/v2/entity/guid/1f949ff4-9f12-46ca-98b0-e335f4ea229b
HTTP/1.1" 200 3671 "-" "Java/1.8.0_152"
127.0.0.1 - - [09/Apr/2018:22:23:53 +0000] "GET //localhost:31000/api/atlas/v2/entity/uniqueAttribute/type/hive_process?attr:qualifiedName=default.tableln8gtkn3y4@primary:1523312633000
HTTP/1.1" 404 170 "-" "Java/1.8.0_152"
127.0.0.1 - - [09/Apr/2018:22:23:53 +0000] "POST //localhost:31000/api/atlas/v2/entity/bulk/
HTTP/1.1" 200 756 "-" "Java/1.8.0_152"
127.0.0.1 - - [09/Apr/2018:22:23:53 +0000] "GET //localhost:31000/api/atlas/v2/entity/guid/8a8dd03b-52ed-4195-b243-a2489bac4db9
HTTP/1.1" 200 2095 "-" "Java/1.8.0_152"
127.0.0.1 - - [09/Apr/2018:22:23:53 +0000] "GET //localhost:31000/api/atlas/v2/entity/guid/e6e13880-ec82-49ab-9ef5-c410f655184b
HTTP/1.1" 200 1362 "-" "Java/1.8.0_152"
127.0.0.1 - - [09/Apr/2018:22:23:53 +0000] "GET //localhost:31000/api/atlas/v2/entity/uniqueAttribute/type/hive_table?attr:qualifiedName=default.tableln8gtkn3y4@primary
HTTP/1.1" 200 4069 "-" "Java/1.8.0_152"
127.0.0.1 - - [09/Apr/2018:22:23:53 +0000] "GET //localhost:31000/api/atlas/v2/entity/uniqueAttribute/type/hive_table?attr:qualifiedName=default.tableln8gtkn3y4@primary
HTTP/1.1" 200 4069 "-" "Java/1.8.0_152"
127.0.0.1 - - [09/Apr/2018:22:23:54 +0000] "GET //localhost:31000/api/atlas/v2/entity/uniqueAttribute/type/hive_process?attr:qualifiedName=default.tableln8gtkn3y4@primary:1523312633000
HTTP/1.1" 200 2095 "-" "Java/1.8.0_152"
127.0.0.1 - - [09/Apr/2018:22:23:54 +0000] "GET //localhost:31000/api/atlas/v2/entity/uniqueAttribute/type/hive_process?attr:qualifiedName=default.tableln8gtkn3y4@primary:1523312633000
HTTP/1.1" 200 2095 "-" "Java/1.8.0_152"
127.0.0.1 - - [09/Apr/2018:22:23:54 +0000] "GET //localhost:31000/api/atlas/v2/entity/guid/8a8dd03b-52ed-4195-b243-a2489bac4db9
HTTP/1.1" 200 2095 "-" "Java/1.8.0_152"
Tests run: 46, Failures: 1, Errors: 0, Skipped: 0, Time elapsed: 407.265 sec <<<
FAILURE! - in TestSuite
testCreateTableHiveProcessNameAttribute(org.apache.atlas.hive.bridge.HiveMetastoreBridgeIT)
 Time elapsed: 0.036 sec  <<< FAILURE!
java.lang.AssertionError: expected [0] but found [40000]
	at org.testng.Assert.fail(Assert.java:94)
	at org.testng.Assert.failNotEquals(Assert.java:496)
	at org.testng.Assert.assertEquals(Assert.java:125)
	at org.testng.Assert.assertEquals(Assert.java:372)
	at org.testng.Assert.assertEquals(Assert.java:382)
	at org.apache.atlas.hive.HiveITBase.runCommandWithDelay(HiveITBase.java:154)
	at org.apache.atlas.hive.HiveITBase.runCommandWithDelay(HiveITBase.java:147)
	at org.apache.atlas.hive.HiveITBase.runCommand(HiveITBase.java:139)
	at org.apache.atlas.hive.bridge.HiveMetastoreBridgeIT.testCreateTableHiveProcessNameAttribute(HiveMetastoreBridgeIT.java:105)


Results :

Failed tests: 
  HiveMetastoreBridgeIT.testCreateTableHiveProcessNameAttribute:105->HiveITBase.runCommand:139->HiveITBase.runCommandWithDelay:147->HiveITBase.runCommandWithDelay:154
expected [0] but found [40000]

Tests run: 46, Failures: 1, Errors: 0, Skipped: 0

[INFO] 
[INFO] --- jetty-maven-plugin:9.3.14.v20161028:stop (stop-jetty) @ hive-bridge ---
[INFO] Waiting 10 seconds for jetty to stop
[INFO] Stopped ServerConnector@de4cf21{HTTP/1.1,[http/1.1]}{0.0.0.0:31000}
[INFO] Closing Spring root WebApplicationContext
[INFO] Shutting down log4j
[INFO] Stopped o.e.j.m.p.JettyWebAppContext@688c08de{/,file://<https://builds.apache.org/job/Atlas-master-IntegrationTests/ws/webapp/target/atlas-webapp-1.0.0-SNAPSHOT/,UNAVAILABLE}{/home/jenkins/jenkins-slave/workspace/Atlas-master-IntegrationTests/webapp/target/atlas-webapp-1.0.0-SNAPSHOT.war}>
[INFO] Server reports itself as stopped
[INFO] 
[INFO] --- maven-source-plugin:2.4:jar-no-fork (attach-sources) @ hive-bridge ---
[INFO] Building jar: <https://builds.apache.org/job/Atlas-master-IntegrationTests/ws/addons/hive-bridge/target/hive-bridge-1.0.0-SNAPSHOT-sources.jar>
log4j:WARN No appenders could be found for logger (org.apache.zookeeper.ClientCnxn).
log4j:WARN Please initialize the log4j system properly.
log4j:WARN See http://logging.apache.org/log4j/1.2/faq.html#noconfig for more info.
[INFO] 
[INFO] --- maven-source-plugin:2.4:test-jar-no-fork (attach-sources) @ hive-bridge ---
[INFO] Building jar: <https://builds.apache.org/job/Atlas-master-IntegrationTests/ws/addons/hive-bridge/target/hive-bridge-1.0.0-SNAPSHOT-test-sources.jar>
[INFO] 
[INFO] --- maven-failsafe-plugin:2.18.1:verify (verify) @ hive-bridge ---
[INFO] Failsafe report directory: <https://builds.apache.org/job/Atlas-master-IntegrationTests/ws/addons/hive-bridge/target/failsafe-reports>
[INFO] ------------------------------------------------------------------------
[INFO] Reactor Summary:
[INFO] 
[INFO] Apache Atlas Server Build Tools .................... SUCCESS [  0.545 s]
[INFO] apache-atlas ....................................... SUCCESS [  3.603 s]
[INFO] Apache Atlas Test Utility Tools .................... SUCCESS [  9.127 s]
[INFO] Open Connector Framework (OCF) ..................... SUCCESS [  9.523 s]
[INFO] Open Metadata Repository Services (OMRS) ........... SUCCESS [ 26.326 s]
[INFO] Open Metadata and Governance (OMAG) Server APIs .... SUCCESS [  6.348 s]
[INFO] Apache Atlas Integration ........................... SUCCESS [ 16.715 s]
[INFO] Apache Atlas Common ................................ SUCCESS [  7.112 s]
[INFO] Apache Atlas Client ................................ SUCCESS [  0.532 s]
[INFO] atlas-client-common ................................ SUCCESS [  5.977 s]
[INFO] atlas-client-v1 .................................... SUCCESS [  6.133 s]
[INFO] Apache Atlas Server API ............................ SUCCESS [  5.075 s]
[INFO] Apache Atlas Notification .......................... SUCCESS [  7.641 s]
[INFO] atlas-client-v2 .................................... SUCCESS [  5.327 s]
[INFO] Apache Atlas Graph Database Projects ............... SUCCESS [  0.522 s]
[INFO] Apache Atlas Graph Database API .................... SUCCESS [  4.639 s]
[INFO] Graph Database Common Code ......................... SUCCESS [  4.603 s]
[INFO] Apache Atlas JanusGraph DB Impl .................... SUCCESS [ 12.332 s]
[INFO] Apache Atlas Graph Database Implementation Dependencies SUCCESS [  2.410 s]
[INFO] Shaded version of Apache hbase client .............. SUCCESS [  7.952 s]
[INFO] Apache Atlas Titan 0.5.4 Graph DB Impl ............. SUCCESS [ 35.396 s]
[INFO] Shaded version of Apache hbase server .............. SUCCESS [ 20.127 s]
[INFO] Apache Atlas Authorization ......................... SUCCESS [  6.193 s]
[INFO] Apache Atlas Repository ............................ SUCCESS [ 26.660 s]
[INFO] Apache Atlas UI .................................... SUCCESS [01:08 min]
[INFO] Apache Atlas Web Application ....................... SUCCESS [04:17 min]
[INFO] Apache Atlas Documentation ......................... SUCCESS [  3.080 s]
[INFO] Apache Atlas FileSystem Model ...................... SUCCESS [  2.380 s]
[INFO] Apache Atlas Plugin Classloader .................... SUCCESS [  5.667 s]
[INFO] Apache Atlas Hive Bridge Shim ...................... SUCCESS [  4.362 s]
[INFO] Apache Atlas Hive Bridge ........................... FAILURE [07:38 min]
[INFO] Apache Atlas Falcon Bridge Shim .................... SKIPPED
[INFO] Apache Atlas Falcon Bridge ......................... SKIPPED
[INFO] Apache Atlas Sqoop Bridge Shim ..................... SKIPPED
[INFO] Apache Atlas Sqoop Bridge .......................... SKIPPED
[INFO] Apache Atlas Storm Bridge Shim ..................... SKIPPED
[INFO] Apache Atlas Storm Bridge .......................... SKIPPED
[INFO] Apache Atlas Hbase Bridge Shim ..................... SKIPPED
[INFO] Apache Atlas Hbase Bridge .......................... SKIPPED
[INFO] Apache Atlas Migration Exporter .................... SKIPPED
[INFO] Apache Atlas Distribution .......................... SKIPPED
[INFO] ------------------------------------------------------------------------
[INFO] BUILD FAILURE
[INFO] ------------------------------------------------------------------------
[INFO] Total time: 17:12 min
[INFO] Finished at: 2018-04-09T22:23:59Z
[INFO] Final Memory: 596M/3177M
[INFO] ------------------------------------------------------------------------
[ERROR] Failed to execute goal org.apache.maven.plugins:maven-failsafe-plugin:2.18.1:verify
(verify) on project hive-bridge: There are test failures.
[ERROR] 
[ERROR] Please refer to <https://builds.apache.org/job/Atlas-master-IntegrationTests/ws/addons/hive-bridge/target/failsafe-reports>
for the individual test results.
[ERROR] -> [Help 1]
[ERROR] 
[ERROR] To see the full stack trace of the errors, re-run Maven with the -e switch.
[ERROR] Re-run Maven using the -X switch to enable full debug logging.
[ERROR] 
[ERROR] For more information about the errors and possible solutions, please read the following
articles:
[ERROR] [Help 1] http://cwiki.apache.org/confluence/display/MAVEN/MojoFailureException
[ERROR] 
[ERROR] After correcting the problems, you can resume the build with the command
[ERROR]   mvn <goals> -rf :hive-bridge
Build step 'Execute shell' marked build as failure
[CHECKSTYLE] Collecting checkstyle analysis files...
[CHECKSTYLE] Searching for all files in <https://builds.apache.org/job/Atlas-master-IntegrationTests/ws/>
that match the pattern **/target/checkstyle-result.xml
[CHECKSTYLE] Parsing 29 files in <https://builds.apache.org/job/Atlas-master-IntegrationTests/ws/>
[CHECKSTYLE] Successfully parsed file <https://builds.apache.org/job/Atlas-master-IntegrationTests/ws/addons/hdfs-model/target/checkstyle-result.xml>
with 0 unique warnings and 0 duplicates.
[CHECKSTYLE] Successfully parsed file <https://builds.apache.org/job/Atlas-master-IntegrationTests/ws/addons/hive-bridge-shim/target/checkstyle-result.xml>
with 15 unique warnings and 0 duplicates.
[CHECKSTYLE] Successfully parsed file <https://builds.apache.org/job/Atlas-master-IntegrationTests/ws/authorization/target/checkstyle-result.xml>
with 684 unique warnings and 0 duplicates.
[CHECKSTYLE] Successfully parsed file <https://builds.apache.org/job/Atlas-master-IntegrationTests/ws/client/client-v1/target/checkstyle-result.xml>
with 1568 unique warnings and 0 duplicates.
[CHECKSTYLE] Successfully parsed file <https://builds.apache.org/job/Atlas-master-IntegrationTests/ws/client/client-v2/target/checkstyle-result.xml>
with 1927 unique warnings and 0 duplicates.
[CHECKSTYLE] Successfully parsed file <https://builds.apache.org/job/Atlas-master-IntegrationTests/ws/client/common/target/checkstyle-result.xml>
with 2415 unique warnings and 0 duplicates.
[CHECKSTYLE] Successfully parsed file <https://builds.apache.org/job/Atlas-master-IntegrationTests/ws/client/target/checkstyle-result.xml>
with 2415 unique warnings and 0 duplicates.
[CHECKSTYLE] Successfully parsed file <https://builds.apache.org/job/Atlas-master-IntegrationTests/ws/common/target/checkstyle-result.xml>
with 3463 unique warnings and 0 duplicates.
[CHECKSTYLE] Successfully parsed file <https://builds.apache.org/job/Atlas-master-IntegrationTests/ws/dashboardv2/target/checkstyle-result.xml>
with 3463 unique warnings and 0 duplicates.
[CHECKSTYLE] Successfully parsed file <https://builds.apache.org/job/Atlas-master-IntegrationTests/ws/docs/target/checkstyle-result.xml>
with 3463 unique warnings and 0 duplicates.
[CHECKSTYLE] Successfully parsed file <https://builds.apache.org/job/Atlas-master-IntegrationTests/ws/graphdb/api/target/checkstyle-result.xml>
with 3757 unique warnings and 0 duplicates.
[CHECKSTYLE] Successfully parsed file <https://builds.apache.org/job/Atlas-master-IntegrationTests/ws/graphdb/common/target/checkstyle-result.xml>
with 3966 unique warnings and 0 duplicates.
[CHECKSTYLE] Successfully parsed file <https://builds.apache.org/job/Atlas-master-IntegrationTests/ws/graphdb/graphdb-impls/target/checkstyle-result.xml>
with 3966 unique warnings and 0 duplicates.
[CHECKSTYLE] Successfully parsed file <https://builds.apache.org/job/Atlas-master-IntegrationTests/ws/graphdb/janus/target/checkstyle-result.xml>
with 5658 unique warnings and 0 duplicates.
[CHECKSTYLE] Successfully parsed file <https://builds.apache.org/job/Atlas-master-IntegrationTests/ws/graphdb/target/checkstyle-result.xml>
with 5658 unique warnings and 0 duplicates.
[CHECKSTYLE] Successfully parsed file <https://builds.apache.org/job/Atlas-master-IntegrationTests/ws/graphdb/titan0/target/checkstyle-result.xml>
with 8159 unique warnings and 0 duplicates.
[CHECKSTYLE] Successfully parsed file <https://builds.apache.org/job/Atlas-master-IntegrationTests/ws/intg/target/checkstyle-result.xml>
with 19170 unique warnings and 0 duplicates.
[CHECKSTYLE] Successfully parsed file <https://builds.apache.org/job/Atlas-master-IntegrationTests/ws/notification/target/checkstyle-result.xml>
with 20406 unique warnings and 0 duplicates.
[CHECKSTYLE] Successfully parsed file <https://builds.apache.org/job/Atlas-master-IntegrationTests/ws/om-fwk-ocf/target/checkstyle-result.xml>
with 25448 unique warnings and 0 duplicates.
[CHECKSTYLE] Successfully parsed file <https://builds.apache.org/job/Atlas-master-IntegrationTests/ws/omag-api/target/checkstyle-result.xml>
with 26794 unique warnings and 0 duplicates.
[CHECKSTYLE] Successfully parsed file <https://builds.apache.org/job/Atlas-master-IntegrationTests/ws/omrs/target/checkstyle-result.xml>
with 64423 unique warnings and 0 duplicates.
[CHECKSTYLE] Successfully parsed file <https://builds.apache.org/job/Atlas-master-IntegrationTests/ws/plugin-classloader/target/checkstyle-result.xml>
with 64536 unique warnings and 0 duplicates.
[CHECKSTYLE] Successfully parsed file <https://builds.apache.org/job/Atlas-master-IntegrationTests/ws/repository/target/checkstyle-result.xml>
with 84293 unique warnings and 0 duplicates.
[CHECKSTYLE] Successfully parsed file <https://builds.apache.org/job/Atlas-master-IntegrationTests/ws/server-api/target/checkstyle-result.xml>
with 84444 unique warnings and 0 duplicates.
[CHECKSTYLE] Successfully parsed file <https://builds.apache.org/job/Atlas-master-IntegrationTests/ws/shaded/hbase-client-shaded/target/checkstyle-result.xml>
with 84444 unique warnings and 0 duplicates.
[CHECKSTYLE] Successfully parsed file <https://builds.apache.org/job/Atlas-master-IntegrationTests/ws/shaded/hbase-server-shaded/target/checkstyle-result.xml>
with 84444 unique warnings and 0 duplicates.
[CHECKSTYLE] Successfully parsed file <https://builds.apache.org/job/Atlas-master-IntegrationTests/ws/target/checkstyle-result.xml>
with 84444 unique warnings and 0 duplicates.
[CHECKSTYLE] Successfully parsed file <https://builds.apache.org/job/Atlas-master-IntegrationTests/ws/test-tools/target/checkstyle-result.xml>
with 84482 unique warnings and 0 duplicates.
[CHECKSTYLE] Successfully parsed file <https://builds.apache.org/job/Atlas-master-IntegrationTests/ws/webapp/target/checkstyle-result.xml>
with 92483 unique warnings and 0 duplicates.
<Git Blamer> Using GitBlamer to create author and commit information for all warnings.
<Git Blamer> GIT_COMMIT=bc57e15e548af88987ab7d3870aa5ae874c09830, workspace=<https://builds.apache.org/job/Atlas-master-IntegrationTests/ws/>
 > git rev-parse bc57e15e548af88987ab7d3870aa5ae874c09830^{commit} # timeout=10
[CHECKSTYLE] Computing warning deltas based on reference build #950
[FINDBUGS] Collecting findbugs analysis files...
[FINDBUGS] Searching for all files in <https://builds.apache.org/job/Atlas-master-IntegrationTests/ws/>
that match the pattern **/target/findbugs.xml
[FINDBUGS] Parsing 20 files in <https://builds.apache.org/job/Atlas-master-IntegrationTests/ws/>
[FINDBUGS] Successfully parsed file <https://builds.apache.org/job/Atlas-master-IntegrationTests/ws/addons/hive-bridge-shim/target/findbugs.xml>
with 0 unique warnings and 0 duplicates.
[FINDBUGS] Successfully parsed file <https://builds.apache.org/job/Atlas-master-IntegrationTests/ws/authorization/target/findbugs.xml>
with 0 unique warnings and 0 duplicates.
[FINDBUGS] Successfully parsed file <https://builds.apache.org/job/Atlas-master-IntegrationTests/ws/client/client-v1/target/findbugs.xml>
with 0 unique warnings and 0 duplicates.
[FINDBUGS] Successfully parsed file <https://builds.apache.org/job/Atlas-master-IntegrationTests/ws/client/client-v2/target/findbugs.xml>
with 0 unique warnings and 0 duplicates.
[FINDBUGS] Successfully parsed file <https://builds.apache.org/job/Atlas-master-IntegrationTests/ws/client/common/target/findbugs.xml>
with 0 unique warnings and 0 duplicates.
[FINDBUGS] Successfully parsed file <https://builds.apache.org/job/Atlas-master-IntegrationTests/ws/common/target/findbugs.xml>
with 0 unique warnings and 0 duplicates.
[FINDBUGS] Successfully parsed file <https://builds.apache.org/job/Atlas-master-IntegrationTests/ws/graphdb/api/target/findbugs.xml>
with 0 unique warnings and 0 duplicates.
[FINDBUGS] Successfully parsed file <https://builds.apache.org/job/Atlas-master-IntegrationTests/ws/graphdb/common/target/findbugs.xml>
with 0 unique warnings and 0 duplicates.
[FINDBUGS] Successfully parsed file <https://builds.apache.org/job/Atlas-master-IntegrationTests/ws/graphdb/janus/target/findbugs.xml>
with 0 unique warnings and 0 duplicates.
[FINDBUGS] Successfully parsed file <https://builds.apache.org/job/Atlas-master-IntegrationTests/ws/graphdb/titan0/target/findbugs.xml>
with 0 unique warnings and 0 duplicates.
[FINDBUGS] Successfully parsed file <https://builds.apache.org/job/Atlas-master-IntegrationTests/ws/intg/target/findbugs.xml>
with 0 unique warnings and 0 duplicates.
[FINDBUGS] Successfully parsed file <https://builds.apache.org/job/Atlas-master-IntegrationTests/ws/notification/target/findbugs.xml>
with 0 unique warnings and 0 duplicates.
[FINDBUGS] Successfully parsed file <https://builds.apache.org/job/Atlas-master-IntegrationTests/ws/om-fwk-ocf/target/findbugs.xml>
with 0 unique warnings and 0 duplicates.
[FINDBUGS] Successfully parsed file <https://builds.apache.org/job/Atlas-master-IntegrationTests/ws/omag-api/target/findbugs.xml>
with 0 unique warnings and 0 duplicates.
[FINDBUGS] Successfully parsed file <https://builds.apache.org/job/Atlas-master-IntegrationTests/ws/omrs/target/findbugs.xml>
with 0 unique warnings and 0 duplicates.
[FINDBUGS] Successfully parsed file <https://builds.apache.org/job/Atlas-master-IntegrationTests/ws/plugin-classloader/target/findbugs.xml>
with 0 unique warnings and 0 duplicates.
[FINDBUGS] Successfully parsed file <https://builds.apache.org/job/Atlas-master-IntegrationTests/ws/repository/target/findbugs.xml>
with 0 unique warnings and 0 duplicates.
[FINDBUGS] Successfully parsed file <https://builds.apache.org/job/Atlas-master-IntegrationTests/ws/server-api/target/findbugs.xml>
with 0 unique warnings and 0 duplicates.
[FINDBUGS] Successfully parsed file <https://builds.apache.org/job/Atlas-master-IntegrationTests/ws/test-tools/target/findbugs.xml>
with 0 unique warnings and 0 duplicates.
[FINDBUGS] Successfully parsed file <https://builds.apache.org/job/Atlas-master-IntegrationTests/ws/webapp/target/findbugs.xml>
with 0 unique warnings and 0 duplicates.
<Git Blamer> Using GitBlamer to create author and commit information for all warnings.
<Git Blamer> GIT_COMMIT=bc57e15e548af88987ab7d3870aa5ae874c09830, workspace=<https://builds.apache.org/job/Atlas-master-IntegrationTests/ws/>
[FINDBUGS] Computing warning deltas based on reference build #950
Archiving artifacts
[Fast Archiver] Compressed 167.56 MB of artifacts by 65.8% relative to #950
TestNG Reports Processing: START
Looking for TestNG results report in workspace using pattern: **/target/surefire-reports/testng-results.xml,**/target/failsafe-reports/testng-results.xml
Saving reports...
Processing '/x1/jenkins/jenkins-home/jobs/Atlas-master-IntegrationTests/builds/1001/testng/testng-results-1.xml'
Processing '/x1/jenkins/jenkins-home/jobs/Atlas-master-IntegrationTests/builds/1001/testng/testng-results.xml'
0.581395% of tests failed, which exceeded threshold of 0%. Marking build as UNSTABLE
TestNG Reports Processing: FINISH

Mime
View raw message