atlas-dev mailing list archives

Site index · List index
Message view « Date » · « Thread »
Top « Date » · « Thread »
From Apache Jenkins Server <jenk...@builds.apache.org>
Subject Build failed in Jenkins: Atlas-master-IntegrationTests #957
Date Thu, 05 Apr 2018 13:08:18 GMT
See <https://builds.apache.org/job/Atlas-master-IntegrationTests/957/display/redirect>

------------------------------------------
[...truncated 464.40 KB...]
	at org.apache.atlas.web.filters.StaleTransactionCleanupFilter.doFilter(StaleTransactionCleanupFilter.java:55)
	at org.springframework.security.web.FilterChainProxy$VirtualFilterChain.doFilter(FilterChainProxy.java:331)
	at org.springframework.security.web.authentication.www.BasicAuthenticationFilter.doFilterInternal(BasicAuthenticationFilter.java:215)
	at org.springframework.web.filter.OncePerRequestFilter.doFilter(OncePerRequestFilter.java:107)
	at org.springframework.security.web.FilterChainProxy$VirtualFilterChain.doFilter(FilterChainProxy.java:331)
	at org.apache.atlas.web.filters.AtlasKnoxSSOAuthenticationFilter.doFilter(AtlasKnoxSSOAuthenticationFilter.java:146)
	at org.springframework.security.web.FilterChainProxy$VirtualFilterChain.doFilter(FilterChainProxy.java:331)
	at org.springframework.security.web.authentication.AbstractAuthenticationProcessingFilter.doFilter(AbstractAuthenticationProcessingFilter.java:200)
	at org.springframework.security.web.FilterChainProxy$VirtualFilterChain.doFilter(FilterChainProxy.java:331)
	at org.springframework.security.web.authentication.logout.LogoutFilter.doFilter(LogoutFilter.java:116)
	at org.springframework.security.web.FilterChainProxy$VirtualFilterChain.doFilter(FilterChainProxy.java:331)
	at org.springframework.security.web.context.SecurityContextPersistenceFilter.doFilter(SecurityContextPersistenceFilter.java:105)
	at org.springframework.security.web.FilterChainProxy$VirtualFilterChain.doFilter(FilterChainProxy.java:331)
	at org.springframework.security.web.context.request.async.WebAsyncManagerIntegrationFilter.doFilterInternal(WebAsyncManagerIntegrationFilter.java:56)
	at org.springframework.web.filter.OncePerRequestFilter.doFilter(OncePerRequestFilter.java:107)
	at org.springframework.security.web.FilterChainProxy$VirtualFilterChain.doFilter(FilterChainProxy.java:331)
	at org.springframework.security.web.FilterChainProxy.doFilterInternal(FilterChainProxy.java:214)
	at org.springframework.security.web.FilterChainProxy.doFilter(FilterChainProxy.java:177)
	at org.springframework.web.filter.DelegatingFilterProxy.invokeDelegate(DelegatingFilterProxy.java:346)
	at org.springframework.web.filter.DelegatingFilterProxy.doFilter(DelegatingFilterProxy.java:262)
	at org.eclipse.jetty.servlet.ServletHandler$CachedChain.doFilter(ServletHandler.java:1691)
	at org.eclipse.jetty.servlet.ServletHandler.doHandle(ServletHandler.java:582)
	at org.eclipse.jetty.server.handler.ScopedHandler.handle(ScopedHandler.java:143)
	at org.eclipse.jetty.security.SecurityHandler.handle(SecurityHandler.java:548)
	at org.eclipse.jetty.server.session.SessionHandler.doHandle(SessionHandler.java:226)
	at org.eclipse.jetty.server.handler.ContextHandler.doHandle(ContextHandler.java:1180)
	at org.eclipse.jetty.servlet.ServletHandler.doScope(ServletHandler.java:512)
	at org.eclipse.jetty.server.session.SessionHandler.doScope(SessionHandler.java:185)
	at org.eclipse.jetty.server.handler.ContextHandler.doScope(ContextHandler.java:1112)
	at org.eclipse.jetty.server.handler.ScopedHandler.handle(ScopedHandler.java:141)
	at org.eclipse.jetty.server.handler.ContextHandlerCollection.handle(ContextHandlerCollection.java:213)
	at org.eclipse.jetty.server.handler.HandlerCollection.handle(HandlerCollection.java:119)
	at org.eclipse.jetty.server.handler.HandlerWrapper.handle(HandlerWrapper.java:134)
	at org.eclipse.jetty.server.Server.handle(Server.java:534)
	at org.eclipse.jetty.server.HttpChannel.handle(HttpChannel.java:320)
	at org.eclipse.jetty.server.HttpConnection.onFillable(HttpConnection.java:251)
	at org.eclipse.jetty.io.AbstractConnection$ReadCallback.succeeded(AbstractConnection.java:273)
	at org.eclipse.jetty.io.FillInterest.fillable(FillInterest.java:95)
	at org.eclipse.jetty.io.SelectChannelEndPoint$2.run(SelectChannelEndPoint.java:93)
	at org.eclipse.jetty.util.thread.strategy.ExecuteProduceConsume.executeProduceConsume(ExecuteProduceConsume.java:303)
	at org.eclipse.jetty.util.thread.strategy.ExecuteProduceConsume.produceConsume(ExecuteProduceConsume.java:148)
	at org.eclipse.jetty.util.thread.strategy.ExecuteProduceConsume.run(ExecuteProduceConsume.java:136)
	at org.eclipse.jetty.util.thread.QueuedThreadPool.runJob(QueuedThreadPool.java:671)
	at org.eclipse.jetty.util.thread.QueuedThreadPool$2.run(QueuedThreadPool.java:589)
	at java.lang.Thread.run(Thread.java:748)

127.0.0.1 - - [05/Apr/2018:12:58:45 +0000] "GET //localhost:31000/api/atlas/lineage/hive/table/blah/schema
HTTP/1.1" 500 89 "-" "Java/1.8.0_152"
127.0.0.1 - - [05/Apr/2018:12:58:45 +0000] "POST //localhost:31000/api/atlas/admin/import
HTTP/1.1" 200 10458 "-" "Java/1.8.0_152"
127.0.0.1 - - [05/Apr/2018:12:58:55 +0000] "GET //localhost:31000/api/atlas/v2/types/typedef/name/fooTag
HTTP/1.1" 404 83 "-" "Java/1.8.0_152"
127.0.0.1 - - [05/Apr/2018:12:58:55 +0000] "POST //localhost:31000/api/atlas/v2/types/typedefs/
HTTP/1.1" 200 401 "-" "Java/1.8.0_152"
127.0.0.1 - - [05/Apr/2018:12:58:55 +0000] "GET //localhost:31000/api/atlas/v2/entity/uniqueAttribute/type/hdfs_path?attr:qualifiedName=test%241test%2B%2B-%2B%26%26%2B%7C%7C%2B%21%2B%28%2B%29%2B%7B%2B%7D%2B%5B%2B%5D%2B%5E%2B%3C%2B%3E%2B%3B%2B%3A%2B%22%2B%25%2B*%2B%60%2B%7E
HTTP/1.1" 404 176 "-" "Java/1.8.0_152"
127.0.0.1 - - [05/Apr/2018:12:58:55 +0000] "POST //localhost:31000/api/atlas/v2/entity/ HTTP/1.1"
200 273 "-" "Java/1.8.0_152"
127.0.0.1 - - [05/Apr/2018:12:59:00 +0000] "POST //localhost:31000/api/atlas/v2/search/basic
HTTP/1.1" 200 1229 "-" "Java/1.8.0_152"
127.0.0.1 - - [05/Apr/2018:12:59:01 +0000] "POST //localhost:31000/api/atlas/v2/search/basic
HTTP/1.1" 200 920 "-" "Java/1.8.0_152"
127.0.0.1 - - [05/Apr/2018:12:59:01 +0000] "POST //localhost:31000/api/atlas/v2/search/basic
HTTP/1.1" 200 660 "-" "Java/1.8.0_152"
127.0.0.1 - - [05/Apr/2018:12:59:01 +0000] "POST //localhost:31000/api/atlas/v2/search/basic
HTTP/1.1" 200 1336 "-" "Java/1.8.0_152"
127.0.0.1 - - [05/Apr/2018:12:59:01 +0000] "POST //localhost:31000/api/atlas/v2/search/basic
HTTP/1.1" 200 1383 "-" "Java/1.8.0_152"
127.0.0.1 - - [05/Apr/2018:12:59:01 +0000] "POST //localhost:31000/api/atlas/v2/search/basic
HTTP/1.1" 200 1383 "-" "Java/1.8.0_152"
127.0.0.1 - - [05/Apr/2018:12:59:01 +0000] "POST //localhost:31000/api/atlas/v2/search/basic
HTTP/1.1" 200 1226 "-" "Java/1.8.0_152"
127.0.0.1 - - [05/Apr/2018:12:59:01 +0000] "POST //localhost:31000/api/atlas/v2/search/basic
HTTP/1.1" 200 763 "-" "Java/1.8.0_152"
127.0.0.1 - - [05/Apr/2018:12:59:01 +0000] "POST //localhost:31000/api/atlas/v2/search/basic
HTTP/1.1" 200 5360 "-" "Java/1.8.0_152"
127.0.0.1 - - [05/Apr/2018:12:59:01 +0000] "POST //localhost:31000/api/atlas/v2/search/basic
HTTP/1.1" 200 1339 "-" "Java/1.8.0_152"
127.0.0.1 - - [05/Apr/2018:12:59:01 +0000] "POST //localhost:31000/api/atlas/v2/search/basic
HTTP/1.1" 200 1436 "-" "Java/1.8.0_152"
127.0.0.1 - - [05/Apr/2018:12:59:01 +0000] "POST //localhost:31000/api/atlas/v2/search/basic
HTTP/1.1" 200 1371 "-" "Java/1.8.0_152"
127.0.0.1 - - [05/Apr/2018:12:59:01 +0000] "POST //localhost:31000/api/atlas/v2/search/basic
HTTP/1.1" 200 660 "-" "Java/1.8.0_152"
127.0.0.1 - - [05/Apr/2018:12:59:01 +0000] "POST //localhost:31000/api/atlas/v2/search/basic
HTTP/1.1" 200 727 "-" "Java/1.8.0_152"
127.0.0.1 - - [05/Apr/2018:12:59:01 +0000] "POST //localhost:31000/api/atlas/v2/search/basic
HTTP/1.1" 200 284 "-" "Java/1.8.0_152"
127.0.0.1 - - [05/Apr/2018:12:59:01 +0000] "POST //localhost:31000/api/atlas/v2/search/basic
HTTP/1.1" 200 1931 "-" "Java/1.8.0_152"
127.0.0.1 - - [05/Apr/2018:12:59:01 +0000] "POST //localhost:31000/api/atlas/v2/search/basic
HTTP/1.1" 200 771 "-" "Java/1.8.0_152"
127.0.0.1 - - [05/Apr/2018:12:59:01 +0000] "POST //localhost:31000/api/atlas/v2/search/basic
HTTP/1.1" 200 1121 "-" "Java/1.8.0_152"
127.0.0.1 - - [05/Apr/2018:12:59:01 +0000] "POST //localhost:31000/api/atlas/v2/search/basic
HTTP/1.1" 200 864 "-" "Java/1.8.0_152"
127.0.0.1 - - [05/Apr/2018:12:59:01 +0000] "GET //localhost:31000/api/atlas/admin/version
HTTP/1.1" 200 169 "-" "Java/1.8.0_152"
127.0.0.1 - - [05/Apr/2018:12:59:21 +0000] "GET //localhost:31000/api/atlas/admin/status HTTP/1.1"
200 19 "-" "Java/1.8.0_152"
127.0.0.1 - - [05/Apr/2018:12:59:21 +0000] "GET //localhost:31000/api/atlas/admin/session
HTTP/1.1" 200 440 "-" "Java/1.8.0_152"
127.0.0.1 - - [05/Apr/2018:12:59:21 +0000] "GET //localhost:31000/api/atlas/admin/session
HTTP/1.1" 401 350 "-" "Java/1.8.0_152"
Tests run: 126, Failures: 3, Errors: 0, Skipped: 0, Time elapsed: 169.727 sec <<<
FAILURE! - in TestSuite
testCompleteUpdate(org.apache.atlas.web.integration.EntityJerseyResourceIT)  Time elapsed:
0.919 sec  <<< FAILURE!
java.lang.AssertionError: expected [true] but found [false]
	at org.testng.Assert.fail(Assert.java:94)
	at org.testng.Assert.failNotEquals(Assert.java:496)
	at org.testng.Assert.assertTrue(Assert.java:42)
	at org.testng.Assert.assertTrue(Assert.java:52)
	at org.apache.atlas.web.integration.EntityJerseyResourceIT.testCompleteUpdate(EntityJerseyResourceIT.java:1001)

testPartialUpdateByGuid(org.apache.atlas.web.integration.EntityJerseyResourceIT)  Time elapsed:
0.988 sec  <<< FAILURE!
java.lang.AssertionError: Maps do not have the same size:8 != 7
	at org.testng.Assert.fail(Assert.java:94)
	at org.testng.Assert.assertEquals(Assert.java:828)
	at org.apache.atlas.web.integration.EntityJerseyResourceIT.testPartialUpdateByGuid(EntityJerseyResourceIT.java:889)

testPartialUpdateByUniqueAttributes(org.apache.atlas.web.integration.EntityJerseyResourceIT)
 Time elapsed: 0.932 sec  <<< FAILURE!
java.lang.AssertionError: expected [true] but found [false]
	at org.testng.Assert.fail(Assert.java:94)
	at org.testng.Assert.failNotEquals(Assert.java:496)
	at org.testng.Assert.assertTrue(Assert.java:42)
	at org.testng.Assert.assertTrue(Assert.java:52)
	at org.apache.atlas.web.integration.EntityJerseyResourceIT.testPartialUpdateByUniqueAttributes(EntityJerseyResourceIT.java:944)


Results :

Failed tests: 
  EntityJerseyResourceIT.testCompleteUpdate:1001 expected [true] but found [false]
  EntityJerseyResourceIT.testPartialUpdateByGuid:889 Maps do not have the same size:8 != 7
  EntityJerseyResourceIT.testPartialUpdateByUniqueAttributes:944 expected [true] but found
[false]

Tests run: 126, Failures: 3, Errors: 0, Skipped: 0

[INFO] 
[INFO] --- jetty-maven-plugin:9.3.14.v20161028:stop (stop-jetty) @ atlas-webapp ---
[INFO] Waiting 10 seconds for jetty to stop
[INFO] Stopped ServerConnector@624aa383{HTTP/1.1,[http/1.1]}{0.0.0.0:31000}
[INFO] Closing Spring root WebApplicationContext
[INFO] Shutting down log4j
[INFO] Stopped o.e.j.m.p.JettyWebAppContext@42d55efb{/,file://<https://builds.apache.org/job/Atlas-master-IntegrationTests/ws/webapp/target/atlas-webapp-1.0.0-SNAPSHOT/,UNAVAILABLE}{/home/jenkins/jenkins-slave/workspace/Atlas-master-IntegrationTests/webapp/target/atlas-webapp-1.0.0-SNAPSHOT.war}>
[INFO] Server reports itself as stopped
[INFO] 
[INFO] --- maven-source-plugin:2.4:jar-no-fork (attach-sources) @ atlas-webapp ---
[INFO] Building jar: <https://builds.apache.org/job/Atlas-master-IntegrationTests/ws/webapp/target/atlas-webapp-1.0.0-SNAPSHOT-sources.jar>
log4j:WARN No appenders could be found for logger (org.apache.zookeeper.ClientCnxn).
log4j:WARN Please initialize the log4j system properly.
log4j:WARN See http://logging.apache.org/log4j/1.2/faq.html#noconfig for more info.
[INFO] 
[INFO] --- maven-source-plugin:2.4:test-jar-no-fork (attach-sources) @ atlas-webapp ---
[INFO] Building jar: <https://builds.apache.org/job/Atlas-master-IntegrationTests/ws/webapp/target/atlas-webapp-1.0.0-SNAPSHOT-test-sources.jar>
[INFO] 
[INFO] --- maven-failsafe-plugin:2.18.1:verify (verify) @ atlas-webapp ---
[INFO] Failsafe report directory: <https://builds.apache.org/job/Atlas-master-IntegrationTests/ws/webapp/target/failsafe-reports>
[INFO] ------------------------------------------------------------------------
[INFO] Reactor Summary:
[INFO] 
[INFO] Apache Atlas Server Build Tools .................... SUCCESS [  0.570 s]
[INFO] apache-atlas ....................................... SUCCESS [  3.712 s]
[INFO] Apache Atlas Test Utility Tools .................... SUCCESS [  9.811 s]
[INFO] Open Connector Framework (OCF) ..................... SUCCESS [  9.344 s]
[INFO] Apache Atlas Integration ........................... SUCCESS [ 17.917 s]
[INFO] Apache Atlas Common ................................ SUCCESS [  8.023 s]
[INFO] Apache Atlas Client ................................ SUCCESS [  0.539 s]
[INFO] atlas-client-common ................................ SUCCESS [  6.075 s]
[INFO] atlas-client-v1 .................................... SUCCESS [  6.473 s]
[INFO] Apache Atlas Server API ............................ SUCCESS [  5.057 s]
[INFO] Apache Atlas Notification .......................... SUCCESS [  7.963 s]
[INFO] atlas-client-v2 .................................... SUCCESS [  5.515 s]
[INFO] Apache Atlas Graph Database Projects ............... SUCCESS [  0.432 s]
[INFO] Apache Atlas Graph Database API .................... SUCCESS [  4.450 s]
[INFO] Graph Database Common Code ......................... SUCCESS [  4.997 s]
[INFO] Apache Atlas JanusGraph DB Impl .................... SUCCESS [ 12.639 s]
[INFO] Apache Atlas Graph Database Implementation Dependencies SUCCESS [  2.075 s]
[INFO] Shaded version of Apache hbase client .............. SUCCESS [  7.305 s]
[INFO] Apache Atlas Titan 0.5.4 Graph DB Impl ............. SUCCESS [ 35.579 s]
[INFO] Shaded version of Apache hbase server .............. SUCCESS [ 18.865 s]
[INFO] Apache Atlas Authorization ......................... SUCCESS [  6.786 s]
[INFO] Apache Atlas Repository ............................ SUCCESS [ 28.857 s]
[INFO] Apache Atlas UI .................................... SUCCESS [01:11 min]
[INFO] Apache Atlas Web Application ....................... FAILURE [03:59 min]
[INFO] Apache Atlas Documentation ......................... SKIPPED
[INFO] Apache Atlas FileSystem Model ...................... SKIPPED
[INFO] Apache Atlas Plugin Classloader .................... SKIPPED
[INFO] Apache Atlas Hive Bridge Shim ...................... SKIPPED
[INFO] Apache Atlas Hive Bridge ........................... SKIPPED
[INFO] Apache Atlas Falcon Bridge Shim .................... SKIPPED
[INFO] Apache Atlas Falcon Bridge ......................... SKIPPED
[INFO] Apache Atlas Sqoop Bridge Shim ..................... SKIPPED
[INFO] Apache Atlas Sqoop Bridge .......................... SKIPPED
[INFO] Apache Atlas Storm Bridge Shim ..................... SKIPPED
[INFO] Apache Atlas Storm Bridge .......................... SKIPPED
[INFO] Apache Atlas Hbase Bridge Shim ..................... SKIPPED
[INFO] Apache Atlas Hbase Bridge .......................... SKIPPED
[INFO] Apache Atlas Migration Exporter .................... SKIPPED
[INFO] Apache Atlas Distribution .......................... SKIPPED
[INFO] ------------------------------------------------------------------------
[INFO] BUILD FAILURE
[INFO] ------------------------------------------------------------------------
[INFO] Total time: 08:35 min
[INFO] Finished at: 2018-04-05T12:59:25Z
[INFO] Final Memory: 390M/3091M
[INFO] ------------------------------------------------------------------------
[ERROR] Failed to execute goal org.apache.maven.plugins:maven-failsafe-plugin:2.18.1:verify
(verify) on project atlas-webapp: There are test failures.
[ERROR] 
[ERROR] Please refer to <https://builds.apache.org/job/Atlas-master-IntegrationTests/ws/webapp/target/failsafe-reports>
for the individual test results.
[ERROR] -> [Help 1]
[ERROR] 
[ERROR] To see the full stack trace of the errors, re-run Maven with the -e switch.
[ERROR] Re-run Maven using the -X switch to enable full debug logging.
[ERROR] 
[ERROR] For more information about the errors and possible solutions, please read the following
articles:
[ERROR] [Help 1] http://cwiki.apache.org/confluence/display/MAVEN/MojoFailureException
[ERROR] 
[ERROR] After correcting the problems, you can resume the build with the command
[ERROR]   mvn <goals> -rf :atlas-webapp
Build step 'Execute shell' marked build as failure
[CHECKSTYLE] Collecting checkstyle analysis files...
[CHECKSTYLE] Searching for all files in <https://builds.apache.org/job/Atlas-master-IntegrationTests/ws/>
that match the pattern **/target/checkstyle-result.xml
[CHECKSTYLE] Parsing 22 files in <https://builds.apache.org/job/Atlas-master-IntegrationTests/ws/>
[CHECKSTYLE] Successfully parsed file <https://builds.apache.org/job/Atlas-master-IntegrationTests/ws/authorization/target/checkstyle-result.xml>
with 669 unique warnings and 0 duplicates.
[CHECKSTYLE] Successfully parsed file <https://builds.apache.org/job/Atlas-master-IntegrationTests/ws/client/client-v1/target/checkstyle-result.xml>
with 1553 unique warnings and 0 duplicates.
[CHECKSTYLE] Successfully parsed file <https://builds.apache.org/job/Atlas-master-IntegrationTests/ws/client/client-v2/target/checkstyle-result.xml>
with 1912 unique warnings and 0 duplicates.
[CHECKSTYLE] Successfully parsed file <https://builds.apache.org/job/Atlas-master-IntegrationTests/ws/client/common/target/checkstyle-result.xml>
with 2400 unique warnings and 0 duplicates.
[CHECKSTYLE] Successfully parsed file <https://builds.apache.org/job/Atlas-master-IntegrationTests/ws/client/target/checkstyle-result.xml>
with 2400 unique warnings and 0 duplicates.
[CHECKSTYLE] Successfully parsed file <https://builds.apache.org/job/Atlas-master-IntegrationTests/ws/common/target/checkstyle-result.xml>
with 3448 unique warnings and 0 duplicates.
[CHECKSTYLE] Successfully parsed file <https://builds.apache.org/job/Atlas-master-IntegrationTests/ws/dashboardv2/target/checkstyle-result.xml>
with 3448 unique warnings and 0 duplicates.
[CHECKSTYLE] Successfully parsed file <https://builds.apache.org/job/Atlas-master-IntegrationTests/ws/graphdb/api/target/checkstyle-result.xml>
with 3742 unique warnings and 0 duplicates.
[CHECKSTYLE] Successfully parsed file <https://builds.apache.org/job/Atlas-master-IntegrationTests/ws/graphdb/common/target/checkstyle-result.xml>
with 3951 unique warnings and 0 duplicates.
[CHECKSTYLE] Successfully parsed file <https://builds.apache.org/job/Atlas-master-IntegrationTests/ws/graphdb/graphdb-impls/target/checkstyle-result.xml>
with 3951 unique warnings and 0 duplicates.
[CHECKSTYLE] Successfully parsed file <https://builds.apache.org/job/Atlas-master-IntegrationTests/ws/graphdb/janus/target/checkstyle-result.xml>
with 5643 unique warnings and 0 duplicates.
[CHECKSTYLE] Successfully parsed file <https://builds.apache.org/job/Atlas-master-IntegrationTests/ws/graphdb/target/checkstyle-result.xml>
with 5643 unique warnings and 0 duplicates.
[CHECKSTYLE] Successfully parsed file <https://builds.apache.org/job/Atlas-master-IntegrationTests/ws/graphdb/titan0/target/checkstyle-result.xml>
with 8144 unique warnings and 0 duplicates.
[CHECKSTYLE] Successfully parsed file <https://builds.apache.org/job/Atlas-master-IntegrationTests/ws/intg/target/checkstyle-result.xml>
with 19155 unique warnings and 0 duplicates.
[CHECKSTYLE] Successfully parsed file <https://builds.apache.org/job/Atlas-master-IntegrationTests/ws/notification/target/checkstyle-result.xml>
with 20391 unique warnings and 0 duplicates.
[CHECKSTYLE] Successfully parsed file <https://builds.apache.org/job/Atlas-master-IntegrationTests/ws/om-fwk-ocf/target/checkstyle-result.xml>
with 25121 unique warnings and 0 duplicates.
[CHECKSTYLE] Successfully parsed file <https://builds.apache.org/job/Atlas-master-IntegrationTests/ws/repository/target/checkstyle-result.xml>
with 44879 unique warnings and 0 duplicates.
[CHECKSTYLE] Successfully parsed file <https://builds.apache.org/job/Atlas-master-IntegrationTests/ws/server-api/target/checkstyle-result.xml>
with 45030 unique warnings and 0 duplicates.
[CHECKSTYLE] Successfully parsed file <https://builds.apache.org/job/Atlas-master-IntegrationTests/ws/shaded/hbase-client-shaded/target/checkstyle-result.xml>
with 45030 unique warnings and 0 duplicates.
[CHECKSTYLE] Successfully parsed file <https://builds.apache.org/job/Atlas-master-IntegrationTests/ws/shaded/hbase-server-shaded/target/checkstyle-result.xml>
with 45030 unique warnings and 0 duplicates.
[CHECKSTYLE] Successfully parsed file <https://builds.apache.org/job/Atlas-master-IntegrationTests/ws/target/checkstyle-result.xml>
with 45030 unique warnings and 0 duplicates.
[CHECKSTYLE] Successfully parsed file <https://builds.apache.org/job/Atlas-master-IntegrationTests/ws/test-tools/target/checkstyle-result.xml>
with 45068 unique warnings and 0 duplicates.
<Git Blamer> Using GitBlamer to create author and commit information for all warnings.
<Git Blamer> GIT_COMMIT=da8581e90aca74d1b3b04ee2efd5901b87b8d77d, workspace=<https://builds.apache.org/job/Atlas-master-IntegrationTests/ws/>
 > git rev-parse da8581e90aca74d1b3b04ee2efd5901b87b8d77d^{commit} # timeout=10
[CHECKSTYLE] Computing warning deltas based on reference build #950
[FINDBUGS] Collecting findbugs analysis files...
[FINDBUGS] Searching for all files in <https://builds.apache.org/job/Atlas-master-IntegrationTests/ws/>
that match the pattern **/target/findbugs.xml
[FINDBUGS] Parsing 15 files in <https://builds.apache.org/job/Atlas-master-IntegrationTests/ws/>
[FINDBUGS] Successfully parsed file <https://builds.apache.org/job/Atlas-master-IntegrationTests/ws/authorization/target/findbugs.xml>
with 0 unique warnings and 0 duplicates.
[FINDBUGS] Successfully parsed file <https://builds.apache.org/job/Atlas-master-IntegrationTests/ws/client/client-v1/target/findbugs.xml>
with 0 unique warnings and 0 duplicates.
[FINDBUGS] Successfully parsed file <https://builds.apache.org/job/Atlas-master-IntegrationTests/ws/client/client-v2/target/findbugs.xml>
with 0 unique warnings and 0 duplicates.
[FINDBUGS] Successfully parsed file <https://builds.apache.org/job/Atlas-master-IntegrationTests/ws/client/common/target/findbugs.xml>
with 0 unique warnings and 0 duplicates.
[FINDBUGS] Successfully parsed file <https://builds.apache.org/job/Atlas-master-IntegrationTests/ws/common/target/findbugs.xml>
with 0 unique warnings and 0 duplicates.
[FINDBUGS] Successfully parsed file <https://builds.apache.org/job/Atlas-master-IntegrationTests/ws/graphdb/api/target/findbugs.xml>
with 0 unique warnings and 0 duplicates.
[FINDBUGS] Successfully parsed file <https://builds.apache.org/job/Atlas-master-IntegrationTests/ws/graphdb/common/target/findbugs.xml>
with 0 unique warnings and 0 duplicates.
[FINDBUGS] Successfully parsed file <https://builds.apache.org/job/Atlas-master-IntegrationTests/ws/graphdb/janus/target/findbugs.xml>
with 0 unique warnings and 0 duplicates.
[FINDBUGS] Successfully parsed file <https://builds.apache.org/job/Atlas-master-IntegrationTests/ws/graphdb/titan0/target/findbugs.xml>
with 0 unique warnings and 0 duplicates.
[FINDBUGS] Successfully parsed file <https://builds.apache.org/job/Atlas-master-IntegrationTests/ws/intg/target/findbugs.xml>
with 0 unique warnings and 0 duplicates.
[FINDBUGS] Successfully parsed file <https://builds.apache.org/job/Atlas-master-IntegrationTests/ws/notification/target/findbugs.xml>
with 0 unique warnings and 0 duplicates.
[FINDBUGS] Successfully parsed file <https://builds.apache.org/job/Atlas-master-IntegrationTests/ws/om-fwk-ocf/target/findbugs.xml>
with 0 unique warnings and 0 duplicates.
[FINDBUGS] Successfully parsed file <https://builds.apache.org/job/Atlas-master-IntegrationTests/ws/repository/target/findbugs.xml>
with 0 unique warnings and 0 duplicates.
[FINDBUGS] Successfully parsed file <https://builds.apache.org/job/Atlas-master-IntegrationTests/ws/server-api/target/findbugs.xml>
with 0 unique warnings and 0 duplicates.
[FINDBUGS] Successfully parsed file <https://builds.apache.org/job/Atlas-master-IntegrationTests/ws/test-tools/target/findbugs.xml>
with 0 unique warnings and 0 duplicates.
<Git Blamer> Using GitBlamer to create author and commit information for all warnings.
<Git Blamer> GIT_COMMIT=da8581e90aca74d1b3b04ee2efd5901b87b8d77d, workspace=<https://builds.apache.org/job/Atlas-master-IntegrationTests/ws/>
[FINDBUGS] Computing warning deltas based on reference build #950
Archiving artifacts
[Fast Archiver] Compressed 165.44 MB of artifacts by 69.5% relative to #950
TestNG Reports Processing: START
Looking for TestNG results report in workspace using pattern: **/target/surefire-reports/testng-results.xml,**/target/failsafe-reports/testng-results.xml
Saving reports...
Processing '/x1/jenkins/jenkins-home/jobs/Atlas-master-IntegrationTests/builds/957/testng/testng-results.xml'
2.380952% of tests failed, which exceeded threshold of 0%. Marking build as UNSTABLE
TestNG Reports Processing: FINISH

Mime
View raw message