atlas-dev mailing list archives

Site index · List index
Message view « Date » · « Thread »
Top « Date » · « Thread »
From Apache Jenkins Server <jenk...@builds.apache.org>
Subject Build failed in Jenkins: Atlas-master-IntegrationTests #1017
Date Wed, 11 Apr 2018 10:11:58 GMT
See <https://builds.apache.org/job/Atlas-master-IntegrationTests/1017/display/redirect>

------------------------------------------
[...truncated 676.03 KB...]
127.0.0.1 - - [11/Apr/2018:09:50:36 +0000] "GET //localhost:31000/api/atlas/v2/entity/uniqueAttribute/type/hive_table?attr:qualifiedName=default.tablegxjalkic1o@primary
HTTP/1.1" 200 4977 "-" "Java/1.8.0_152"
127.0.0.1 - - [11/Apr/2018:09:50:36 +0000] "GET //localhost:31000/api/atlas/v2/entity/uniqueAttribute/type/hive_table?attr:qualifiedName=default.tablegxjalkic1o@primary
HTTP/1.1" 200 4977 "-" "Java/1.8.0_152"
127.0.0.1 - - [11/Apr/2018:09:50:36 +0000] "GET //localhost:31000/api/atlas/v2/entity/uniqueAttribute/type/hive_process?attr:qualifiedName=TRUNCATETABLE-%3E:default.tablegxjalkic1o@primary:1523440236000
HTTP/1.1" 200 1162 "-" "Java/1.8.0_152"
127.0.0.1 - - [11/Apr/2018:09:50:36 +0000] "GET //localhost:31000/api/atlas/v2/entity/uniqueAttribute/type/hive_process?attr:qualifiedName=TRUNCATETABLE-%3E:default.tablegxjalkic1o@primary:1523440236000
HTTP/1.1" 200 1162 "-" "Java/1.8.0_152"
127.0.0.1 - - [11/Apr/2018:09:50:36 +0000] "GET //localhost:31000/api/atlas/v2/entity/guid/59383003-f7fa-4199-aab3-bb080fc015f4
HTTP/1.1" 200 1162 "-" "Java/1.8.0_152"
127.0.0.1 - - [11/Apr/2018:09:50:36 +0000] "GET //localhost:31000/api/atlas/v2/entity/guid/e698e246-7fc6-4052-9121-371f1dce707f
HTTP/1.1" 200 5249 "-" "Java/1.8.0_152"
127.0.0.1 - - [11/Apr/2018:09:50:36 +0000] "GET //localhost:31000/api/atlas/v2/lineage/e698e246-7fc6-4052-9121-371f1dce707f?depth=0&direction=INPUT
HTTP/1.1" 200 135 "-" "Java/1.8.0_152"
127.0.0.1 - - [11/Apr/2018:09:50:38 +0000] "GET //localhost:31000/api/atlas/v2/entity/uniqueAttribute/type/hive_process?attr:qualifiedName=QUERY:default.tableenf3po3tnn@primary:1523440236000-%3E
HTTP/1.1" 404 178 "-" "Java/1.8.0_152"
127.0.0.1 - - [11/Apr/2018:09:50:43 +0000] "GET //localhost:31000/api/atlas/v2/entity/uniqueAttribute/type/hive_process?attr:qualifiedName=QUERY:default.tableenf3po3tnn@primary:1523440236000-%3E
HTTP/1.1" 200 2078 "-" "Java/1.8.0_152"
127.0.0.1 - - [11/Apr/2018:09:50:43 +0000] "GET //localhost:31000/api/atlas/v2/entity/uniqueAttribute/type/hive_process?attr:qualifiedName=QUERY:default.tableenf3po3tnn@primary:1523440236000-%3E
HTTP/1.1" 200 2078 "-" "Java/1.8.0_152"
127.0.0.1 - - [11/Apr/2018:09:50:43 +0000] "GET //localhost:31000/api/atlas/v2/entity/guid/5247cfd8-faec-4003-9d0a-73c19fc87486
HTTP/1.1" 200 2078 "-" "Java/1.8.0_152"
127.0.0.1 - - [11/Apr/2018:09:50:43 +0000] "GET //localhost:31000/api/atlas/v2/entity/guid/c024b4d3-6fe6-437f-8e54-55e6400a95fa
HTTP/1.1" 200 5416 "-" "Java/1.8.0_152"
127.0.0.1 - - [11/Apr/2018:09:50:43 +0000] "GET //localhost:31000/api/atlas/v2/entity/guid/1fa60006-8bd2-47f3-9e0e-6d8c437a0976
HTTP/1.1" 200 1415 "-" "Java/1.8.0_152"
127.0.0.1 - - [11/Apr/2018:09:50:43 +0000] "GET //localhost:31000/api/atlas/v2/entity/uniqueAttribute/type/hdfs_path?attr:qualifiedName=pfile:/home/jenkins/jenkins-slave/workspace/atlas-master-integrationtests/addons/hive-bridge/target/somedfspath1-data-3iop1hj4kl
HTTP/1.1" 200 1415 "-" "Java/1.8.0_152"
127.0.0.1 - - [11/Apr/2018:09:50:43 +0000] "GET //localhost:31000/api/atlas/v2/entity/uniqueAttribute/type/hdfs_path?attr:qualifiedName=pfile:/home/jenkins/jenkins-slave/workspace/atlas-master-integrationtests/addons/hive-bridge/target/somedfspath1-data-3iop1hj4kl
HTTP/1.1" 200 1415 "-" "Java/1.8.0_152"
127.0.0.1 - - [11/Apr/2018:09:50:43 +0000] "GET //localhost:31000/api/atlas/v2/entity/uniqueAttribute/type/hive_table?attr:qualifiedName=default.tableenf3po3tnn@primary
HTTP/1.1" 200 5416 "-" "Java/1.8.0_152"
127.0.0.1 - - [11/Apr/2018:09:50:43 +0000] "GET //localhost:31000/api/atlas/v2/entity/uniqueAttribute/type/hive_table?attr:qualifiedName=default.tableenf3po3tnn@primary
HTTP/1.1" 200 5416 "-" "Java/1.8.0_152"
127.0.0.1 - - [11/Apr/2018:09:50:43 +0000] "GET //localhost:31000/api/atlas/v2/entity/guid/c024b4d3-6fe6-437f-8e54-55e6400a95fa
HTTP/1.1" 200 5416 "-" "Java/1.8.0_152"
127.0.0.1 - - [11/Apr/2018:09:50:46 +0000] "GET //localhost:31000/api/atlas/v2/entity/uniqueAttribute/type/hive_table?attr:qualifiedName=default.tableenf3po3tnn@primary
HTTP/1.1" 200 5416 "-" "Java/1.8.0_152"
127.0.0.1 - - [11/Apr/2018:09:50:46 +0000] "GET //localhost:31000/api/atlas/v2/entity/uniqueAttribute/type/hive_table?attr:qualifiedName=default.tableenf3po3tnn@primary
HTTP/1.1" 200 5416 "-" "Java/1.8.0_152"
127.0.0.1 - - [11/Apr/2018:09:50:46 +0000] "GET //localhost:31000/api/atlas/v2/entity/uniqueAttribute/type/hive_process?attr:qualifiedName=QUERY:default.tableenf3po3tnn@primary:1523440236000-%3E
HTTP/1.1" 200 2078 "-" "Java/1.8.0_152"
127.0.0.1 - - [11/Apr/2018:09:50:46 +0000] "GET //localhost:31000/api/atlas/v2/entity/uniqueAttribute/type/hive_process?attr:qualifiedName=QUERY:default.tableenf3po3tnn@primary:1523440236000-%3E
HTTP/1.1" 200 2078 "-" "Java/1.8.0_152"
127.0.0.1 - - [11/Apr/2018:09:50:46 +0000] "GET //localhost:31000/api/atlas/v2/entity/guid/5247cfd8-faec-4003-9d0a-73c19fc87486
HTTP/1.1" 200 2078 "-" "Java/1.8.0_152"
127.0.0.1 - - [11/Apr/2018:09:50:46 +0000] "GET //localhost:31000/api/atlas/v2/entity/guid/c024b4d3-6fe6-437f-8e54-55e6400a95fa
HTTP/1.1" 200 5416 "-" "Java/1.8.0_152"
127.0.0.1 - - [11/Apr/2018:09:50:46 +0000] "GET //localhost:31000/api/atlas/v2/entity/guid/1fa60006-8bd2-47f3-9e0e-6d8c437a0976
HTTP/1.1" 200 1415 "-" "Java/1.8.0_152"
127.0.0.1 - - [11/Apr/2018:09:50:46 +0000] "GET //localhost:31000/api/atlas/v2/entity/uniqueAttribute/type/hdfs_path?attr:qualifiedName=pfile:/home/jenkins/jenkins-slave/workspace/atlas-master-integrationtests/addons/hive-bridge/target/somedfspath1-data-3iop1hj4kl
HTTP/1.1" 200 1415 "-" "Java/1.8.0_152"
127.0.0.1 - - [11/Apr/2018:09:50:46 +0000] "GET //localhost:31000/api/atlas/v2/entity/uniqueAttribute/type/hdfs_path?attr:qualifiedName=pfile:/home/jenkins/jenkins-slave/workspace/atlas-master-integrationtests/addons/hive-bridge/target/somedfspath1-data-3iop1hj4kl
HTTP/1.1" 200 1415 "-" "Java/1.8.0_152"
127.0.0.1 - - [11/Apr/2018:09:50:49 +0000] "GET //localhost:31000/api/atlas/v2/entity/uniqueAttribute/type/hive_table?attr:qualifiedName=default.tableenf3po3tnn@primary
HTTP/1.1" 200 5416 "-" "Java/1.8.0_152"
127.0.0.1 - - [11/Apr/2018:09:50:49 +0000] "GET //localhost:31000/api/atlas/v2/entity/uniqueAttribute/type/hive_table?attr:qualifiedName=default.tableenf3po3tnn@primary
HTTP/1.1" 200 5416 "-" "Java/1.8.0_152"
127.0.0.1 - - [11/Apr/2018:09:50:49 +0000] "GET //localhost:31000/api/atlas/v2/entity/uniqueAttribute/type/hive_process?attr:qualifiedName=QUERY:default.tableenf3po3tnn@primary:1523440236000-%3E
HTTP/1.1" 200 2512 "-" "Java/1.8.0_152"
127.0.0.1 - - [11/Apr/2018:09:50:50 +0000] "GET //localhost:31000/api/atlas/v2/entity/uniqueAttribute/type/hive_process?attr:qualifiedName=QUERY:default.tableenf3po3tnn@primary:1523440236000-%3E
HTTP/1.1" 200 2512 "-" "Java/1.8.0_152"
127.0.0.1 - - [11/Apr/2018:09:50:50 +0000] "GET //localhost:31000/api/atlas/v2/entity/guid/5247cfd8-faec-4003-9d0a-73c19fc87486
HTTP/1.1" 200 2512 "-" "Java/1.8.0_152"
127.0.0.1 - - [11/Apr/2018:09:50:50 +0000] "GET //localhost:31000/api/atlas/v2/entity/guid/c024b4d3-6fe6-437f-8e54-55e6400a95fa
HTTP/1.1" 200 5416 "-" "Java/1.8.0_152"
127.0.0.1 - - [11/Apr/2018:09:50:50 +0000] "GET //localhost:31000/api/atlas/v2/entity/guid/5a7ded65-ee62-42d8-86df-4ef96f071284
HTTP/1.1" 200 1415 "-" "Java/1.8.0_152"
127.0.0.1 - - [11/Apr/2018:09:50:50 +0000] "GET //localhost:31000/api/atlas/v2/entity/guid/1fa60006-8bd2-47f3-9e0e-6d8c437a0976
HTTP/1.1" 200 1416 "-" "Java/1.8.0_152"
127.0.0.1 - - [11/Apr/2018:09:50:50 +0000] "GET //localhost:31000/api/atlas/v2/entity/uniqueAttribute/type/hdfs_path?attr:qualifiedName=pfile:/home/jenkins/jenkins-slave/workspace/atlas-master-integrationtests/addons/hive-bridge/target/somedfspath2-data-9uowmf8tej
HTTP/1.1" 200 1415 "-" "Java/1.8.0_152"
127.0.0.1 - - [11/Apr/2018:09:50:50 +0000] "GET //localhost:31000/api/atlas/v2/entity/uniqueAttribute/type/hdfs_path?attr:qualifiedName=pfile:/home/jenkins/jenkins-slave/workspace/atlas-master-integrationtests/addons/hive-bridge/target/somedfspath2-data-9uowmf8tej
HTTP/1.1" 200 1415 "-" "Java/1.8.0_152"
127.0.0.1 - - [11/Apr/2018:09:50:50 +0000] "GET //localhost:31000/api/atlas/v2/entity/uniqueAttribute/type/hive_db?attr:qualifiedName=default@primary
HTTP/1.1" 200 16141 "-" "Java/1.8.0_152"
127.0.0.1 - - [11/Apr/2018:09:50:50 +0000] "GET //localhost:31000/api/atlas/v2/entity/uniqueAttribute/type/hive_db?attr:qualifiedName=default@primary
HTTP/1.1" 200 16141 "-" "Java/1.8.0_152"
127.0.0.1 - - [11/Apr/2018:09:50:50 +0000] "GET //localhost:31000/api/atlas/v2/entity/uniqueAttribute/type/hive_table?attr:qualifiedName=default.tableoie2cbpkzm@primary
HTTP/1.1" 404 154 "-" "Java/1.8.0_152"
127.0.0.1 - - [11/Apr/2018:09:50:56 +0000] "GET //localhost:31000/api/atlas/v2/entity/uniqueAttribute/type/hive_table?attr:qualifiedName=default.tableoie2cbpkzm@primary
HTTP/1.1" 200 5399 "-" "Java/1.8.0_152"
127.0.0.1 - - [11/Apr/2018:09:50:56 +0000] "GET //localhost:31000/api/atlas/v2/entity/uniqueAttribute/type/hive_table?attr:qualifiedName=default.tableoie2cbpkzm@primary
HTTP/1.1" 200 5399 "-" "Java/1.8.0_152"
127.0.0.1 - - [11/Apr/2018:09:50:56 +0000] "GET //localhost:31000/api/atlas/v2/entity/uniqueAttribute/type/hive_process?attr:qualifiedName=default.tableoie2cbpkzm@primary:1523440250000
HTTP/1.1" 200 2077 "-" "Java/1.8.0_152"
127.0.0.1 - - [11/Apr/2018:09:50:56 +0000] "GET //localhost:31000/api/atlas/v2/entity/uniqueAttribute/type/hive_process?attr:qualifiedName=default.tableoie2cbpkzm@primary:1523440250000
HTTP/1.1" 200 2077 "-" "Java/1.8.0_152"
127.0.0.1 - - [11/Apr/2018:09:50:56 +0000] "GET //localhost:31000/api/atlas/v2/entity/guid/bf63b297-4bc6-426d-9c3d-2a0693641a97
HTTP/1.1" 200 2077 "-" "Java/1.8.0_152"
127.0.0.1 - - [11/Apr/2018:09:50:56 +0000] "GET //localhost:31000/api/atlas/v2/entity/uniqueAttribute/type/hdfs_path?attr:qualifiedName=pfile:/home/jenkins/jenkins-slave/workspace/atlas-master-integrationtests/addons/hive-bridge/target/parentpath-data-yczynexxko
HTTP/1.1" 200 1409 "-" "Java/1.8.0_152"
127.0.0.1 - - [11/Apr/2018:09:50:56 +0000] "GET //localhost:31000/api/atlas/v2/entity/uniqueAttribute/type/hdfs_path?attr:qualifiedName=pfile:/home/jenkins/jenkins-slave/workspace/atlas-master-integrationtests/addons/hive-bridge/target/parentpath-data-yczynexxko
HTTP/1.1" 200 1409 "-" "Java/1.8.0_152"
127.0.0.1 - - [11/Apr/2018:09:50:56 +0000] "GET //localhost:31000/api/atlas/entities?type=hive_table
HTTP/1.1" 200 2732 "-" "Java/1.8.0_152"
127.0.0.1 - - [11/Apr/2018:09:50:56 +0000] "GET //localhost:31000/api/atlas/v2/entity/guid/11267674-36f3-429c-9a59-d2f967d5d585
HTTP/1.1" 200 16388 "-" "Java/1.8.0_152"
127.0.0.1 - - [11/Apr/2018:09:50:56 +0000] "GET //localhost:31000/api/atlas/v2/entity/uniqueAttribute/type/hive_table?attr:qualifiedName=default.tableoie2cbpkzm@primary
HTTP/1.1" 200 5399 "-" "Java/1.8.0_152"
127.0.0.1 - - [11/Apr/2018:09:50:56 +0000] "POST //localhost:31000/api/atlas/v2/entity/ HTTP/1.1"
200 703 "-" "Java/1.8.0_152"
127.0.0.1 - - [11/Apr/2018:09:50:56 +0000] "GET //localhost:31000/api/atlas/v2/entity/uniqueAttribute/type/hive_process?attr:qualifiedName=default.tableoie2cbpkzm@primary:1523440250000
HTTP/1.1" 200 2077 "-" "Java/1.8.0_152"
127.0.0.1 - - [11/Apr/2018:09:50:56 +0000] "GET //localhost:31000/api/atlas/v2/entity/uniqueAttribute/type/hive_table?attr:qualifiedName=default.tableoie2cbpkzm@primary
HTTP/1.1" 200 5393 "-" "Java/1.8.0_152"
127.0.0.1 - - [11/Apr/2018:09:50:56 +0000] "GET //localhost:31000/api/atlas/v2/entity/uniqueAttribute/type/hive_table?attr:qualifiedName=default.tableoie2cbpkzm@primary
HTTP/1.1" 200 5393 "-" "Java/1.8.0_152"
127.0.0.1 - - [11/Apr/2018:09:50:56 +0000] "GET //localhost:31000/api/atlas/v2/entity/uniqueAttribute/type/hive_process?attr:qualifiedName=default.tableoie2cbpkzm@primary:1523440250000
HTTP/1.1" 200 2077 "-" "Java/1.8.0_152"
127.0.0.1 - - [11/Apr/2018:09:50:56 +0000] "GET //localhost:31000/api/atlas/v2/entity/uniqueAttribute/type/hive_process?attr:qualifiedName=default.tableoie2cbpkzm@primary:1523440250000
HTTP/1.1" 200 2077 "-" "Java/1.8.0_152"
127.0.0.1 - - [11/Apr/2018:09:50:56 +0000] "GET //localhost:31000/api/atlas/entities?type=hive_table
HTTP/1.1" 200 2732 "-" "Java/1.8.0_152"
127.0.0.1 - - [11/Apr/2018:09:50:56 +0000] "GET //localhost:31000/api/atlas/v2/entity/uniqueAttribute/type/hive_db?attr:qualifiedName=default@primary
HTTP/1.1" 200 16388 "-" "Java/1.8.0_152"
127.0.0.1 - - [11/Apr/2018:09:50:56 +0000] "GET //localhost:31000/api/atlas/v2/entity/uniqueAttribute/type/hive_db?attr:qualifiedName=default@primary
HTTP/1.1" 200 16388 "-" "Java/1.8.0_152"
127.0.0.1 - - [11/Apr/2018:09:50:56 +0000] "GET //localhost:31000/api/atlas/v2/entity/guid/11267674-36f3-429c-9a59-d2f967d5d585
HTTP/1.1" 200 16388 "-" "Java/1.8.0_152"
127.0.0.1 - - [11/Apr/2018:09:50:56 +0000] "GET //localhost:31000/api/atlas/v2/entity/uniqueAttribute/type/hive_table?attr:qualifiedName=default.tablevugj0je6k1@primary
HTTP/1.1" 404 154 "-" "Java/1.8.0_152"
127.0.0.1 - - [11/Apr/2018:09:50:56 +0000] "POST //localhost:31000/api/atlas/v2/entity/ HTTP/1.1"
200 859 "-" "Java/1.8.0_152"
127.0.0.1 - - [11/Apr/2018:09:50:56 +0000] "GET //localhost:31000/api/atlas/v2/entity/guid/d4f2eb85-336f-43dc-842f-a7606a0840b6
HTTP/1.1" 200 3821 "-" "Java/1.8.0_152"
127.0.0.1 - - [11/Apr/2018:09:50:56 +0000] "GET //localhost:31000/api/atlas/v2/entity/uniqueAttribute/type/hive_process?attr:qualifiedName=default.tablevugj0je6k1@primary:1523440256000
HTTP/1.1" 404 170 "-" "Java/1.8.0_152"
127.0.0.1 - - [11/Apr/2018:09:50:56 +0000] "POST //localhost:31000/api/atlas/v2/entity/bulk/
HTTP/1.1" 200 756 "-" "Java/1.8.0_152"
127.0.0.1 - - [11/Apr/2018:09:50:56 +0000] "GET //localhost:31000/api/atlas/v2/entity/guid/f48d80a8-6859-40bf-8f81-2cc088c192c9
HTTP/1.1" 200 2155 "-" "Java/1.8.0_152"
127.0.0.1 - - [11/Apr/2018:09:50:56 +0000] "GET //localhost:31000/api/atlas/v2/entity/guid/577c0ac1-9a72-4dff-bf42-6b4408fd29c5
HTTP/1.1" 200 1392 "-" "Java/1.8.0_152"
127.0.0.1 - - [11/Apr/2018:09:50:56 +0000] "GET //localhost:31000/api/atlas/v2/entity/uniqueAttribute/type/hive_table?attr:qualifiedName=default.tablevugj0je6k1@primary
HTTP/1.1" 200 4249 "-" "Java/1.8.0_152"
127.0.0.1 - - [11/Apr/2018:09:50:56 +0000] "GET //localhost:31000/api/atlas/v2/entity/uniqueAttribute/type/hive_table?attr:qualifiedName=default.tablevugj0je6k1@primary
HTTP/1.1" 200 4249 "-" "Java/1.8.0_152"
127.0.0.1 - - [11/Apr/2018:09:50:56 +0000] "GET //localhost:31000/api/atlas/v2/entity/uniqueAttribute/type/hive_process?attr:qualifiedName=default.tablevugj0je6k1@primary:1523440256000
HTTP/1.1" 200 2155 "-" "Java/1.8.0_152"
127.0.0.1 - - [11/Apr/2018:09:50:56 +0000] "GET //localhost:31000/api/atlas/v2/entity/uniqueAttribute/type/hive_process?attr:qualifiedName=default.tablevugj0je6k1@primary:1523440256000
HTTP/1.1" 200 2155 "-" "Java/1.8.0_152"
127.0.0.1 - - [11/Apr/2018:09:50:56 +0000] "GET //localhost:31000/api/atlas/v2/entity/guid/f48d80a8-6859-40bf-8f81-2cc088c192c9
HTTP/1.1" 200 2155 "-" "Java/1.8.0_152"
Tests run: 46, Failures: 1, Errors: 0, Skipped: 0, Time elapsed: 352.775 sec <<<
FAILURE! - in TestSuite
testCreateTableHiveProcessNameAttribute(org.apache.atlas.hive.bridge.HiveMetastoreBridgeIT)
 Time elapsed: 0.022 sec  <<< FAILURE!
java.lang.AssertionError: expected [0] but found [40000]
	at org.testng.Assert.fail(Assert.java:94)
	at org.testng.Assert.failNotEquals(Assert.java:496)
	at org.testng.Assert.assertEquals(Assert.java:125)
	at org.testng.Assert.assertEquals(Assert.java:372)
	at org.testng.Assert.assertEquals(Assert.java:382)
	at org.apache.atlas.hive.HiveITBase.runCommandWithDelay(HiveITBase.java:154)
	at org.apache.atlas.hive.HiveITBase.runCommandWithDelay(HiveITBase.java:147)
	at org.apache.atlas.hive.HiveITBase.runCommand(HiveITBase.java:139)
	at org.apache.atlas.hive.bridge.HiveMetastoreBridgeIT.testCreateTableHiveProcessNameAttribute(HiveMetastoreBridgeIT.java:105)


Results :

Failed tests: 
  HiveMetastoreBridgeIT.testCreateTableHiveProcessNameAttribute:105->HiveITBase.runCommand:139->HiveITBase.runCommandWithDelay:147->HiveITBase.runCommandWithDelay:154
expected [0] but found [40000]

Tests run: 46, Failures: 1, Errors: 0, Skipped: 0

[INFO] 
[INFO] --- jetty-maven-plugin:9.3.14.v20161028:stop (stop-jetty) @ hive-bridge ---
[INFO] Waiting 10 seconds for jetty to stop
[INFO] Stopped ServerConnector@3af5e106{HTTP/1.1,[http/1.1]}{0.0.0.0:31000}
[INFO] Closing Spring root WebApplicationContext
[INFO] Shutting down log4j
[INFO] Stopped o.e.j.m.p.JettyWebAppContext@7a25bb3c{/,file://<https://builds.apache.org/job/Atlas-master-IntegrationTests/ws/webapp/target/atlas-webapp-1.0.0-SNAPSHOT/,UNAVAILABLE}{/home/jenkins/jenkins-slave/workspace/Atlas-master-IntegrationTests/webapp/target/atlas-webapp-1.0.0-SNAPSHOT.war}>
[INFO] Server reports itself as stopped
[INFO] 
[INFO] --- maven-source-plugin:2.4:jar-no-fork (attach-sources) @ hive-bridge ---
[INFO] Building jar: <https://builds.apache.org/job/Atlas-master-IntegrationTests/ws/addons/hive-bridge/target/hive-bridge-1.0.0-SNAPSHOT-sources.jar>
[INFO] 
[INFO] --- maven-source-plugin:2.4:test-jar-no-fork (attach-sources) @ hive-bridge ---
[INFO] Building jar: <https://builds.apache.org/job/Atlas-master-IntegrationTests/ws/addons/hive-bridge/target/hive-bridge-1.0.0-SNAPSHOT-test-sources.jar>
[INFO] 
[INFO] --- maven-failsafe-plugin:2.18.1:verify (verify) @ hive-bridge ---
[INFO] Failsafe report directory: <https://builds.apache.org/job/Atlas-master-IntegrationTests/ws/addons/hive-bridge/target/failsafe-reports>
[INFO] ------------------------------------------------------------------------
[INFO] Reactor Summary:
[INFO] 
[INFO] Apache Atlas Server Build Tools .................... SUCCESS [  0.956 s]
[INFO] apache-atlas ....................................... SUCCESS [  6.166 s]
[INFO] Apache Atlas Test Utility Tools .................... SUCCESS [ 11.962 s]
[INFO] Open Connector Framework (OCF) ..................... SUCCESS [ 12.680 s]
[INFO] Open Metadata Repository Services (OMRS) ........... SUCCESS [ 36.812 s]
[INFO] Open Metadata and Governance (OMAG) Server APIs .... SUCCESS [ 10.372 s]
[INFO] Apache Atlas Integration ........................... SUCCESS [ 26.156 s]
[INFO] Apache Atlas Common ................................ SUCCESS [  9.729 s]
[INFO] Apache Atlas Client ................................ SUCCESS [  0.687 s]
[INFO] atlas-client-common ................................ SUCCESS [  8.839 s]
[INFO] atlas-client-v1 .................................... SUCCESS [  8.836 s]
[INFO] Apache Atlas Server API ............................ SUCCESS [  6.748 s]
[INFO] Apache Atlas Notification .......................... SUCCESS [ 10.798 s]
[INFO] atlas-client-v2 .................................... SUCCESS [  6.515 s]
[INFO] Apache Atlas Graph Database Projects ............... SUCCESS [  0.467 s]
[INFO] Apache Atlas Graph Database API .................... SUCCESS [  5.088 s]
[INFO] Graph Database Common Code ......................... SUCCESS [  6.288 s]
[INFO] Apache Atlas JanusGraph DB Impl .................... SUCCESS [ 18.419 s]
[INFO] Apache Atlas Graph Database Implementation Dependencies SUCCESS [  2.586 s]
[INFO] Shaded version of Apache hbase client .............. SUCCESS [  8.685 s]
[INFO] Apache Atlas Titan 0.5.4 Graph DB Impl ............. SUCCESS [ 48.358 s]
[INFO] Shaded version of Apache hbase server .............. SUCCESS [ 22.847 s]
[INFO] Apache Atlas Authorization ......................... SUCCESS [  7.071 s]
[INFO] Apache Atlas Repository ............................ SUCCESS [ 37.389 s]
[INFO] Apache Atlas UI .................................... SUCCESS [01:26 min]
[INFO] Apache Atlas Web Application ....................... SUCCESS [03:33 min]
[INFO] Apache Atlas Documentation ......................... SUCCESS [  4.939 s]
[INFO] Apache Atlas FileSystem Model ...................... SUCCESS [  3.887 s]
[INFO] Apache Atlas Plugin Classloader .................... SUCCESS [  9.562 s]
[INFO] Apache Atlas Hive Bridge Shim ...................... SUCCESS [ 11.866 s]
[INFO] Apache Atlas Hive Bridge ........................... FAILURE [06:57 min]
[INFO] Apache Atlas Falcon Bridge Shim .................... SKIPPED
[INFO] Apache Atlas Falcon Bridge ......................... SKIPPED
[INFO] Apache Atlas Sqoop Bridge Shim ..................... SKIPPED
[INFO] Apache Atlas Sqoop Bridge .......................... SKIPPED
[INFO] Apache Atlas Storm Bridge Shim ..................... SKIPPED
[INFO] Apache Atlas Storm Bridge .......................... SKIPPED
[INFO] Apache Atlas Hbase Bridge Shim ..................... SKIPPED
[INFO] Apache Atlas Hbase Bridge .......................... SKIPPED
[INFO] Apache Atlas Migration Exporter .................... SKIPPED
[INFO] Apache Atlas Distribution .......................... SKIPPED
[INFO] ------------------------------------------------------------------------
[INFO] BUILD FAILURE
[INFO] ------------------------------------------------------------------------
[INFO] Total time: 17:43 min
[INFO] Finished at: 2018-04-11T09:51:00Z
[INFO] Final Memory: 598M/2360M
[INFO] ------------------------------------------------------------------------
log4j:WARN No appenders could be found for logger (org.apache.zookeeper.ClientCnxn).
log4j:WARN Please initialize the log4j system properly.
log4j:WARN See http://logging.apache.org/log4j/1.2/faq.html#noconfig for more info.
[ERROR] Failed to execute goal org.apache.maven.plugins:maven-failsafe-plugin:2.18.1:verify
(verify) on project hive-bridge: There are test failures.
[ERROR] 
[ERROR] Please refer to <https://builds.apache.org/job/Atlas-master-IntegrationTests/ws/addons/hive-bridge/target/failsafe-reports>
for the individual test results.
[ERROR] -> [Help 1]
[ERROR] 
[ERROR] To see the full stack trace of the errors, re-run Maven with the -e switch.
[ERROR] Re-run Maven using the -X switch to enable full debug logging.
[ERROR] 
[ERROR] For more information about the errors and possible solutions, please read the following
articles:
[ERROR] [Help 1] http://cwiki.apache.org/confluence/display/MAVEN/MojoFailureException
[ERROR] 
[ERROR] After correcting the problems, you can resume the build with the command
[ERROR]   mvn <goals> -rf :hive-bridge
Build step 'Execute shell' marked build as failure
[CHECKSTYLE] Collecting checkstyle analysis files...
[CHECKSTYLE] Searching for all files in <https://builds.apache.org/job/Atlas-master-IntegrationTests/ws/>
that match the pattern **/target/checkstyle-result.xml
[CHECKSTYLE] Parsing 29 files in <https://builds.apache.org/job/Atlas-master-IntegrationTests/ws/>
[CHECKSTYLE] Successfully parsed file <https://builds.apache.org/job/Atlas-master-IntegrationTests/ws/addons/hdfs-model/target/checkstyle-result.xml>
with 0 unique warnings and 0 duplicates.
[CHECKSTYLE] Successfully parsed file <https://builds.apache.org/job/Atlas-master-IntegrationTests/ws/addons/hive-bridge-shim/target/checkstyle-result.xml>
with 15 unique warnings and 0 duplicates.
[CHECKSTYLE] Successfully parsed file <https://builds.apache.org/job/Atlas-master-IntegrationTests/ws/authorization/target/checkstyle-result.xml>
with 684 unique warnings and 0 duplicates.
[CHECKSTYLE] Successfully parsed file <https://builds.apache.org/job/Atlas-master-IntegrationTests/ws/client/client-v1/target/checkstyle-result.xml>
with 1568 unique warnings and 0 duplicates.
[CHECKSTYLE] Successfully parsed file <https://builds.apache.org/job/Atlas-master-IntegrationTests/ws/client/client-v2/target/checkstyle-result.xml>
with 1927 unique warnings and 0 duplicates.
[CHECKSTYLE] Successfully parsed file <https://builds.apache.org/job/Atlas-master-IntegrationTests/ws/client/common/target/checkstyle-result.xml>
with 2415 unique warnings and 0 duplicates.
[CHECKSTYLE] Successfully parsed file <https://builds.apache.org/job/Atlas-master-IntegrationTests/ws/client/target/checkstyle-result.xml>
with 2415 unique warnings and 0 duplicates.
[CHECKSTYLE] Successfully parsed file <https://builds.apache.org/job/Atlas-master-IntegrationTests/ws/common/target/checkstyle-result.xml>
with 3463 unique warnings and 0 duplicates.
[CHECKSTYLE] Successfully parsed file <https://builds.apache.org/job/Atlas-master-IntegrationTests/ws/dashboardv2/target/checkstyle-result.xml>
with 3463 unique warnings and 0 duplicates.
[CHECKSTYLE] Successfully parsed file <https://builds.apache.org/job/Atlas-master-IntegrationTests/ws/docs/target/checkstyle-result.xml>
with 3463 unique warnings and 0 duplicates.
[CHECKSTYLE] Successfully parsed file <https://builds.apache.org/job/Atlas-master-IntegrationTests/ws/graphdb/api/target/checkstyle-result.xml>
with 3762 unique warnings and 0 duplicates.
[CHECKSTYLE] Successfully parsed file <https://builds.apache.org/job/Atlas-master-IntegrationTests/ws/graphdb/common/target/checkstyle-result.xml>
with 3988 unique warnings and 0 duplicates.
[CHECKSTYLE] Successfully parsed file <https://builds.apache.org/job/Atlas-master-IntegrationTests/ws/graphdb/graphdb-impls/target/checkstyle-result.xml>
with 3988 unique warnings and 0 duplicates.
[CHECKSTYLE] Successfully parsed file <https://builds.apache.org/job/Atlas-master-IntegrationTests/ws/graphdb/janus/target/checkstyle-result.xml>
with 5528 unique warnings and 0 duplicates.
[CHECKSTYLE] Successfully parsed file <https://builds.apache.org/job/Atlas-master-IntegrationTests/ws/graphdb/target/checkstyle-result.xml>
with 5528 unique warnings and 0 duplicates.
[CHECKSTYLE] Successfully parsed file <https://builds.apache.org/job/Atlas-master-IntegrationTests/ws/graphdb/titan0/target/checkstyle-result.xml>
with 8031 unique warnings and 0 duplicates.
[CHECKSTYLE] Successfully parsed file <https://builds.apache.org/job/Atlas-master-IntegrationTests/ws/intg/target/checkstyle-result.xml>
with 19736 unique warnings and 0 duplicates.
[CHECKSTYLE] Successfully parsed file <https://builds.apache.org/job/Atlas-master-IntegrationTests/ws/notification/target/checkstyle-result.xml>
with 20972 unique warnings and 0 duplicates.
[CHECKSTYLE] Successfully parsed file <https://builds.apache.org/job/Atlas-master-IntegrationTests/ws/om-fwk-ocf/target/checkstyle-result.xml>
with 26014 unique warnings and 0 duplicates.
[CHECKSTYLE] Successfully parsed file <https://builds.apache.org/job/Atlas-master-IntegrationTests/ws/omag-api/target/checkstyle-result.xml>
with 27360 unique warnings and 0 duplicates.
[CHECKSTYLE] Successfully parsed file <https://builds.apache.org/job/Atlas-master-IntegrationTests/ws/omrs/target/checkstyle-result.xml>
with 64989 unique warnings and 0 duplicates.
[CHECKSTYLE] Successfully parsed file <https://builds.apache.org/job/Atlas-master-IntegrationTests/ws/plugin-classloader/target/checkstyle-result.xml>
with 65102 unique warnings and 0 duplicates.
[CHECKSTYLE] Successfully parsed file <https://builds.apache.org/job/Atlas-master-IntegrationTests/ws/repository/target/checkstyle-result.xml>
with 84698 unique warnings and 0 duplicates.
[CHECKSTYLE] Successfully parsed file <https://builds.apache.org/job/Atlas-master-IntegrationTests/ws/server-api/target/checkstyle-result.xml>
with 84849 unique warnings and 0 duplicates.
[CHECKSTYLE] Successfully parsed file <https://builds.apache.org/job/Atlas-master-IntegrationTests/ws/shaded/hbase-client-shaded/target/checkstyle-result.xml>
with 84849 unique warnings and 0 duplicates.
[CHECKSTYLE] Successfully parsed file <https://builds.apache.org/job/Atlas-master-IntegrationTests/ws/shaded/hbase-server-shaded/target/checkstyle-result.xml>
with 84849 unique warnings and 0 duplicates.
[CHECKSTYLE] Successfully parsed file <https://builds.apache.org/job/Atlas-master-IntegrationTests/ws/target/checkstyle-result.xml>
with 84849 unique warnings and 0 duplicates.
[CHECKSTYLE] Successfully parsed file <https://builds.apache.org/job/Atlas-master-IntegrationTests/ws/test-tools/target/checkstyle-result.xml>
with 84887 unique warnings and 0 duplicates.
[CHECKSTYLE] Successfully parsed file <https://builds.apache.org/job/Atlas-master-IntegrationTests/ws/webapp/target/checkstyle-result.xml>
with 93138 unique warnings and 0 duplicates.
<Git Blamer> Using GitBlamer to create author and commit information for all warnings.
<Git Blamer> GIT_COMMIT=54c31d5c8e601757e19e26d3c30f2414532e2f8f, workspace=<https://builds.apache.org/job/Atlas-master-IntegrationTests/ws/>
 > git rev-parse 54c31d5c8e601757e19e26d3c30f2414532e2f8f^{commit} # timeout=10
[CHECKSTYLE] Computing warning deltas based on reference build #950
[FINDBUGS] Collecting findbugs analysis files...
[FINDBUGS] Searching for all files in <https://builds.apache.org/job/Atlas-master-IntegrationTests/ws/>
that match the pattern **/target/findbugs.xml
[FINDBUGS] Parsing 20 files in <https://builds.apache.org/job/Atlas-master-IntegrationTests/ws/>
[FINDBUGS] Successfully parsed file <https://builds.apache.org/job/Atlas-master-IntegrationTests/ws/addons/hive-bridge-shim/target/findbugs.xml>
with 0 unique warnings and 0 duplicates.
[FINDBUGS] Successfully parsed file <https://builds.apache.org/job/Atlas-master-IntegrationTests/ws/authorization/target/findbugs.xml>
with 0 unique warnings and 0 duplicates.
[FINDBUGS] Successfully parsed file <https://builds.apache.org/job/Atlas-master-IntegrationTests/ws/client/client-v1/target/findbugs.xml>
with 0 unique warnings and 0 duplicates.
[FINDBUGS] Successfully parsed file <https://builds.apache.org/job/Atlas-master-IntegrationTests/ws/client/client-v2/target/findbugs.xml>
with 0 unique warnings and 0 duplicates.
[FINDBUGS] Successfully parsed file <https://builds.apache.org/job/Atlas-master-IntegrationTests/ws/client/common/target/findbugs.xml>
with 0 unique warnings and 0 duplicates.
[FINDBUGS] Successfully parsed file <https://builds.apache.org/job/Atlas-master-IntegrationTests/ws/common/target/findbugs.xml>
with 0 unique warnings and 0 duplicates.
[FINDBUGS] Successfully parsed file <https://builds.apache.org/job/Atlas-master-IntegrationTests/ws/graphdb/api/target/findbugs.xml>
with 0 unique warnings and 0 duplicates.
[FINDBUGS] Successfully parsed file <https://builds.apache.org/job/Atlas-master-IntegrationTests/ws/graphdb/common/target/findbugs.xml>
with 0 unique warnings and 0 duplicates.
[FINDBUGS] Successfully parsed file <https://builds.apache.org/job/Atlas-master-IntegrationTests/ws/graphdb/janus/target/findbugs.xml>
with 0 unique warnings and 0 duplicates.
[FINDBUGS] Successfully parsed file <https://builds.apache.org/job/Atlas-master-IntegrationTests/ws/graphdb/titan0/target/findbugs.xml>
with 0 unique warnings and 0 duplicates.
[FINDBUGS] Successfully parsed file <https://builds.apache.org/job/Atlas-master-IntegrationTests/ws/intg/target/findbugs.xml>
with 0 unique warnings and 0 duplicates.
[FINDBUGS] Successfully parsed file <https://builds.apache.org/job/Atlas-master-IntegrationTests/ws/notification/target/findbugs.xml>
with 0 unique warnings and 0 duplicates.
[FINDBUGS] Successfully parsed file <https://builds.apache.org/job/Atlas-master-IntegrationTests/ws/om-fwk-ocf/target/findbugs.xml>
with 0 unique warnings and 0 duplicates.
[FINDBUGS] Successfully parsed file <https://builds.apache.org/job/Atlas-master-IntegrationTests/ws/omag-api/target/findbugs.xml>
with 0 unique warnings and 0 duplicates.
[FINDBUGS] Successfully parsed file <https://builds.apache.org/job/Atlas-master-IntegrationTests/ws/omrs/target/findbugs.xml>
with 0 unique warnings and 0 duplicates.
[FINDBUGS] Successfully parsed file <https://builds.apache.org/job/Atlas-master-IntegrationTests/ws/plugin-classloader/target/findbugs.xml>
with 0 unique warnings and 0 duplicates.
[FINDBUGS] Successfully parsed file <https://builds.apache.org/job/Atlas-master-IntegrationTests/ws/repository/target/findbugs.xml>
with 0 unique warnings and 0 duplicates.
[FINDBUGS] Successfully parsed file <https://builds.apache.org/job/Atlas-master-IntegrationTests/ws/server-api/target/findbugs.xml>
with 0 unique warnings and 0 duplicates.
[FINDBUGS] Successfully parsed file <https://builds.apache.org/job/Atlas-master-IntegrationTests/ws/test-tools/target/findbugs.xml>
with 0 unique warnings and 0 duplicates.
[FINDBUGS] Successfully parsed file <https://builds.apache.org/job/Atlas-master-IntegrationTests/ws/webapp/target/findbugs.xml>
with 0 unique warnings and 0 duplicates.
<Git Blamer> Using GitBlamer to create author and commit information for all warnings.
<Git Blamer> GIT_COMMIT=54c31d5c8e601757e19e26d3c30f2414532e2f8f, workspace=<https://builds.apache.org/job/Atlas-master-IntegrationTests/ws/>
[FINDBUGS] Computing warning deltas based on reference build #950
Archiving artifacts
[Fast Archiver] Compressed 167.77 MB of artifacts by 65.8% relative to #950
TestNG Reports Processing: START
Looking for TestNG results report in workspace using pattern: **/target/surefire-reports/testng-results.xml,**/target/failsafe-reports/testng-results.xml
Saving reports...
Processing '/x1/jenkins/jenkins-home/jobs/Atlas-master-IntegrationTests/builds/1017/testng/testng-results-1.xml'
Processing '/x1/jenkins/jenkins-home/jobs/Atlas-master-IntegrationTests/builds/1017/testng/testng-results.xml'
0.581395% of tests failed, which exceeded threshold of 0%. Marking build as UNSTABLE
TestNG Reports Processing: FINISH

Mime
View raw message