atlas-dev mailing list archives

Site index · List index
Message view « Date » · « Thread »
Top « Date » · « Thread »
From Apache Jenkins Server <jenk...@builds.apache.org>
Subject Build failed in Jenkins: Atlas-master-IntegrationTests #951
Date Thu, 05 Apr 2018 01:42:59 GMT
See <https://builds.apache.org/job/Atlas-master-IntegrationTests/951/display/redirect?page=changes>

Changes:

[madhan] ATLAS-2460: implementation of migration-import to migrate Atlas data in

------------------------------------------
[...truncated 241.62 KB...]
[INFO] Exclude: debian/**
[INFO] Exclude: .svn/**
[INFO] Exclude: .git/**
[INFO] Exclude: .gitignore
[INFO] Exclude: **/.idea/**
[INFO] Exclude: **/*.twiki
[INFO] Exclude: **/*.iml
[INFO] Exclude: **/*.json
[INFO] Exclude: **/*.log
[INFO] Exclude: **/target/**
[INFO] Exclude: **/target*/**
[INFO] Exclude: **/build/**
[INFO] Exclude: **/*.patch
[INFO] Exclude: derby.log
[INFO] Exclude: **/logs/**
[INFO] Exclude: **/.classpath
[INFO] Exclude: **/.project
[INFO] Exclude: **/.settings/**
[INFO] Exclude: **/test-output/**
[INFO] Exclude: **/mock/**
[INFO] Exclude: **/data/**
[INFO] Exclude: **/maven-eclipse.xml
[INFO] Exclude: **/.externalToolBuilders/**
[INFO] Exclude: **/build.log
[INFO] Exclude: **/.bowerrc
[INFO] Exclude: *.json
[INFO] Exclude: **/overlays/**
[INFO] Exclude: dev-support/**
[INFO] Exclude: **/users-credentials.properties
[INFO] Exclude: **/public/css/animate.min.css
[INFO] Exclude: **/public/css/bootstrap-sidebar.css
[INFO] Exclude: **/public/js/external_lib/**
[INFO] Exclude: **/node_modules/**
[INFO] Exclude: **/public/js/libs/**
[INFO] Exclude: **/atlas.data/**
[INFO] Exclude: **/${sys:atlas.data}/**
[INFO] Exclude: **/policy-store.txt
[INFO] Exclude: **/*rebel*.xml
[INFO] Exclude: **/*rebel*.xml.bak
[INFO] Exclude: **/test/resources/**
[INFO] 155 resources included (use -debug for more details)
[INFO] Rat check: Summary over all files. Unapproved: 0, unknown: 0, generated: 0, approved:
155 licenses.
[INFO] 
[INFO] --- maven-resources-plugin:2.7:copy-resources (copy-resources-solr) @ atlas-repository
---
[INFO] Using 'UTF-8' encoding to copy filtered resources.
[INFO] Copying 9 resources
[INFO] 
[INFO] --- maven-remote-resources-plugin:1.5:process (default) @ atlas-repository ---
[INFO] 
[INFO] --- maven-resources-plugin:2.7:resources (default-resources) @ atlas-repository ---
[INFO] Using 'UTF-8' encoding to copy filtered resources.
[INFO] skip non existing resourceDirectory <https://builds.apache.org/job/Atlas-master-IntegrationTests/ws/repository/src/main/resources>
[INFO] Copying 2 resources to META-INF
[INFO] Copying 3 resources
[INFO] 
[INFO] --- maven-compiler-plugin:3.7.0:compile (default-compile) @ atlas-repository ---
[INFO] Changes detected - recompiling the module!
[INFO] Compiling 121 source files to <https://builds.apache.org/job/Atlas-master-IntegrationTests/ws/repository/target/classes>
[INFO] <https://builds.apache.org/job/Atlas-master-IntegrationTests/ws/repository/src/main/java/org/apache/atlas/repository/converters/AtlasInstanceConverter.java>:
Some input files use or override a deprecated API.
[INFO] <https://builds.apache.org/job/Atlas-master-IntegrationTests/ws/repository/src/main/java/org/apache/atlas/repository/converters/AtlasInstanceConverter.java>:
Recompile with -Xlint:deprecation for details.
[INFO] <https://builds.apache.org/job/Atlas-master-IntegrationTests/ws/repository/src/main/java/org/apache/atlas/repository/impexp/MigrationProgressService.java>:
Some input files use unchecked or unsafe operations.
[INFO] <https://builds.apache.org/job/Atlas-master-IntegrationTests/ws/repository/src/main/java/org/apache/atlas/repository/impexp/MigrationProgressService.java>:
Recompile with -Xlint:unchecked for details.
[INFO] 
[INFO] --- maven-resources-plugin:2.7:testResources (default-testResources) @ atlas-repository
---
[INFO] Using 'UTF-8' encoding to copy filtered resources.
[INFO] Copying 26 resources
[INFO] Copying 3 resources
[INFO] 
[INFO] --- maven-compiler-plugin:3.7.0:testCompile (default-testCompile) @ atlas-repository
---
[INFO] Changes detected - recompiling the module!
[INFO] Compiling 37 source files to <https://builds.apache.org/job/Atlas-master-IntegrationTests/ws/repository/target/test-classes>
[INFO] <https://builds.apache.org/job/Atlas-master-IntegrationTests/ws/repository/src/test/java/org/apache/atlas/query/BasicTestSetup.java>:
<https://builds.apache.org/job/Atlas-master-IntegrationTests/ws/repository/src/test/java/org/apache/atlas/query/BasicTestSetup.java>
uses or overrides a deprecated API.
[INFO] <https://builds.apache.org/job/Atlas-master-IntegrationTests/ws/repository/src/test/java/org/apache/atlas/query/BasicTestSetup.java>:
Recompile with -Xlint:deprecation for details.
[INFO] <https://builds.apache.org/job/Atlas-master-IntegrationTests/ws/repository/src/test/java/org/apache/atlas/repository/migration/MigrationBaseAsserts.java>:
Some input files use unchecked or unsafe operations.
[INFO] <https://builds.apache.org/job/Atlas-master-IntegrationTests/ws/repository/src/test/java/org/apache/atlas/repository/migration/MigrationBaseAsserts.java>:
Recompile with -Xlint:unchecked for details.
[INFO] 
[INFO] --- maven-surefire-plugin:2.18.1:test (default-test) @ atlas-repository ---
[INFO] Tests are skipped.
[INFO] 
[INFO] --- maven-jar-plugin:2.4:jar (default-jar) @ atlas-repository ---
[INFO] Building jar: <https://builds.apache.org/job/Atlas-master-IntegrationTests/ws/repository/target/atlas-repository-1.0.0-SNAPSHOT.jar>
[INFO] 
[INFO] --- maven-jar-plugin:2.4:test-jar (default) @ atlas-repository ---
[INFO] Building jar: <https://builds.apache.org/job/Atlas-master-IntegrationTests/ws/repository/target/atlas-repository-1.0.0-SNAPSHOT-tests.jar>
[INFO] 
[INFO] --- maven-site-plugin:3.7:attach-descriptor (attach-descriptor) @ atlas-repository
---
[INFO] Skipping because packaging 'jar' is not pom.
[INFO] 
[INFO] --- maven-failsafe-plugin:2.18.1:integration-test (integration-test) @ atlas-repository
---
[WARNING] useSystemClassloader setting has no effect when not forking
[INFO] Failsafe report directory: <https://builds.apache.org/job/Atlas-master-IntegrationTests/ws/repository/target/failsafe-reports>
Running TestSuite
Tests run: 2, Failures: 1, Errors: 0, Skipped: 0, Time elapsed: 57.71 sec <<< FAILURE!
- in TestSuite
migrateFromEarlierVersionWithTag(org.apache.atlas.repository.migration.HiveStocksIT)  Time
elapsed: 1.909 sec  <<< FAILURE!
org.apache.atlas.exception.AtlasBaseException: java.lang.IllegalArgumentException: Undefined
type used in query: __typeName
	at org.janusgraph.graphdb.query.QueryUtil.getType(QueryUtil.java:63)
	at org.janusgraph.graphdb.query.QueryUtil.constraints2QNF(QueryUtil.java:152)
	at org.janusgraph.graphdb.query.graph.GraphCentricQueryBuilder.constructQueryWithoutProfile(GraphCentricQueryBuilder.java:212)
	at org.janusgraph.graphdb.query.graph.GraphCentricQueryBuilder.constructQuery(GraphCentricQueryBuilder.java:201)
	at org.janusgraph.graphdb.query.graph.GraphCentricQueryBuilder.vertices(GraphCentricQueryBuilder.java:164)
	at org.janusgraph.graphdb.tinkerpop.optimize.JanusGraphStep.lambda$new$0(JanusGraphStep.java:69)
	at org.apache.tinkerpop.gremlin.process.traversal.step.map.GraphStep.processNextStart(GraphStep.java:139)
	at org.apache.tinkerpop.gremlin.process.traversal.step.util.AbstractStep.hasNext(AbstractStep.java:143)
	at org.apache.tinkerpop.gremlin.process.traversal.util.DefaultTraversal.hasNext(DefaultTraversal.java:192)
	at org.apache.atlas.repository.graphdb.janus.migration.ReaderStatusManager.fetchUsingTypeName(ReaderStatusManager.java:96)
	at org.apache.atlas.repository.graphdb.janus.migration.ReaderStatusManager.init(ReaderStatusManager.java:54)
	at org.apache.atlas.repository.graphdb.janus.migration.ReaderStatusManager.<init>(ReaderStatusManager.java:50)
	at org.apache.atlas.repository.graphdb.janus.migration.AtlasGraphSONReader.initStatusManager(AtlasGraphSONReader.java:123)
	at org.apache.atlas.repository.graphdb.janus.migration.AtlasGraphSONReader.readGraph(AtlasGraphSONReader.java:73)
	at org.apache.atlas.repository.graphdb.janus.AtlasJanusGraphDatabase.loadLegacyGraphSON(AtlasJanusGraphDatabase.java:251)
	at org.apache.atlas.repository.graphdb.janus.AtlasJanusGraph.loadLegacyGraphSON(AtlasJanusGraph.java:471)
	at org.apache.atlas.repository.store.graph.v1.AtlasTypeDefGraphStoreV1.loadLegacyData(AtlasTypeDefGraphStoreV1.java:115)
	at org.apache.atlas.repository.migration.HiveStocksIT.migrateFromEarlierVersionWithTag(HiveStocksIT.java:79)


Results :

Failed tests: 
  HiveStocksIT.migrateFromEarlierVersionWithTag:79 » AtlasBase java.lang.Illegal...

Tests run: 2, Failures: 1, Errors: 0, Skipped: 0

[INFO] 
[INFO] --- maven-source-plugin:2.4:jar-no-fork (attach-sources) @ atlas-repository ---
[INFO] Building jar: <https://builds.apache.org/job/Atlas-master-IntegrationTests/ws/repository/target/atlas-repository-1.0.0-SNAPSHOT-sources.jar>
[INFO] 
[INFO] --- maven-source-plugin:2.4:test-jar-no-fork (attach-sources) @ atlas-repository ---
[INFO] Building jar: <https://builds.apache.org/job/Atlas-master-IntegrationTests/ws/repository/target/atlas-repository-1.0.0-SNAPSHOT-test-sources.jar>
[INFO] 
[INFO] --- maven-failsafe-plugin:2.18.1:verify (verify) @ atlas-repository ---
[INFO] Failsafe report directory: <https://builds.apache.org/job/Atlas-master-IntegrationTests/ws/repository/target/failsafe-reports>
[INFO] ------------------------------------------------------------------------
[INFO] Reactor Summary:
[INFO] 
[INFO] Apache Atlas Server Build Tools .................... SUCCESS [  0.603 s]
[INFO] apache-atlas ....................................... SUCCESS [  3.854 s]
[INFO] Apache Atlas Test Utility Tools .................... SUCCESS [  9.011 s]
[INFO] Open Connector Framework (OCF) ..................... SUCCESS [  8.870 s]
[INFO] Apache Atlas Integration ........................... SUCCESS [ 17.895 s]
[INFO] Apache Atlas Common ................................ SUCCESS [  8.088 s]
[INFO] Apache Atlas Client ................................ SUCCESS [  0.556 s]
[INFO] atlas-client-common ................................ SUCCESS [  6.288 s]
[INFO] atlas-client-v1 .................................... SUCCESS [  6.448 s]
[INFO] Apache Atlas Server API ............................ SUCCESS [  5.256 s]
[INFO] Apache Atlas Notification .......................... SUCCESS [  8.111 s]
[INFO] atlas-client-v2 .................................... SUCCESS [  5.452 s]
[INFO] Apache Atlas Graph Database Projects ............... SUCCESS [  0.412 s]
[INFO] Apache Atlas Graph Database API .................... SUCCESS [  4.692 s]
[INFO] Graph Database Common Code ......................... SUCCESS [  4.900 s]
[INFO] Apache Atlas JanusGraph DB Impl .................... SUCCESS [ 11.547 s]
[INFO] Apache Atlas Graph Database Implementation Dependencies SUCCESS [  1.919 s]
[INFO] Shaded version of Apache hbase client .............. SUCCESS [  7.425 s]
[INFO] Apache Atlas Titan 0.5.4 Graph DB Impl ............. SUCCESS [ 35.191 s]
[INFO] Shaded version of Apache hbase server .............. SUCCESS [ 18.843 s]
[INFO] Apache Atlas Authorization ......................... SUCCESS [  6.166 s]
[INFO] Apache Atlas Repository ............................ FAILURE [01:04 min]
[INFO] Apache Atlas UI .................................... SKIPPED
[INFO] Apache Atlas Web Application ....................... SKIPPED
[INFO] Apache Atlas Documentation ......................... SKIPPED
[INFO] Apache Atlas FileSystem Model ...................... SKIPPED
[INFO] Apache Atlas Plugin Classloader .................... SKIPPED
[INFO] Apache Atlas Hive Bridge Shim ...................... SKIPPED
[INFO] Apache Atlas Hive Bridge ........................... SKIPPED
[INFO] Apache Atlas Falcon Bridge Shim .................... SKIPPED
[INFO] Apache Atlas Falcon Bridge ......................... SKIPPED
[INFO] Apache Atlas Sqoop Bridge Shim ..................... SKIPPED
[INFO] Apache Atlas Sqoop Bridge .......................... SKIPPED
[INFO] Apache Atlas Storm Bridge Shim ..................... SKIPPED
[INFO] Apache Atlas Storm Bridge .......................... SKIPPED
[INFO] Apache Atlas Hbase Bridge Shim ..................... SKIPPED
[INFO] Apache Atlas Hbase Bridge .......................... SKIPPED
[INFO] Apache Atlas Migration Exporter .................... SKIPPED
[INFO] Apache Atlas Distribution .......................... SKIPPED
[INFO] ------------------------------------------------------------------------
[INFO] BUILD FAILURE
[INFO] ------------------------------------------------------------------------
[INFO] Total time: 03:57 min
[INFO] Finished at: 2018-04-05T01:37:18Z
[INFO] Final Memory: 179M/3084M
[INFO] ------------------------------------------------------------------------
[ERROR] Failed to execute goal org.apache.maven.plugins:maven-failsafe-plugin:2.18.1:verify
(verify) on project atlas-repository: There are test failures.
[ERROR] 
[ERROR] Please refer to <https://builds.apache.org/job/Atlas-master-IntegrationTests/ws/repository/target/failsafe-reports>
for the individual test results.
[ERROR] -> [Help 1]
[ERROR] 
[ERROR] To see the full stack trace of the errors, re-run Maven with the -e switch.
[ERROR] Re-run Maven using the -X switch to enable full debug logging.
[ERROR] 
[ERROR] For more information about the errors and possible solutions, please read the following
articles:
[ERROR] [Help 1] http://cwiki.apache.org/confluence/display/MAVEN/MojoFailureException
[ERROR] 
[ERROR] After correcting the problems, you can resume the build with the command
[ERROR]   mvn <goals> -rf :atlas-repository
Build step 'Execute shell' marked build as failure
[CHECKSTYLE] Collecting checkstyle analysis files...
[CHECKSTYLE] Searching for all files in <https://builds.apache.org/job/Atlas-master-IntegrationTests/ws/>
that match the pattern **/target/checkstyle-result.xml
[CHECKSTYLE] Parsing 20 files in <https://builds.apache.org/job/Atlas-master-IntegrationTests/ws/>
[CHECKSTYLE] Successfully parsed file <https://builds.apache.org/job/Atlas-master-IntegrationTests/ws/authorization/target/checkstyle-result.xml>
with 669 unique warnings and 0 duplicates.
[CHECKSTYLE] Successfully parsed file <https://builds.apache.org/job/Atlas-master-IntegrationTests/ws/client/client-v1/target/checkstyle-result.xml>
with 1553 unique warnings and 0 duplicates.
[CHECKSTYLE] Successfully parsed file <https://builds.apache.org/job/Atlas-master-IntegrationTests/ws/client/client-v2/target/checkstyle-result.xml>
with 1912 unique warnings and 0 duplicates.
[CHECKSTYLE] Successfully parsed file <https://builds.apache.org/job/Atlas-master-IntegrationTests/ws/client/common/target/checkstyle-result.xml>
with 2400 unique warnings and 0 duplicates.
[CHECKSTYLE] Successfully parsed file <https://builds.apache.org/job/Atlas-master-IntegrationTests/ws/client/target/checkstyle-result.xml>
with 2400 unique warnings and 0 duplicates.
[CHECKSTYLE] Successfully parsed file <https://builds.apache.org/job/Atlas-master-IntegrationTests/ws/common/target/checkstyle-result.xml>
with 3448 unique warnings and 0 duplicates.
[CHECKSTYLE] Successfully parsed file <https://builds.apache.org/job/Atlas-master-IntegrationTests/ws/graphdb/api/target/checkstyle-result.xml>
with 3742 unique warnings and 0 duplicates.
[CHECKSTYLE] Successfully parsed file <https://builds.apache.org/job/Atlas-master-IntegrationTests/ws/graphdb/common/target/checkstyle-result.xml>
with 3951 unique warnings and 0 duplicates.
[CHECKSTYLE] Successfully parsed file <https://builds.apache.org/job/Atlas-master-IntegrationTests/ws/graphdb/graphdb-impls/target/checkstyle-result.xml>
with 3951 unique warnings and 0 duplicates.
[CHECKSTYLE] Successfully parsed file <https://builds.apache.org/job/Atlas-master-IntegrationTests/ws/graphdb/janus/target/checkstyle-result.xml>
with 5643 unique warnings and 0 duplicates.
[CHECKSTYLE] Successfully parsed file <https://builds.apache.org/job/Atlas-master-IntegrationTests/ws/graphdb/target/checkstyle-result.xml>
with 5643 unique warnings and 0 duplicates.
[CHECKSTYLE] Successfully parsed file <https://builds.apache.org/job/Atlas-master-IntegrationTests/ws/graphdb/titan0/target/checkstyle-result.xml>
with 8144 unique warnings and 0 duplicates.
[CHECKSTYLE] Successfully parsed file <https://builds.apache.org/job/Atlas-master-IntegrationTests/ws/intg/target/checkstyle-result.xml>
with 19155 unique warnings and 0 duplicates.
[CHECKSTYLE] Successfully parsed file <https://builds.apache.org/job/Atlas-master-IntegrationTests/ws/notification/target/checkstyle-result.xml>
with 20391 unique warnings and 0 duplicates.
[CHECKSTYLE] Successfully parsed file <https://builds.apache.org/job/Atlas-master-IntegrationTests/ws/om-fwk-ocf/target/checkstyle-result.xml>
with 25121 unique warnings and 0 duplicates.
[CHECKSTYLE] Successfully parsed file <https://builds.apache.org/job/Atlas-master-IntegrationTests/ws/server-api/target/checkstyle-result.xml>
with 25272 unique warnings and 0 duplicates.
[CHECKSTYLE] Successfully parsed file <https://builds.apache.org/job/Atlas-master-IntegrationTests/ws/shaded/hbase-client-shaded/target/checkstyle-result.xml>
with 25272 unique warnings and 0 duplicates.
[CHECKSTYLE] Successfully parsed file <https://builds.apache.org/job/Atlas-master-IntegrationTests/ws/shaded/hbase-server-shaded/target/checkstyle-result.xml>
with 25272 unique warnings and 0 duplicates.
[CHECKSTYLE] Successfully parsed file <https://builds.apache.org/job/Atlas-master-IntegrationTests/ws/target/checkstyle-result.xml>
with 25272 unique warnings and 0 duplicates.
[CHECKSTYLE] Successfully parsed file <https://builds.apache.org/job/Atlas-master-IntegrationTests/ws/test-tools/target/checkstyle-result.xml>
with 25310 unique warnings and 0 duplicates.
<Git Blamer> Using GitBlamer to create author and commit information for all warnings.
<Git Blamer> GIT_COMMIT=3ded3ee2f96d4bd44755792436e6c43865821e87, workspace=<https://builds.apache.org/job/Atlas-master-IntegrationTests/ws/>
 > git rev-parse 3ded3ee2f96d4bd44755792436e6c43865821e87^{commit} # timeout=10
[CHECKSTYLE] Computing warning deltas based on reference build #950
[FINDBUGS] Collecting findbugs analysis files...
[FINDBUGS] Searching for all files in <https://builds.apache.org/job/Atlas-master-IntegrationTests/ws/>
that match the pattern **/target/findbugs.xml
[FINDBUGS] Parsing 14 files in <https://builds.apache.org/job/Atlas-master-IntegrationTests/ws/>
[FINDBUGS] Successfully parsed file <https://builds.apache.org/job/Atlas-master-IntegrationTests/ws/authorization/target/findbugs.xml>
with 0 unique warnings and 0 duplicates.
[FINDBUGS] Successfully parsed file <https://builds.apache.org/job/Atlas-master-IntegrationTests/ws/client/client-v1/target/findbugs.xml>
with 0 unique warnings and 0 duplicates.
[FINDBUGS] Successfully parsed file <https://builds.apache.org/job/Atlas-master-IntegrationTests/ws/client/client-v2/target/findbugs.xml>
with 0 unique warnings and 0 duplicates.
[FINDBUGS] Successfully parsed file <https://builds.apache.org/job/Atlas-master-IntegrationTests/ws/client/common/target/findbugs.xml>
with 0 unique warnings and 0 duplicates.
[FINDBUGS] Successfully parsed file <https://builds.apache.org/job/Atlas-master-IntegrationTests/ws/common/target/findbugs.xml>
with 0 unique warnings and 0 duplicates.
[FINDBUGS] Successfully parsed file <https://builds.apache.org/job/Atlas-master-IntegrationTests/ws/graphdb/api/target/findbugs.xml>
with 0 unique warnings and 0 duplicates.
[FINDBUGS] Successfully parsed file <https://builds.apache.org/job/Atlas-master-IntegrationTests/ws/graphdb/common/target/findbugs.xml>
with 0 unique warnings and 0 duplicates.
[FINDBUGS] Successfully parsed file <https://builds.apache.org/job/Atlas-master-IntegrationTests/ws/graphdb/janus/target/findbugs.xml>
with 0 unique warnings and 0 duplicates.
[FINDBUGS] Successfully parsed file <https://builds.apache.org/job/Atlas-master-IntegrationTests/ws/graphdb/titan0/target/findbugs.xml>
with 0 unique warnings and 0 duplicates.
[FINDBUGS] Successfully parsed file <https://builds.apache.org/job/Atlas-master-IntegrationTests/ws/intg/target/findbugs.xml>
with 0 unique warnings and 0 duplicates.
[FINDBUGS] Successfully parsed file <https://builds.apache.org/job/Atlas-master-IntegrationTests/ws/notification/target/findbugs.xml>
with 0 unique warnings and 0 duplicates.
[FINDBUGS] Successfully parsed file <https://builds.apache.org/job/Atlas-master-IntegrationTests/ws/om-fwk-ocf/target/findbugs.xml>
with 0 unique warnings and 0 duplicates.
[FINDBUGS] Successfully parsed file <https://builds.apache.org/job/Atlas-master-IntegrationTests/ws/server-api/target/findbugs.xml>
with 0 unique warnings and 0 duplicates.
[FINDBUGS] Successfully parsed file <https://builds.apache.org/job/Atlas-master-IntegrationTests/ws/test-tools/target/findbugs.xml>
with 0 unique warnings and 0 duplicates.
<Git Blamer> Using GitBlamer to create author and commit information for all warnings.
<Git Blamer> GIT_COMMIT=3ded3ee2f96d4bd44755792436e6c43865821e87, workspace=<https://builds.apache.org/job/Atlas-master-IntegrationTests/ws/>
[FINDBUGS] Computing warning deltas based on reference build #950
Archiving artifacts
[Fast Archiver] Compressed 197.61 KB of artifacts by 32.4% relative to #950
TestNG Reports Processing: START
Looking for TestNG results report in workspace using pattern: **/target/surefire-reports/testng-results.xml,**/target/failsafe-reports/testng-results.xml
Saving reports...
Processing '/x1/jenkins/jenkins-home/jobs/Atlas-master-IntegrationTests/builds/951/testng/testng-results.xml'
50.000000% of tests failed, which exceeded threshold of 0%. Marking build as UNSTABLE
TestNG Reports Processing: FINISH

Mime
View raw message