atlas-dev mailing list archives

Site index · List index
Message view « Date » · « Thread »
Top « Date » · « Thread »
From Apache Jenkins Server <jenk...@builds.apache.org>
Subject Build failed in Jenkins: Atlas-master-IntegrationTests #967
Date Fri, 06 Apr 2018 09:00:38 GMT
See <https://builds.apache.org/job/Atlas-master-IntegrationTests/967/display/redirect?page=changes>

Changes:

[david_radley] ATLAS-2122 OMAG Server Application and OMRS APIs

------------------------------------------
[...truncated 1.23 MB...]
127.0.0.1 - - [06/Apr/2018:08:42:45 +0000] "GET //localhost:31000/api/atlas/types HTTP/1.1"
200 2601 "-" "Java/1.8.0_152"
127.0.0.1 - - [06/Apr/2018:08:42:45 +0000] "POST //localhost:31000/api/atlas/entities HTTP/1.1"
201 850 "-" "Java/1.8.0_152"
127.0.0.1 - - [06/Apr/2018:08:42:45 +0000] "POST //localhost:31000/api/atlas/entities HTTP/1.1"
201 1395 "-" "Java/1.8.0_152"
127.0.0.1 - - [06/Apr/2018:08:42:46 +0000] "POST //localhost:31000/api/atlas/entities HTTP/1.1"
201 1298 "-" "Java/1.8.0_152"
127.0.0.1 - - [06/Apr/2018:08:42:46 +0000] "POST //localhost:31000/api/atlas/entities HTTP/1.1"
201 1298 "-" "Java/1.8.0_152"
127.0.0.1 - - [06/Apr/2018:08:42:47 +0000] "POST //localhost:31000/api/atlas/entities HTTP/1.1"
201 1298 "-" "Java/1.8.0_152"
127.0.0.1 - - [06/Apr/2018:08:42:48 +0000] "POST //localhost:31000/api/atlas/entities HTTP/1.1"
201 861 "-" "Java/1.8.0_152"
127.0.0.1 - - [06/Apr/2018:08:42:48 +0000] "POST //localhost:31000/api/atlas/entities HTTP/1.1"
201 855 "-" "Java/1.8.0_152"
127.0.0.1 - - [06/Apr/2018:08:42:49 +0000] "POST //localhost:31000/api/atlas/entities HTTP/1.1"
201 1395 "-" "Java/1.8.0_152"
127.0.0.1 - - [06/Apr/2018:08:42:50 +0000] "POST //localhost:31000/api/atlas/entities HTTP/1.1"
201 1395 "-" "Java/1.8.0_152"
127.0.0.1 - - [06/Apr/2018:08:42:51 +0000] "POST //localhost:31000/api/atlas/entities HTTP/1.1"
201 2070 "-" "Java/1.8.0_152"
127.0.0.1 - - [06/Apr/2018:08:42:52 +0000] "POST //localhost:31000/api/atlas/entities HTTP/1.1"
201 1509 "-" "Java/1.8.0_152"
127.0.0.1 - - [06/Apr/2018:08:42:52 +0000] "POST //localhost:31000/api/atlas/entities HTTP/1.1"
201 1511 "-" "Java/1.8.0_152"
127.0.0.1 - - [06/Apr/2018:08:42:53 +0000] "POST //localhost:31000/api/atlas/entities HTTP/1.1"
201 1395 "-" "Java/1.8.0_152"
127.0.0.1 - - [06/Apr/2018:08:42:54 +0000] "POST //localhost:31000/api/atlas/entities HTTP/1.1"
201 2016 "-" "Java/1.8.0_152"
127.0.0.1 - - [06/Apr/2018:08:42:55 +0000] "POST //localhost:31000/api/atlas/entities HTTP/1.1"
201 1395 "-" "Java/1.8.0_152"
127.0.0.1 - - [06/Apr/2018:08:42:56 +0000] "POST //localhost:31000/api/atlas/entities HTTP/1.1"
201 1728 "-" "Java/1.8.0_152"
127.0.0.1 - - [06/Apr/2018:08:42:56 +0000] "GET //localhost:31000/api/atlas/discovery/search?query=from+DB_v1&limit=10&offset=0
HTTP/1.1" 200 1446 "-" "Java/1.8.0_152"
127.0.0.1 - - [06/Apr/2018:08:42:57 +0000] "GET //localhost:31000/api/atlas/discovery/search?query=DB_v1&limit=10&offset=0
HTTP/1.1" 200 1441 "-" "Java/1.8.0_152"
127.0.0.1 - - [06/Apr/2018:08:42:57 +0000] "GET //localhost:31000/api/atlas/discovery/search?query=DB_v1+where+name%3D%22Reporting%22&limit=10&offset=0
HTTP/1.1" 200 607 "-" "Java/1.8.0_152"
127.0.0.1 - - [06/Apr/2018:08:42:57 +0000] "GET //localhost:31000/api/atlas/discovery/search?query=DB_v1+where+DB_v1.name%3D%22Reporting%22&limit=10&offset=0
HTTP/1.1" 200 613 "-" "Java/1.8.0_152"
127.0.0.1 - - [06/Apr/2018:08:42:57 +0000] "GET //localhost:31000/api/atlas/discovery/search?query=DB_v1+name+%3D+%22Reporting%22&limit=10&offset=0
HTTP/1.1" 200 603 "-" "Java/1.8.0_152"
127.0.0.1 - - [06/Apr/2018:08:42:58 +0000] "GET //localhost:31000/api/atlas/discovery/search?query=DB_v1+DB_v1.name+%3D+%22Reporting%22&limit=10&offset=0
HTTP/1.1" 200 609 "-" "Java/1.8.0_152"
127.0.0.1 - - [06/Apr/2018:08:42:58 +0000] "GET //localhost:31000/api/atlas/discovery/search?query=DB_v1+where+name%3D%22Reporting%22+select+name,+owner&limit=10&offset=0
HTTP/1.1" 200 227 "-" "Java/1.8.0_152"
127.0.0.1 - - [06/Apr/2018:08:42:58 +0000] "GET //localhost:31000/api/atlas/discovery/search?query=DB_v1+where+DB_v1.name%3D%22Reporting%22+select+name,+owner&limit=10&offset=0
HTTP/1.1" 200 233 "-" "Java/1.8.0_152"
127.0.0.1 - - [06/Apr/2018:08:42:59 +0000] "GET //localhost:31000/api/atlas/discovery/search?query=DB_v1+has+name&limit=10&offset=0
HTTP/1.1" 200 1450 "-" "Java/1.8.0_152"
127.0.0.1 - - [06/Apr/2018:08:42:59 +0000] "GET //localhost:31000/api/atlas/discovery/search?query=DB_v1+where+DB_v1+has+name&limit=10&offset=0
HTTP/1.1" 200 1462 "-" "Java/1.8.0_152"
127.0.0.1 - - [06/Apr/2018:08:42:59 +0000] "GET //localhost:31000/api/atlas/discovery/search?query=DB_v1+is+JdbcAccess&limit=10&offset=0
HTTP/1.1" 200 161 "-" "Java/1.8.0_152"
127.0.0.1 - - [06/Apr/2018:08:42:59 +0000] "GET //localhost:31000/api/atlas/discovery/search?query=from+Table_v1&limit=10&offset=0
HTTP/1.1" 200 20537 "-" "Java/1.8.0_152"
127.0.0.1 - - [06/Apr/2018:08:43:00 +0000] "GET //localhost:31000/api/atlas/discovery/search?query=Table_v1&limit=10&offset=0
HTTP/1.1" 200 20532 "-" "Java/1.8.0_152"
127.0.0.1 - - [06/Apr/2018:08:43:00 +0000] "GET //localhost:31000/api/atlas/discovery/search?query=Table_v1+is+Dimension_v1&limit=10&offset=0
HTTP/1.1" 200 12590 "-" "Java/1.8.0_152"
127.0.0.1 - - [06/Apr/2018:08:43:00 +0000] "GET //localhost:31000/api/atlas/discovery/search?query=Column_v1+where+Column_v1+isa+PII_v1&limit=10&offset=0
HTTP/1.1" 200 2559 "-" "Java/1.8.0_152"
127.0.0.1 - - [06/Apr/2018:08:43:01 +0000] "GET //localhost:31000/api/atlas/discovery/search?query=View_v1+is+Dimension_v1&limit=10&offset=0
HTTP/1.1" 200 1562 "-" "Java/1.8.0_152"
127.0.0.1 - - [06/Apr/2018:08:43:01 +0000] "GET //localhost:31000/api/atlas/discovery/search?query=Column_v1+select+Column_v1.name&limit=10&offset=0
HTTP/1.1" 200 382 "-" "Java/1.8.0_152"
127.0.0.1 - - [06/Apr/2018:08:43:01 +0000] "GET //localhost:31000/api/atlas/discovery/search?query=Column_v1+select+name&limit=10&offset=0
HTTP/1.1" 200 286 "-" "Java/1.8.0_152"
127.0.0.1 - - [06/Apr/2018:08:43:02 +0000] "GET //localhost:31000/api/atlas/discovery/search?query=Column_v1+where+Column_v1.name%3D%22customer_id%22&limit=10&offset=0
HTTP/1.1" 200 1773 "-" "Java/1.8.0_152"
127.0.0.1 - - [06/Apr/2018:08:43:02 +0000] "GET //localhost:31000/api/atlas/discovery/search?query=from+Table_v1+select+Table_v1.name&limit=10&offset=0
HTTP/1.1" 200 462 "-" "Java/1.8.0_152"
127.0.0.1 - - [06/Apr/2018:08:43:02 +0000] "GET //localhost:31000/api/atlas/discovery/search?query=DB_v1+where+(name+%3D+%22Reporting%22)&limit=10&offset=0
HTTP/1.1" 200 611 "-" "Java/1.8.0_152"
127.0.0.1 - - [06/Apr/2018:08:43:02 +0000] "GET //localhost:31000/api/atlas/discovery/search?query=DB_v1+where+(name+%3D+%22Reporting%22)+select+name+as+_col_0,+owner+as+_col_1&limit=10&offset=0
HTTP/1.1" 200 254 "-" "Java/1.8.0_152"
127.0.0.1 - - [06/Apr/2018:08:43:03 +0000] "GET //localhost:31000/api/atlas/discovery/search?query=DB_v1+where+DB_v1+is+JdbcAccess_v1&limit=10&offset=0
HTTP/1.1" 200 176 "-" "Java/1.8.0_152"
127.0.0.1 - - [06/Apr/2018:08:43:03 +0000] "GET //localhost:31000/api/atlas/discovery/search?query=DB_v1+where+DB_v1+has+name&limit=10&offset=0
HTTP/1.1" 200 1462 "-" "Java/1.8.0_152"
127.0.0.1 - - [06/Apr/2018:08:43:03 +0000] "GET //localhost:31000/api/atlas/discovery/search?query=DB_v1+Table_v1&limit=10&offset=0
HTTP/1.1" 200 156 "-" "Java/1.8.0_152"
127.0.0.1 - - [06/Apr/2018:08:43:03 +0000] "GET //localhost:31000/api/atlas/discovery/search?query=DB_v1+where+DB_v1+has+name&limit=10&offset=0
HTTP/1.1" 200 1462 "-" "Java/1.8.0_152"
127.0.0.1 - - [06/Apr/2018:08:43:04 +0000] "GET //localhost:31000/api/atlas/discovery/search?query=DB_v1+as+db1+Table+where+(db1.name+%3D+%22Reporting%22)&limit=10&offset=0
HTTP/1.1" 200 193 "-" "Java/1.8.0_152"
127.0.0.1 - - [06/Apr/2018:08:43:04 +0000] "GET //localhost:31000/api/atlas/discovery/search?query=DB_v1+where+(name+%3D+%22Reporting%22)+select+name+as+_col_0,+(createTime+%2B+1)+as+_col_1+&limit=10&offset=0
HTTP/1.1" 200 1144 "-" "Java/1.8.0_152"
127.0.0.1 - - [06/Apr/2018:08:43:04 +0000] "GET //localhost:31000/api/atlas/discovery/search?query=Dimension_v1&limit=10&offset=0
HTTP/1.1" 200 15962 "-" "Java/1.8.0_152"
127.0.0.1 - - [06/Apr/2018:08:43:05 +0000] "GET //localhost:31000/api/atlas/discovery/search?query=JdbcAccess_v1&limit=10&offset=0
HTTP/1.1" 200 1552 "-" "Java/1.8.0_152"
127.0.0.1 - - [06/Apr/2018:08:43:05 +0000] "GET //localhost:31000/api/atlas/discovery/search?query=ETL_v1&limit=10&offset=0
HTTP/1.1" 200 11307 "-" "Java/1.8.0_152"
127.0.0.1 - - [06/Apr/2018:08:43:05 +0000] "GET //localhost:31000/api/atlas/discovery/search?query=Metric_v1&limit=10&offset=0
HTTP/1.1" 200 7919 "-" "Java/1.8.0_152"
127.0.0.1 - - [06/Apr/2018:08:43:06 +0000] "GET //localhost:31000/api/atlas/discovery/search?query=PII_v1&limit=10&offset=0
HTTP/1.1" 200 2529 "-" "Java/1.8.0_152"
127.0.0.1 - - [06/Apr/2018:08:43:06 +0000] "GET //localhost:31000/api/atlas/discovery/search?query=%60Log+Data_v1%60&limit=10&offset=0
HTTP/1.1" 200 7150 "-" "Java/1.8.0_152"
127.0.0.1 - - [06/Apr/2018:08:43:06 +0000] "GET //localhost:31000/api/atlas/discovery/search?query=Table_v1+where+name%3D%22sales_fact%22,+columns&limit=10&offset=0
HTTP/1.1" 200 1670 "-" "Java/1.8.0_152"
127.0.0.1 - - [06/Apr/2018:08:43:07 +0000] "GET //localhost:31000/api/atlas/discovery/search?query=Table_v1+where+name%3D%22sales_fact%22,+columns+as+column+select+column.name,+column.dataType,+column.comment&limit=10&offset=0
HTTP/1.1" 200 570 "-" "Java/1.8.0_152"
127.0.0.1 - - [06/Apr/2018:08:43:07 +0000] "GET //localhost:31000/api/atlas/discovery/search?query=from+DataSet&limit=10&offset=0
HTTP/1.1" 200 22701 "-" "Java/1.8.0_152"
127.0.0.1 - - [06/Apr/2018:08:43:07 +0000] "GET //localhost:31000/api/atlas/discovery/search?query=from+Process&limit=10&offset=0
HTTP/1.1" 200 9710 "-" "Java/1.8.0_152"
127.0.0.1 - - [06/Apr/2018:08:43:08 +0000] "GET //localhost:31000/api/atlas/entities?type=DB_v1&property=name&value=Sales
HTTP/1.1" 200 688 "-" "Java/1.8.0_152"
127.0.0.1 - - [06/Apr/2018:08:43:08 +0000] "GET //localhost:31000/api/atlas/entities?type=Table_v1&property=qualifiedName&value=sales_fact
HTTP/1.1" 200 4110 "-" "Java/1.8.0_152"
127.0.0.1 - - [06/Apr/2018:08:43:08 +0000] "GET //localhost:31000/api/atlas/entities?type=Table_v1&property=qualifiedName&value=time_dim
HTTP/1.1" 200 3334 "-" "Java/1.8.0_152"
127.0.0.1 - - [06/Apr/2018:08:43:08 +0000] "GET //localhost:31000/api/atlas/entities?type=Table_v1&property=qualifiedName&value=sales_fact_daily_mv
HTTP/1.1" 200 4569 "-" "Java/1.8.0_152"
127.0.0.1 - - [06/Apr/2018:08:43:08 +0000] "GET //localhost:31000/api/atlas/lineage/86bf0f51-0081-4718-a108-11aa8c610ec1/inputs/graph
HTTP/1.1" 200 1722 "-" "Java/1.8.0_152"
127.0.0.1 - - [06/Apr/2018:08:43:08 +0000] "GET //localhost:31000/api/atlas/entities?type=LoadProcess_v1&property=qualifiedName&value=loadSalesDaily
HTTP/1.1" 200 1779 "-" "Java/1.8.0_152"
127.0.0.1 - - [06/Apr/2018:08:43:08 +0000] "GET //localhost:31000/api/atlas/entities?type=Table_v1&property=qualifiedName&value=sales_fact
HTTP/1.1" 200 4110 "-" "Java/1.8.0_152"
127.0.0.1 - - [06/Apr/2018:08:43:08 +0000] "GET //localhost:31000/api/atlas/entities?type=Table_v1&property=qualifiedName&value=time_dim
HTTP/1.1" 200 3334 "-" "Java/1.8.0_152"
127.0.0.1 - - [06/Apr/2018:08:43:08 +0000] "GET //localhost:31000/api/atlas/entities?type=Table_v1&property=qualifiedName&value=sales_fact_daily_mv
HTTP/1.1" 200 4569 "-" "Java/1.8.0_152"
127.0.0.1 - - [06/Apr/2018:08:43:08 +0000] "GET //localhost:31000/api/atlas/entities?type=Table_v1&property=qualifiedName&value=sales_fact
HTTP/1.1" 200 4110 "-" "Java/1.8.0_152"
127.0.0.1 - - [06/Apr/2018:08:43:08 +0000] "GET //localhost:31000/api/atlas/entities?type=DB_v1&property=name&value=Sales
HTTP/1.1" 200 688 "-" "Java/1.8.0_152"
127.0.0.1 - - [06/Apr/2018:08:43:08 +0000] "GET //localhost:31000/api/atlas/entities?type=View_v1&property=qualifiedName&value=product_dim_view
HTTP/1.1" 200 1296 "-" "Java/1.8.0_152"
127.0.0.1 - - [06/Apr/2018:08:43:08 +0000] "GET //localhost:31000/api/atlas/entities?type=Table_v1&property=qualifiedName&value=product_dim
HTTP/1.1" 200 3360 "-" "Java/1.8.0_152"
Tests run: 126, Failures: 3, Errors: 0, Skipped: 0, Time elapsed: 152.545 sec <<<
FAILURE! - in TestSuite
testCompleteUpdate(org.apache.atlas.web.integration.EntityJerseyResourceIT)  Time elapsed:
0.954 sec  <<< FAILURE!
java.lang.AssertionError: expected [true] but found [false]
	at org.testng.Assert.fail(Assert.java:94)
	at org.testng.Assert.failNotEquals(Assert.java:496)
	at org.testng.Assert.assertTrue(Assert.java:42)
	at org.testng.Assert.assertTrue(Assert.java:52)
	at org.apache.atlas.web.integration.EntityJerseyResourceIT.testCompleteUpdate(EntityJerseyResourceIT.java:1001)

testPartialUpdateByGuid(org.apache.atlas.web.integration.EntityJerseyResourceIT)  Time elapsed:
0.917 sec  <<< FAILURE!
java.lang.AssertionError: Maps do not have the same size:8 != 7
	at org.testng.Assert.fail(Assert.java:94)
	at org.testng.Assert.assertEquals(Assert.java:828)
	at org.apache.atlas.web.integration.EntityJerseyResourceIT.testPartialUpdateByGuid(EntityJerseyResourceIT.java:889)

testPartialUpdateByUniqueAttributes(org.apache.atlas.web.integration.EntityJerseyResourceIT)
 Time elapsed: 0.986 sec  <<< FAILURE!
java.lang.AssertionError: expected [true] but found [false]
	at org.testng.Assert.fail(Assert.java:94)
	at org.testng.Assert.failNotEquals(Assert.java:496)
	at org.testng.Assert.assertTrue(Assert.java:42)
	at org.testng.Assert.assertTrue(Assert.java:52)
	at org.apache.atlas.web.integration.EntityJerseyResourceIT.testPartialUpdateByUniqueAttributes(EntityJerseyResourceIT.java:944)


Results :

Failed tests: 
  EntityJerseyResourceIT.testCompleteUpdate:1001 expected [true] but found [false]
  EntityJerseyResourceIT.testPartialUpdateByGuid:889 Maps do not have the same size:8 != 7
  EntityJerseyResourceIT.testPartialUpdateByUniqueAttributes:944 expected [true] but found
[false]

Tests run: 126, Failures: 3, Errors: 0, Skipped: 0

[INFO] 
[INFO] --- jetty-maven-plugin:9.3.14.v20161028:stop (stop-jetty) @ atlas-webapp ---
[INFO] Waiting 10 seconds for jetty to stop
[INFO] Stopped ServerConnector@4ef6d2b0{HTTP/1.1,[http/1.1]}{0.0.0.0:31000}
[INFO] Closing Spring root WebApplicationContext
[INFO] Shutting down log4j
log4j:WARN No appenders could be found for logger (org.apache.zookeeper.ClientCnxn).
log4j:WARN Please initialize the log4j system properly.
log4j:WARN See http://logging.apache.org/log4j/1.2/faq.html#noconfig for more info.
[INFO] Stopped o.e.j.m.p.JettyWebAppContext@46e3bd55{/,file://<https://builds.apache.org/job/Atlas-master-IntegrationTests/ws/webapp/target/atlas-webapp-1.0.0-SNAPSHOT/,UNAVAILABLE}{/home/jenkins/jenkins-slave/workspace/Atlas-master-IntegrationTests/webapp/target/atlas-webapp-1.0.0-SNAPSHOT.war}>
[INFO] Server reports itself as stopped
[INFO] 
[INFO] --- maven-source-plugin:2.4:jar-no-fork (attach-sources) @ atlas-webapp ---
[INFO] Building jar: <https://builds.apache.org/job/Atlas-master-IntegrationTests/ws/webapp/target/atlas-webapp-1.0.0-SNAPSHOT-sources.jar>
[INFO] 
[INFO] --- maven-source-plugin:2.4:test-jar-no-fork (attach-sources) @ atlas-webapp ---
[INFO] Building jar: <https://builds.apache.org/job/Atlas-master-IntegrationTests/ws/webapp/target/atlas-webapp-1.0.0-SNAPSHOT-test-sources.jar>
[INFO] 
[INFO] --- maven-failsafe-plugin:2.18.1:verify (verify) @ atlas-webapp ---
[INFO] Failsafe report directory: <https://builds.apache.org/job/Atlas-master-IntegrationTests/ws/webapp/target/failsafe-reports>
[INFO] ------------------------------------------------------------------------
[INFO] Reactor Summary:
[INFO] 
[INFO] Apache Atlas Server Build Tools .................... SUCCESS [  1.257 s]
[INFO] apache-atlas ....................................... SUCCESS [  6.242 s]
[INFO] Apache Atlas Test Utility Tools .................... SUCCESS [ 12.192 s]
[INFO] Open Connector Framework (OCF) ..................... SUCCESS [ 10.572 s]
[INFO] Open Metadata Repository Services (OMRS) ........... SUCCESS [ 33.175 s]
[INFO] Open Metadata and Governance (OMAG) Server APIs .... SUCCESS [  7.821 s]
[INFO] Apache Atlas Integration ........................... SUCCESS [ 18.912 s]
[INFO] Apache Atlas Common ................................ SUCCESS [  8.193 s]
[INFO] Apache Atlas Client ................................ SUCCESS [  0.593 s]
[INFO] atlas-client-common ................................ SUCCESS [  7.316 s]
[INFO] atlas-client-v1 .................................... SUCCESS [  7.232 s]
[INFO] Apache Atlas Server API ............................ SUCCESS [  5.569 s]
[INFO] Apache Atlas Notification .......................... SUCCESS [  9.824 s]
[INFO] atlas-client-v2 .................................... SUCCESS [  5.988 s]
[INFO] Apache Atlas Graph Database Projects ............... SUCCESS [  0.503 s]
[INFO] Apache Atlas Graph Database API .................... SUCCESS [  4.998 s]
[INFO] Graph Database Common Code ......................... SUCCESS [  5.408 s]
[INFO] Apache Atlas JanusGraph DB Impl .................... SUCCESS [ 20.054 s]
[INFO] Apache Atlas Graph Database Implementation Dependencies SUCCESS [  2.254 s]
[INFO] Shaded version of Apache hbase client .............. SUCCESS [  8.979 s]
[INFO] Apache Atlas Titan 0.5.4 Graph DB Impl ............. SUCCESS [ 41.203 s]
[INFO] Shaded version of Apache hbase server .............. SUCCESS [ 21.777 s]
[INFO] Apache Atlas Authorization ......................... SUCCESS [  6.502 s]
[INFO] Apache Atlas Repository ............................ SUCCESS [ 32.676 s]
[INFO] Apache Atlas UI .................................... SUCCESS [01:20 min]
[INFO] Apache Atlas Web Application ....................... FAILURE [03:57 min]
[INFO] Apache Atlas Documentation ......................... SKIPPED
[INFO] Apache Atlas FileSystem Model ...................... SKIPPED
[INFO] Apache Atlas Plugin Classloader .................... SKIPPED
[INFO] Apache Atlas Hive Bridge Shim ...................... SKIPPED
[INFO] Apache Atlas Hive Bridge ........................... SKIPPED
[INFO] Apache Atlas Falcon Bridge Shim .................... SKIPPED
[INFO] Apache Atlas Falcon Bridge ......................... SKIPPED
[INFO] Apache Atlas Sqoop Bridge Shim ..................... SKIPPED
[INFO] Apache Atlas Sqoop Bridge .......................... SKIPPED
[INFO] Apache Atlas Storm Bridge Shim ..................... SKIPPED
[INFO] Apache Atlas Storm Bridge .......................... SKIPPED
[INFO] Apache Atlas Hbase Bridge Shim ..................... SKIPPED
[INFO] Apache Atlas Hbase Bridge .......................... SKIPPED
[INFO] Apache Atlas Migration Exporter .................... SKIPPED
[INFO] Apache Atlas Distribution .......................... SKIPPED
[INFO] ------------------------------------------------------------------------
[INFO] BUILD FAILURE
[INFO] ------------------------------------------------------------------------
[INFO] Total time: 09:58 min
[INFO] Finished at: 2018-04-06T08:43:19Z
[INFO] Final Memory: 387M/2361M
[INFO] ------------------------------------------------------------------------
[ERROR] Failed to execute goal org.apache.maven.plugins:maven-failsafe-plugin:2.18.1:verify
(verify) on project atlas-webapp: There are test failures.
[ERROR] 
[ERROR] Please refer to <https://builds.apache.org/job/Atlas-master-IntegrationTests/ws/webapp/target/failsafe-reports>
for the individual test results.
[ERROR] -> [Help 1]
[ERROR] 
[ERROR] To see the full stack trace of the errors, re-run Maven with the -e switch.
[ERROR] Re-run Maven using the -X switch to enable full debug logging.
[ERROR] 
[ERROR] For more information about the errors and possible solutions, please read the following
articles:
[ERROR] [Help 1] http://cwiki.apache.org/confluence/display/MAVEN/MojoFailureException
[ERROR] 
[ERROR] After correcting the problems, you can resume the build with the command
[ERROR]   mvn <goals> -rf :atlas-webapp
Build step 'Execute shell' marked build as failure
[CHECKSTYLE] Collecting checkstyle analysis files...
[CHECKSTYLE] Searching for all files in <https://builds.apache.org/job/Atlas-master-IntegrationTests/ws/>
that match the pattern **/target/checkstyle-result.xml
[CHECKSTYLE] Parsing 24 files in <https://builds.apache.org/job/Atlas-master-IntegrationTests/ws/>
[CHECKSTYLE] Successfully parsed file <https://builds.apache.org/job/Atlas-master-IntegrationTests/ws/authorization/target/checkstyle-result.xml>
with 669 unique warnings and 0 duplicates.
[CHECKSTYLE] Successfully parsed file <https://builds.apache.org/job/Atlas-master-IntegrationTests/ws/client/client-v1/target/checkstyle-result.xml>
with 1553 unique warnings and 0 duplicates.
[CHECKSTYLE] Successfully parsed file <https://builds.apache.org/job/Atlas-master-IntegrationTests/ws/client/client-v2/target/checkstyle-result.xml>
with 1912 unique warnings and 0 duplicates.
[CHECKSTYLE] Successfully parsed file <https://builds.apache.org/job/Atlas-master-IntegrationTests/ws/client/common/target/checkstyle-result.xml>
with 2400 unique warnings and 0 duplicates.
[CHECKSTYLE] Successfully parsed file <https://builds.apache.org/job/Atlas-master-IntegrationTests/ws/client/target/checkstyle-result.xml>
with 2400 unique warnings and 0 duplicates.
[CHECKSTYLE] Successfully parsed file <https://builds.apache.org/job/Atlas-master-IntegrationTests/ws/common/target/checkstyle-result.xml>
with 3448 unique warnings and 0 duplicates.
[CHECKSTYLE] Successfully parsed file <https://builds.apache.org/job/Atlas-master-IntegrationTests/ws/dashboardv2/target/checkstyle-result.xml>
with 3448 unique warnings and 0 duplicates.
[CHECKSTYLE] Successfully parsed file <https://builds.apache.org/job/Atlas-master-IntegrationTests/ws/graphdb/api/target/checkstyle-result.xml>
with 3742 unique warnings and 0 duplicates.
[CHECKSTYLE] Successfully parsed file <https://builds.apache.org/job/Atlas-master-IntegrationTests/ws/graphdb/common/target/checkstyle-result.xml>
with 3951 unique warnings and 0 duplicates.
[CHECKSTYLE] Successfully parsed file <https://builds.apache.org/job/Atlas-master-IntegrationTests/ws/graphdb/graphdb-impls/target/checkstyle-result.xml>
with 3951 unique warnings and 0 duplicates.
[CHECKSTYLE] Successfully parsed file <https://builds.apache.org/job/Atlas-master-IntegrationTests/ws/graphdb/janus/target/checkstyle-result.xml>
with 5643 unique warnings and 0 duplicates.
[CHECKSTYLE] Successfully parsed file <https://builds.apache.org/job/Atlas-master-IntegrationTests/ws/graphdb/target/checkstyle-result.xml>
with 5643 unique warnings and 0 duplicates.
[CHECKSTYLE] Successfully parsed file <https://builds.apache.org/job/Atlas-master-IntegrationTests/ws/graphdb/titan0/target/checkstyle-result.xml>
with 8144 unique warnings and 0 duplicates.
[CHECKSTYLE] Successfully parsed file <https://builds.apache.org/job/Atlas-master-IntegrationTests/ws/intg/target/checkstyle-result.xml>
with 19155 unique warnings and 0 duplicates.
[CHECKSTYLE] Successfully parsed file <https://builds.apache.org/job/Atlas-master-IntegrationTests/ws/notification/target/checkstyle-result.xml>
with 20391 unique warnings and 0 duplicates.
[CHECKSTYLE] Successfully parsed file <https://builds.apache.org/job/Atlas-master-IntegrationTests/ws/om-fwk-ocf/target/checkstyle-result.xml>
with 25433 unique warnings and 0 duplicates.
[CHECKSTYLE] Successfully parsed file <https://builds.apache.org/job/Atlas-master-IntegrationTests/ws/omag-api/target/checkstyle-result.xml>
with 26779 unique warnings and 0 duplicates.
[CHECKSTYLE] Successfully parsed file <https://builds.apache.org/job/Atlas-master-IntegrationTests/ws/omrs/target/checkstyle-result.xml>
with 64408 unique warnings and 0 duplicates.
[CHECKSTYLE] Successfully parsed file <https://builds.apache.org/job/Atlas-master-IntegrationTests/ws/repository/target/checkstyle-result.xml>
with 84166 unique warnings and 0 duplicates.
[CHECKSTYLE] Successfully parsed file <https://builds.apache.org/job/Atlas-master-IntegrationTests/ws/server-api/target/checkstyle-result.xml>
with 84317 unique warnings and 0 duplicates.
[CHECKSTYLE] Successfully parsed file <https://builds.apache.org/job/Atlas-master-IntegrationTests/ws/shaded/hbase-client-shaded/target/checkstyle-result.xml>
with 84317 unique warnings and 0 duplicates.
[CHECKSTYLE] Successfully parsed file <https://builds.apache.org/job/Atlas-master-IntegrationTests/ws/shaded/hbase-server-shaded/target/checkstyle-result.xml>
with 84317 unique warnings and 0 duplicates.
[CHECKSTYLE] Successfully parsed file <https://builds.apache.org/job/Atlas-master-IntegrationTests/ws/target/checkstyle-result.xml>
with 84317 unique warnings and 0 duplicates.
[CHECKSTYLE] Successfully parsed file <https://builds.apache.org/job/Atlas-master-IntegrationTests/ws/test-tools/target/checkstyle-result.xml>
with 84355 unique warnings and 0 duplicates.
<Git Blamer> Using GitBlamer to create author and commit information for all warnings.
<Git Blamer> GIT_COMMIT=a1fd406821e1178a7937641386684c46d16ce63e, workspace=<https://builds.apache.org/job/Atlas-master-IntegrationTests/ws/>
 > git rev-parse a1fd406821e1178a7937641386684c46d16ce63e^{commit} # timeout=10
<Git Blamer> Skipping file <https://builds.apache.org/job/Atlas-master-IntegrationTests/ws/graphdb/janus/src/main/java/org/apache/atlas/repository/graphdb/janus/graphson/AtlasGraphSONMode.java,>
no result found.
[CHECKSTYLE] Computing warning deltas based on reference build #950
[FINDBUGS] Collecting findbugs analysis files...
[FINDBUGS] Searching for all files in <https://builds.apache.org/job/Atlas-master-IntegrationTests/ws/>
that match the pattern **/target/findbugs.xml
[FINDBUGS] Parsing 17 files in <https://builds.apache.org/job/Atlas-master-IntegrationTests/ws/>
[FINDBUGS] Successfully parsed file <https://builds.apache.org/job/Atlas-master-IntegrationTests/ws/authorization/target/findbugs.xml>
with 0 unique warnings and 0 duplicates.
[FINDBUGS] Successfully parsed file <https://builds.apache.org/job/Atlas-master-IntegrationTests/ws/client/client-v1/target/findbugs.xml>
with 0 unique warnings and 0 duplicates.
[FINDBUGS] Successfully parsed file <https://builds.apache.org/job/Atlas-master-IntegrationTests/ws/client/client-v2/target/findbugs.xml>
with 0 unique warnings and 0 duplicates.
[FINDBUGS] Successfully parsed file <https://builds.apache.org/job/Atlas-master-IntegrationTests/ws/client/common/target/findbugs.xml>
with 0 unique warnings and 0 duplicates.
[FINDBUGS] Successfully parsed file <https://builds.apache.org/job/Atlas-master-IntegrationTests/ws/common/target/findbugs.xml>
with 0 unique warnings and 0 duplicates.
[FINDBUGS] Successfully parsed file <https://builds.apache.org/job/Atlas-master-IntegrationTests/ws/graphdb/api/target/findbugs.xml>
with 0 unique warnings and 0 duplicates.
[FINDBUGS] Successfully parsed file <https://builds.apache.org/job/Atlas-master-IntegrationTests/ws/graphdb/common/target/findbugs.xml>
with 0 unique warnings and 0 duplicates.
[FINDBUGS] Successfully parsed file <https://builds.apache.org/job/Atlas-master-IntegrationTests/ws/graphdb/janus/target/findbugs.xml>
with 0 unique warnings and 0 duplicates.
[FINDBUGS] Successfully parsed file <https://builds.apache.org/job/Atlas-master-IntegrationTests/ws/graphdb/titan0/target/findbugs.xml>
with 0 unique warnings and 0 duplicates.
[FINDBUGS] Successfully parsed file <https://builds.apache.org/job/Atlas-master-IntegrationTests/ws/intg/target/findbugs.xml>
with 0 unique warnings and 0 duplicates.
[FINDBUGS] Successfully parsed file <https://builds.apache.org/job/Atlas-master-IntegrationTests/ws/notification/target/findbugs.xml>
with 0 unique warnings and 0 duplicates.
[FINDBUGS] Successfully parsed file <https://builds.apache.org/job/Atlas-master-IntegrationTests/ws/om-fwk-ocf/target/findbugs.xml>
with 0 unique warnings and 0 duplicates.
[FINDBUGS] Successfully parsed file <https://builds.apache.org/job/Atlas-master-IntegrationTests/ws/omag-api/target/findbugs.xml>
with 0 unique warnings and 0 duplicates.
[FINDBUGS] Successfully parsed file <https://builds.apache.org/job/Atlas-master-IntegrationTests/ws/omrs/target/findbugs.xml>
with 0 unique warnings and 0 duplicates.
[FINDBUGS] Successfully parsed file <https://builds.apache.org/job/Atlas-master-IntegrationTests/ws/repository/target/findbugs.xml>
with 0 unique warnings and 0 duplicates.
[FINDBUGS] Successfully parsed file <https://builds.apache.org/job/Atlas-master-IntegrationTests/ws/server-api/target/findbugs.xml>
with 0 unique warnings and 0 duplicates.
[FINDBUGS] Successfully parsed file <https://builds.apache.org/job/Atlas-master-IntegrationTests/ws/test-tools/target/findbugs.xml>
with 0 unique warnings and 0 duplicates.
<Git Blamer> Using GitBlamer to create author and commit information for all warnings.
<Git Blamer> GIT_COMMIT=a1fd406821e1178a7937641386684c46d16ce63e, workspace=<https://builds.apache.org/job/Atlas-master-IntegrationTests/ws/>
[FINDBUGS] Computing warning deltas based on reference build #950
Archiving artifacts
[Fast Archiver] Compressed 165.25 MB of artifacts by 67.1% relative to #950
TestNG Reports Processing: START
Looking for TestNG results report in workspace using pattern: **/target/surefire-reports/testng-results.xml,**/target/failsafe-reports/testng-results.xml
Saving reports...
Processing '/x1/jenkins/jenkins-home/jobs/Atlas-master-IntegrationTests/builds/967/testng/testng-results.xml'
2.380952% of tests failed, which exceeded threshold of 0%. Marking build as UNSTABLE
TestNG Reports Processing: FINISH

Mime
View raw message