atlas-dev mailing list archives

Site index · List index
Message view « Date » · « Thread »
Top « Date » · « Thread »
From Apache Jenkins Server <jenk...@builds.apache.org>
Subject Build failed in Jenkins: PreCommit-ATLAS-Build-Test #288-master-0001-ATLAS-2587-Set-read-ACL-for-apache_atlas-active_serv.patch
Date Thu, 19 Apr 2018 10:58:10 GMT
See <https://builds.apache.org/job/PreCommit-ATLAS-Build-Test/288/display/redirect>

------------------------------------------
[...truncated 326.11 KB...]
Downloading from repository.jboss.org-public: https://repository.jboss.org/nexus/content/groups/public/net/minidev/json-smart/maven-metadata.xml
Downloading from typesafe: http://repo.typesafe.com/typesafe/releases/net/minidev/json-smart/maven-metadata.xml
Progress (1): 313 B                   Downloaded from repository.jboss.org-public: https://repository.jboss.org/nexus/content/groups/public/net/minidev/json-smart/maven-metadata.xml
(313 B at 1.2 kB/s)
Downloading from apache.snapshots.repo: https://repository.apache.org/content/groups/snapshots/net/minidev/json-smart/2.3-SNAPSHOT/maven-metadata.xml
Downloading from java.net-Public: https://maven.java.net/content/groups/public/net/minidev/json-smart/2.3-SNAPSHOT/maven-metadata.xml
Downloading from default: https://repository.apache.org/content/groups/public/net/minidev/json-smart/2.3-SNAPSHOT/maven-metadata.xml
Downloading from apache-staging: https://repository.apache.org/content/groups/staging/net/minidev/json-smart/2.3-SNAPSHOT/maven-metadata.xml
Downloading from typesafe: http://repo.typesafe.com/typesafe/releases/net/minidev/json-smart/2.3-SNAPSHOT/maven-metadata.xml
Downloading from repository.jboss.org-public: https://repository.jboss.org/nexus/content/groups/public/net/minidev/json-smart/2.3-SNAPSHOT/maven-metadata.xml
Progress (1): 1.1/1.2 kBProgress (1): 1.2 kB                        Downloaded from repository.jboss.org-public:
https://repository.jboss.org/nexus/content/groups/public/net/minidev/json-smart/2.3-SNAPSHOT/maven-metadata.xml
(1.2 kB at 9.0 kB/s)
Downloading from default: https://repository.apache.org/content/groups/public/net/minidev/minidev-parent/2.3-SNAPSHOT/maven-metadata.xml
Downloading from apache.snapshots.repo: https://repository.apache.org/content/groups/snapshots/net/minidev/minidev-parent/2.3-SNAPSHOT/maven-metadata.xml
Downloading from java.net-Public: https://maven.java.net/content/groups/public/net/minidev/minidev-parent/2.3-SNAPSHOT/maven-metadata.xml
Downloading from apache-staging: https://repository.apache.org/content/groups/staging/net/minidev/minidev-parent/2.3-SNAPSHOT/maven-metadata.xml
Downloading from repository.jboss.org-public: https://repository.jboss.org/nexus/content/groups/public/net/minidev/minidev-parent/2.3-SNAPSHOT/maven-metadata.xml
Downloading from typesafe: http://repo.typesafe.com/typesafe/releases/net/minidev/minidev-parent/2.3-SNAPSHOT/maven-metadata.xml
Progress (1): 598 B                   Downloaded from repository.jboss.org-public: https://repository.jboss.org/nexus/content/groups/public/net/minidev/minidev-parent/2.3-SNAPSHOT/maven-metadata.xml
(598 B at 6.1 kB/s)
Downloading from apache.snapshots.repo: https://repository.apache.org/content/groups/snapshots/net/minidev/accessors-smart/1.2-SNAPSHOT/maven-metadata.xml
Downloading from apache-staging: https://repository.apache.org/content/groups/staging/net/minidev/accessors-smart/1.2-SNAPSHOT/maven-metadata.xml
Downloading from java.net-Public: https://maven.java.net/content/groups/public/net/minidev/accessors-smart/1.2-SNAPSHOT/maven-metadata.xml
Downloading from default: https://repository.apache.org/content/groups/public/net/minidev/accessors-smart/1.2-SNAPSHOT/maven-metadata.xml
Downloading from repository.jboss.org-public: https://repository.jboss.org/nexus/content/groups/public/net/minidev/accessors-smart/1.2-SNAPSHOT/maven-metadata.xml
Downloading from typesafe: http://repo.typesafe.com/typesafe/releases/net/minidev/accessors-smart/1.2-SNAPSHOT/maven-metadata.xml
Progress (1): 1.1/1.2 kBProgress (1): 1.2 kB                        Downloaded from repository.jboss.org-public:
https://repository.jboss.org/nexus/content/groups/public/net/minidev/accessors-smart/1.2-SNAPSHOT/maven-metadata.xml
(1.2 kB at 8.9 kB/s)
[INFO] 
[INFO] --- maven-clean-plugin:2.5:clean (default-clean) @ atlas-webapp ---
[INFO] Deleting <https://builds.apache.org/job/PreCommit-ATLAS-Build-Test/ws/webapp>
(includes = [**/*.pyc], excludes = [])
[INFO] 
[INFO] --- maven-enforcer-plugin:3.0.0-M1:enforce (enforce-versions) @ atlas-webapp ---
[INFO] 
[INFO] --- buildnumber-maven-plugin:1.4:create (default) @ atlas-webapp ---
[INFO] Executing: /bin/sh -c cd '<https://builds.apache.org/job/PreCommit-ATLAS-Build-Test/ws/webapp'>
&& 'git' 'rev-parse' '--verify' 'HEAD'
[INFO] Working directory: <https://builds.apache.org/job/PreCommit-ATLAS-Build-Test/ws/webapp>
[INFO] Storing buildNumber: d55405955d58417c263d964238c79c981d7fa9fe at timestamp: 1524135479771
[INFO] Storing buildScmBranch: master
[INFO] 
[INFO] --- apache-rat-plugin:0.12:check (rat-check) @ atlas-webapp ---
[INFO] Enabled default license matchers.
[INFO] Will parse SCM ignores for exclusions...
[INFO] Finished adding exclusions from SCM ignore files.
[INFO] 61 implicit excludes (use -debug for more details).
[INFO] Exclude: **/antlr4/**
[INFO] Exclude: **/dependency-reduced-pom.xml
[INFO] Exclude: **/javax.script.ScriptEngineFactory
[INFO] Exclude: .reviewboardrc
[INFO] Exclude: 3party-licenses/**
[INFO] Exclude: **/.cache
[INFO] Exclude: **/.cache-main
[INFO] Exclude: **/.cache-tests
[INFO] Exclude: **/.checkstyle
[INFO] Exclude: **/*.txt
[INFO] Exclude: **/*.json
[INFO] Exclude: .pc/**
[INFO] Exclude: debian/**
[INFO] Exclude: .svn/**
[INFO] Exclude: .git/**
[INFO] Exclude: .gitignore
[INFO] Exclude: **/.idea/**
[INFO] Exclude: **/*.twiki
[INFO] Exclude: **/*.iml
[INFO] Exclude: **/*.json
[INFO] Exclude: **/*.log
[INFO] Exclude: **/target/**
[INFO] Exclude: **/target*/**
[INFO] Exclude: **/build/**
[INFO] Exclude: **/*.patch
[INFO] Exclude: derby.log
[INFO] Exclude: **/logs/**
[INFO] Exclude: **/.classpath
[INFO] Exclude: **/.project
[INFO] Exclude: **/.settings/**
[INFO] Exclude: **/test-output/**
[INFO] Exclude: **/mock/**
[INFO] Exclude: **/data/**
[INFO] Exclude: **/maven-eclipse.xml
[INFO] Exclude: **/.externalToolBuilders/**
[INFO] Exclude: **/build.log
[INFO] Exclude: **/.bowerrc
[INFO] Exclude: *.json
[INFO] Exclude: **/overlays/**
[INFO] Exclude: dev-support/**
[INFO] Exclude: **/users-credentials.properties
[INFO] Exclude: **/public/css/animate.min.css
[INFO] Exclude: **/public/css/bootstrap-sidebar.css
[INFO] Exclude: **/public/js/external_lib/**
[INFO] Exclude: **/node_modules/**
[INFO] Exclude: **/public/js/libs/**
[INFO] Exclude: **/atlas.data/**
[INFO] Exclude: **/${sys:atlas.data}/**
[INFO] Exclude: **/policy-store.txt
[INFO] Exclude: **/*rebel*.xml
[INFO] Exclude: **/*rebel*.xml.bak
[INFO] Exclude: **/test/resources/**
[INFO] 127 resources included (use -debug for more details)
[INFO] Rat check: Summary over all files. Unapproved: 0, unknown: 0, generated: 0, approved:
127 licenses.
[INFO] 
[INFO] --- maven-resources-plugin:2.7:copy-resources (copy-resources) @ atlas-webapp ---
[INFO] Using 'UTF-8' encoding to copy filtered resources.
[INFO] Copying 13 resources
[INFO] 
[INFO] --- maven-resources-plugin:2.7:copy-resources (copy-solr-resources) @ atlas-webapp
---
[INFO] Using 'UTF-8' encoding to copy filtered resources.
[INFO] Copying 9 resources
[INFO] 
[INFO] --- maven-remote-resources-plugin:1.5:process (default) @ atlas-webapp ---
[INFO] artifact net.minidev:json-smart: checking for updates from hortonworks.repo
[INFO] artifact net.minidev:json-smart: checking for updates from apache.snapshots.repo
[INFO] artifact net.minidev:json-smart: checking for updates from apache-staging
[INFO] artifact net.minidev:json-smart: checking for updates from default
[INFO] artifact net.minidev:json-smart: checking for updates from java.net-Public
[INFO] artifact net.minidev:json-smart: checking for updates from repository.jboss.org-public
[INFO] artifact net.minidev:json-smart: checking for updates from typesafe
[INFO] 
[INFO] --- keytool-maven-plugin:1.5:clean (clean) @ atlas-webapp ---
[WARNING] Keystore file '<https://builds.apache.org/job/PreCommit-ATLAS-Build-Test/ws/webapp/target/atlas.keystore'>
doesn't exist.
[INFO] 
[INFO] --- keytool-maven-plugin:1.5:generateKeyPair (generateKeyPair) @ atlas-webapp ---
[WARNING] 
[WARNING] Warning:
[WARNING] The JKS keystore uses a proprietary format. It is recommended to migrate to PKCS12
which is an industry standard format using "keytool -importkeystore -srckeystore <https://builds.apache.org/job/PreCommit-ATLAS-Build-Test/ws/webapp/target/atlas.keystore>
-destkeystore <https://builds.apache.org/job/PreCommit-ATLAS-Build-Test/ws/webapp/target/atlas.keystore>
-deststoretype pkcs12".
[INFO] 
[INFO] --- maven-resources-plugin:2.7:resources (default-resources) @ atlas-webapp ---
[INFO] Using 'UTF-8' encoding to copy filtered resources.
[INFO] Copying 2 resources
[INFO] Copying 2 resources to META-INF
[INFO] Copying 3 resources
[INFO] 
[INFO] --- maven-compiler-plugin:3.7.0:compile (default-compile) @ atlas-webapp ---
[INFO] Changes detected - recompiling the module!
[INFO] Compiling 69 source files to <https://builds.apache.org/job/PreCommit-ATLAS-Build-Test/ws/webapp/target/classes>
[INFO] -------------------------------------------------------------
[ERROR] COMPILATION ERROR : 
[INFO] -------------------------------------------------------------
[ERROR] <https://builds.apache.org/job/PreCommit-ATLAS-Build-Test/ws/webapp/src/main/java/org/apache/atlas/web/service/ActiveInstanceState.java>:[41,1]
class, interface, or enum expected
[ERROR] <https://builds.apache.org/job/PreCommit-ATLAS-Build-Test/ws/webapp/src/main/java/org/apache/atlas/web/service/ActiveInstanceState.java>:[43,1]
class, interface, or enum expected
[ERROR] <https://builds.apache.org/job/PreCommit-ATLAS-Build-Test/ws/webapp/src/main/java/org/apache/atlas/web/service/ActiveInstanceState.java>:[45,1]
class, interface, or enum expected
[INFO] 3 errors 
[INFO] -------------------------------------------------------------
[INFO] ------------------------------------------------------------------------
[INFO] Reactor Summary:
[INFO] 
[INFO] Apache Atlas Server Build Tools .................... SUCCESS [  0.587 s]
[INFO] apache-atlas ....................................... SUCCESS [  3.005 s]
[INFO] Apache Atlas Test Utility Tools .................... SUCCESS [  3.978 s]
[INFO] Open Connector Framework (OCF) ..................... SUCCESS [  1.871 s]
[INFO] Open Metadata Repository Services (OMRS) ........... SUCCESS [  5.244 s]
[INFO] Open Metadata and Governance (OMAG) Server APIs .... SUCCESS [  1.258 s]
[INFO] Connected Asset Open Metadata Access Service (OMAS)  SUCCESS [  1.192 s]
[INFO] Asset Consumer Open Metadata Access Service (OMAS) . SUCCESS [  1.158 s]
[INFO] Open Metadata and Governance (OMAG) Server ......... SUCCESS [  0.745 s]
[INFO] Apache Atlas Integration ........................... SUCCESS [ 39.478 s]
[INFO] Apache Atlas Common ................................ SUCCESS [  2.321 s]
[INFO] Apache Atlas Client ................................ SUCCESS [  0.136 s]
[INFO] atlas-client-common ................................ SUCCESS [  0.727 s]
[INFO] atlas-client-v1 .................................... SUCCESS [  2.470 s]
[INFO] Apache Atlas Server API ............................ SUCCESS [  0.770 s]
[INFO] Apache Atlas Notification .......................... SUCCESS [ 31.883 s]
[INFO] atlas-client-v2 .................................... SUCCESS [  0.842 s]
[INFO] Apache Atlas Graph Database Projects ............... SUCCESS [  0.131 s]
[INFO] Apache Atlas Graph Database API .................... SUCCESS [  0.624 s]
[INFO] Graph Database Common Code ......................... SUCCESS [  0.786 s]
[INFO] Apache Atlas JanusGraph DB Impl .................... SUCCESS [02:34 min]
[INFO] Apache Atlas Graph Database Implementation Dependencies SUCCESS [  1.783 s]
[INFO] Shaded version of Apache hbase client .............. SUCCESS [  7.816 s]
[INFO] Apache Atlas Titan 0.5.4 Graph DB Impl ............. SUCCESS [ 30.625 s]
[INFO] Shaded version of Apache hbase server .............. SUCCESS [ 23.949 s]
[INFO] Apache Atlas Authorization ......................... SUCCESS [  2.747 s]
[INFO] Apache Atlas Repository ............................ SUCCESS [04:16 min]
[INFO] Apache Atlas UI .................................... SUCCESS [01:58 min]
[INFO] Apache Atlas Web Application ....................... FAILURE [  8.878 s]
[INFO] Apache Atlas Documentation ......................... SKIPPED
[INFO] Apache Atlas FileSystem Model ...................... SKIPPED
[INFO] Apache Atlas Plugin Classloader .................... SKIPPED
[INFO] Apache Atlas Hive Bridge Shim ...................... SKIPPED
[INFO] Apache Atlas Hive Bridge ........................... SKIPPED
[INFO] Apache Atlas Falcon Bridge Shim .................... SKIPPED
[INFO] Apache Atlas Falcon Bridge ......................... SKIPPED
[INFO] Apache Atlas Sqoop Bridge Shim ..................... SKIPPED
[INFO] Apache Atlas Sqoop Bridge .......................... SKIPPED
[INFO] Apache Atlas Storm Bridge Shim ..................... SKIPPED
[INFO] Apache Atlas Storm Bridge .......................... SKIPPED
[INFO] Apache Atlas Hbase Bridge Shim ..................... SKIPPED
[INFO] Apache Atlas Hbase Bridge .......................... SKIPPED
[INFO] Apache Atlas Migration Exporter .................... SKIPPED
[INFO] Apache Atlas Distribution .......................... SKIPPED
[INFO] ------------------------------------------------------------------------
[INFO] BUILD FAILURE
[INFO] ------------------------------------------------------------------------
[INFO] Total time: 11:45 min
[INFO] Finished at: 2018-04-19T10:58:06Z
[INFO] Final Memory: 180M/2392M
[INFO] ------------------------------------------------------------------------
[ERROR] Failed to execute goal org.apache.maven.plugins:maven-compiler-plugin:3.7.0:compile
(default-compile) on project atlas-webapp: Compilation failure: Compilation failure: 
[ERROR] <https://builds.apache.org/job/PreCommit-ATLAS-Build-Test/ws/webapp/src/main/java/org/apache/atlas/web/service/ActiveInstanceState.java>:[41,1]
class, interface, or enum expected
[ERROR] <https://builds.apache.org/job/PreCommit-ATLAS-Build-Test/ws/webapp/src/main/java/org/apache/atlas/web/service/ActiveInstanceState.java>:[43,1]
class, interface, or enum expected
[ERROR] <https://builds.apache.org/job/PreCommit-ATLAS-Build-Test/ws/webapp/src/main/java/org/apache/atlas/web/service/ActiveInstanceState.java>:[45,1]
class, interface, or enum expected
[ERROR] -> [Help 1]
[ERROR] 
[ERROR] To see the full stack trace of the errors, re-run Maven with the -e switch.
[ERROR] Re-run Maven using the -X switch to enable full debug logging.
[ERROR] 
[ERROR] For more information about the errors and possible solutions, please read the following
articles:
[ERROR] [Help 1] http://cwiki.apache.org/confluence/display/MAVEN/MojoFailureException
[ERROR] 
[ERROR] After correcting the problems, you can resume the build with the command
[ERROR]   mvn <goals> -rf :atlas-webapp




{color:green}+1 overall{color}.  

    {color:green}+1 @author{color}.  The patch does not contain any @author tags.

Test results: https://builds.apache.org/job/PreCommit-ATLAS-Build-Test/288//testReport/
Console output: https://builds.apache.org/job/PreCommit-ATLAS-Build-Test/288//console

This message is automatically generated.


======================================================================
======================================================================
    Adding comment to Jira.
======================================================================
======================================================================




======================================================================
======================================================================
    Finished build.
======================================================================
======================================================================


+ EXIT_CODE=0
+ '[' -d <https://builds.apache.org/job/PreCommit-ATLAS-Build-Test/ws/../atlas_patchprocess_28239>
']'
+ '[' -d <https://builds.apache.org/job/PreCommit-ATLAS-Build-Test/ws/atlas_patchprocess_28239>
']'
+ mv <https://builds.apache.org/job/PreCommit-ATLAS-Build-Test/ws/atlas_patchprocess_28239>
<https://builds.apache.org/job/PreCommit-ATLAS-Build-Test/ws/patchprocess>
+ rm -f <https://builds.apache.org/job/PreCommit-ATLAS-Build-Test/ws/../atlas_patchprocess_28239>
+ exit 0
[description-setter] Description set: 0001-ATLAS-2587-Set-read-ACL-for-apache_atlas-active_serv.patch
Set build name.
New build name is '#288-master-0001-ATLAS-2587-Set-read-ACL-for-apache_atlas-active_serv.patch'
Archiving artifacts
ERROR: No artifacts found that match the file pattern "distro/target/*.tar.gz, webapp/target/*.war,
**/target/**/*application.log". Configuration error?
ERROR: ?distro/target/*.tar.gz? doesn?t match anything: ?distro? exists but not ?distro/target/*.tar.gz?
Build step 'Archive the artifacts' changed build result to FAILURE

Mime
View raw message