atlas-dev mailing list archives

Site index · List index
Message view « Date » · « Thread »
Top « Date » · « Thread »
From Apache Jenkins Server <jenk...@builds.apache.org>
Subject Build failed in Jenkins: Atlas-master-IntegrationTests #995
Date Mon, 09 Apr 2018 13:13:21 GMT
See <https://builds.apache.org/job/Atlas-master-IntegrationTests/995/display/redirect>

------------------------------------------
[...truncated 681.00 KB...]
127.0.0.1 - - [09/Apr/2018:12:51:56 +0000] "GET //localhost:31000/api/atlas/v2/entity/uniqueAttribute/type/hive_process?attr:qualifiedName=LOAD-%3E:default.table9fdyvmxslp@primary:1523278310000
HTTP/1.1" 200 1543 "-" "Java/1.8.0_152"
127.0.0.1 - - [09/Apr/2018:12:51:56 +0000] "GET //localhost:31000/api/atlas/v2/entity/uniqueAttribute/type/hive_process?attr:qualifiedName=LOAD-%3E:default.tablevud19l2xto@primary:1523278316000
HTTP/1.1" 404 177 "-" "Java/1.8.0_152"
127.0.0.1 - - [09/Apr/2018:12:52:01 +0000] "GET //localhost:31000/api/atlas/v2/entity/uniqueAttribute/type/hive_process?attr:qualifiedName=LOAD-%3E:default.tablevud19l2xto@primary:1523278316000
HTTP/1.1" 200 1630 "-" "Java/1.8.0_152"
127.0.0.1 - - [09/Apr/2018:12:52:01 +0000] "GET //localhost:31000/api/atlas/v2/entity/uniqueAttribute/type/hive_process?attr:qualifiedName=LOAD-%3E:default.tablevud19l2xto@primary:1523278316000
HTTP/1.1" 200 1630 "-" "Java/1.8.0_152"
127.0.0.1 - - [09/Apr/2018:12:52:03 +0000] "GET //localhost:31000/api/atlas/v2/entity/uniqueAttribute/type/hive_column?attr:qualifiedName=dbndyipzy3ub.tableznx6ns2dlp.id@primary
HTTP/1.1" 404 163 "-" "Java/1.8.0_152"
127.0.0.1 - - [09/Apr/2018:12:52:08 +0000] "GET //localhost:31000/api/atlas/v2/entity/uniqueAttribute/type/hive_column?attr:qualifiedName=dbndyipzy3ub.tableznx6ns2dlp.id@primary
HTTP/1.1" 200 765 "-" "Java/1.8.0_152"
127.0.0.1 - - [09/Apr/2018:12:52:08 +0000] "GET //localhost:31000/api/atlas/v2/entity/uniqueAttribute/type/hive_column?attr:qualifiedName=dbndyipzy3ub.tableznx6ns2dlp.id@primary
HTTP/1.1" 200 765 "-" "Java/1.8.0_152"
127.0.0.1 - - [09/Apr/2018:12:52:08 +0000] "POST //localhost:31000/api/atlas/v2/types/typedefs/
HTTP/1.1" 200 425 "-" "Java/1.8.0_152"
127.0.0.1 - - [09/Apr/2018:12:52:08 +0000] "POST //localhost:31000/api/atlas/v2/entity/guid/7cd0c34e-cff6-4daa-9293-a2f0889ce190/classifications
HTTP/1.1" 204 0 "-" "Java/1.8.0_152"
127.0.0.1 - - [09/Apr/2018:12:52:09 +0000] "GET //localhost:31000/api/atlas/v2/entity/uniqueAttribute/type/hive_column?attr:qualifiedName=dbndyipzy3ub.tableznx6ns2dlp.id_new@primary
HTTP/1.1" 404 167 "-" "Java/1.8.0_152"
127.0.0.1 - - [09/Apr/2018:12:52:14 +0000] "GET //localhost:31000/api/atlas/v2/entity/uniqueAttribute/type/hive_column?attr:qualifiedName=dbndyipzy3ub.tableznx6ns2dlp.id_new@primary
HTTP/1.1" 200 940 "-" "Java/1.8.0_152"
127.0.0.1 - - [09/Apr/2018:12:52:14 +0000] "GET //localhost:31000/api/atlas/v2/entity/uniqueAttribute/type/hive_column?attr:qualifiedName=dbndyipzy3ub.tableznx6ns2dlp.id_new@primary
HTTP/1.1" 200 940 "-" "Java/1.8.0_152"
127.0.0.1 - - [09/Apr/2018:12:52:14 +0000] "GET //localhost:31000/api/atlas/entities/7cd0c34e-cff6-4daa-9293-a2f0889ce190
HTTP/1.1" 200 1050 "-" "Java/1.8.0_152"
127.0.0.1 - - [09/Apr/2018:12:52:14 +0000] "GET //localhost:31000/api/atlas/v2/entity/uniqueAttribute/type/hive_table?attr:qualifiedName=default.tableioqnb3yfen@primary
HTTP/1.1" 404 154 "-" "Java/1.8.0_152"
127.0.0.1 - - [09/Apr/2018:12:52:19 +0000] "GET //localhost:31000/api/atlas/v2/entity/uniqueAttribute/type/hive_table?attr:qualifiedName=default.tableioqnb3yfen@primary
HTTP/1.1" 200 4983 "-" "Java/1.8.0_152"
127.0.0.1 - - [09/Apr/2018:12:52:19 +0000] "GET //localhost:31000/api/atlas/v2/entity/uniqueAttribute/type/hive_table?attr:qualifiedName=default.tableioqnb3yfen@primary
HTTP/1.1" 200 4983 "-" "Java/1.8.0_152"
127.0.0.1 - - [09/Apr/2018:12:52:19 +0000] "GET //localhost:31000/api/atlas/v2/entity/uniqueAttribute/type/hive_process?attr:qualifiedName=TRUNCATETABLE-%3E:default.tableioqnb3yfen@primary:1523278334000
HTTP/1.1" 200 1132 "-" "Java/1.8.0_152"
127.0.0.1 - - [09/Apr/2018:12:52:19 +0000] "GET //localhost:31000/api/atlas/v2/entity/uniqueAttribute/type/hive_process?attr:qualifiedName=TRUNCATETABLE-%3E:default.tableioqnb3yfen@primary:1523278334000
HTTP/1.1" 200 1132 "-" "Java/1.8.0_152"
127.0.0.1 - - [09/Apr/2018:12:52:19 +0000] "GET //localhost:31000/api/atlas/v2/entity/guid/aa26c435-6736-4a6b-8e1d-9bb85f48df79
HTTP/1.1" 200 1132 "-" "Java/1.8.0_152"
127.0.0.1 - - [09/Apr/2018:12:52:19 +0000] "GET //localhost:31000/api/atlas/v2/entity/guid/427bd1a9-cdc8-4926-8a05-fe58dcd2d6a5
HTTP/1.1" 200 4983 "-" "Java/1.8.0_152"
127.0.0.1 - - [09/Apr/2018:12:52:19 +0000] "GET //localhost:31000/api/atlas/v2/lineage/427bd1a9-cdc8-4926-8a05-fe58dcd2d6a5?depth=0&direction=INPUT
HTTP/1.1" 200 135 "-" "Java/1.8.0_152"
127.0.0.1 - - [09/Apr/2018:12:52:21 +0000] "GET //localhost:31000/api/atlas/v2/entity/uniqueAttribute/type/hive_process?attr:qualifiedName=QUERY:default.tablejslubj7mjl@primary:1523278339000-%3E
HTTP/1.1" 404 178 "-" "Java/1.8.0_152"
127.0.0.1 - - [09/Apr/2018:12:52:26 +0000] "GET //localhost:31000/api/atlas/v2/entity/uniqueAttribute/type/hive_process?attr:qualifiedName=QUERY:default.tablejslubj7mjl@primary:1523278339000-%3E
HTTP/1.1" 200 2018 "-" "Java/1.8.0_152"
127.0.0.1 - - [09/Apr/2018:12:52:26 +0000] "GET //localhost:31000/api/atlas/v2/entity/uniqueAttribute/type/hive_process?attr:qualifiedName=QUERY:default.tablejslubj7mjl@primary:1523278339000-%3E
HTTP/1.1" 200 2018 "-" "Java/1.8.0_152"
127.0.0.1 - - [09/Apr/2018:12:52:26 +0000] "GET //localhost:31000/api/atlas/v2/entity/guid/43833d51-8a28-4b98-adbf-4682e3b61117
HTTP/1.1" 200 2018 "-" "Java/1.8.0_152"
127.0.0.1 - - [09/Apr/2018:12:52:26 +0000] "GET //localhost:31000/api/atlas/v2/entity/guid/964d03ca-47b8-488b-8016-a3a43dd727f2
HTTP/1.1" 200 5150 "-" "Java/1.8.0_152"
127.0.0.1 - - [09/Apr/2018:12:52:26 +0000] "GET //localhost:31000/api/atlas/v2/entity/guid/f7845c6b-3d10-4f30-9f29-f317d7402685
HTTP/1.1" 200 1385 "-" "Java/1.8.0_152"
127.0.0.1 - - [09/Apr/2018:12:52:26 +0000] "GET //localhost:31000/api/atlas/v2/entity/uniqueAttribute/type/hdfs_path?attr:qualifiedName=pfile:/home/jenkins/jenkins-slave/workspace/atlas-master-integrationtests/addons/hive-bridge/target/somedfspath1-data-urevmcsi59
HTTP/1.1" 200 1385 "-" "Java/1.8.0_152"
127.0.0.1 - - [09/Apr/2018:12:52:26 +0000] "GET //localhost:31000/api/atlas/v2/entity/uniqueAttribute/type/hdfs_path?attr:qualifiedName=pfile:/home/jenkins/jenkins-slave/workspace/atlas-master-integrationtests/addons/hive-bridge/target/somedfspath1-data-urevmcsi59
HTTP/1.1" 200 1385 "-" "Java/1.8.0_152"
127.0.0.1 - - [09/Apr/2018:12:52:26 +0000] "GET //localhost:31000/api/atlas/v2/entity/uniqueAttribute/type/hive_table?attr:qualifiedName=default.tablejslubj7mjl@primary
HTTP/1.1" 200 5150 "-" "Java/1.8.0_152"
127.0.0.1 - - [09/Apr/2018:12:52:26 +0000] "GET //localhost:31000/api/atlas/v2/entity/uniqueAttribute/type/hive_table?attr:qualifiedName=default.tablejslubj7mjl@primary
HTTP/1.1" 200 5150 "-" "Java/1.8.0_152"
127.0.0.1 - - [09/Apr/2018:12:52:26 +0000] "GET //localhost:31000/api/atlas/v2/entity/guid/964d03ca-47b8-488b-8016-a3a43dd727f2
HTTP/1.1" 200 5150 "-" "Java/1.8.0_152"
127.0.0.1 - - [09/Apr/2018:12:52:29 +0000] "GET //localhost:31000/api/atlas/v2/entity/uniqueAttribute/type/hive_table?attr:qualifiedName=default.tablejslubj7mjl@primary
HTTP/1.1" 200 5150 "-" "Java/1.8.0_152"
127.0.0.1 - - [09/Apr/2018:12:52:29 +0000] "GET //localhost:31000/api/atlas/v2/entity/uniqueAttribute/type/hive_table?attr:qualifiedName=default.tablejslubj7mjl@primary
HTTP/1.1" 200 5150 "-" "Java/1.8.0_152"
127.0.0.1 - - [09/Apr/2018:12:52:29 +0000] "GET //localhost:31000/api/atlas/v2/entity/uniqueAttribute/type/hive_process?attr:qualifiedName=QUERY:default.tablejslubj7mjl@primary:1523278339000-%3E
HTTP/1.1" 200 2018 "-" "Java/1.8.0_152"
127.0.0.1 - - [09/Apr/2018:12:52:29 +0000] "GET //localhost:31000/api/atlas/v2/entity/uniqueAttribute/type/hive_process?attr:qualifiedName=QUERY:default.tablejslubj7mjl@primary:1523278339000-%3E
HTTP/1.1" 200 2018 "-" "Java/1.8.0_152"
127.0.0.1 - - [09/Apr/2018:12:52:29 +0000] "GET //localhost:31000/api/atlas/v2/entity/guid/43833d51-8a28-4b98-adbf-4682e3b61117
HTTP/1.1" 200 2018 "-" "Java/1.8.0_152"
127.0.0.1 - - [09/Apr/2018:12:52:29 +0000] "GET //localhost:31000/api/atlas/v2/entity/guid/964d03ca-47b8-488b-8016-a3a43dd727f2
HTTP/1.1" 200 5150 "-" "Java/1.8.0_152"
127.0.0.1 - - [09/Apr/2018:12:52:29 +0000] "GET //localhost:31000/api/atlas/v2/entity/guid/f7845c6b-3d10-4f30-9f29-f317d7402685
HTTP/1.1" 200 1385 "-" "Java/1.8.0_152"
127.0.0.1 - - [09/Apr/2018:12:52:29 +0000] "GET //localhost:31000/api/atlas/v2/entity/uniqueAttribute/type/hdfs_path?attr:qualifiedName=pfile:/home/jenkins/jenkins-slave/workspace/atlas-master-integrationtests/addons/hive-bridge/target/somedfspath1-data-urevmcsi59
HTTP/1.1" 200 1385 "-" "Java/1.8.0_152"
127.0.0.1 - - [09/Apr/2018:12:52:29 +0000] "GET //localhost:31000/api/atlas/v2/entity/uniqueAttribute/type/hdfs_path?attr:qualifiedName=pfile:/home/jenkins/jenkins-slave/workspace/atlas-master-integrationtests/addons/hive-bridge/target/somedfspath1-data-urevmcsi59
HTTP/1.1" 200 1385 "-" "Java/1.8.0_152"
127.0.0.1 - - [09/Apr/2018:12:52:32 +0000] "GET //localhost:31000/api/atlas/v2/entity/uniqueAttribute/type/hive_table?attr:qualifiedName=default.tablejslubj7mjl@primary
HTTP/1.1" 200 5150 "-" "Java/1.8.0_152"
127.0.0.1 - - [09/Apr/2018:12:52:32 +0000] "GET //localhost:31000/api/atlas/v2/entity/uniqueAttribute/type/hive_table?attr:qualifiedName=default.tablejslubj7mjl@primary
HTTP/1.1" 200 5150 "-" "Java/1.8.0_152"
127.0.0.1 - - [09/Apr/2018:12:52:32 +0000] "GET //localhost:31000/api/atlas/v2/entity/uniqueAttribute/type/hive_process?attr:qualifiedName=QUERY:default.tablejslubj7mjl@primary:1523278339000-%3E
HTTP/1.1" 200 2421 "-" "Java/1.8.0_152"
127.0.0.1 - - [09/Apr/2018:12:52:32 +0000] "GET //localhost:31000/api/atlas/v2/entity/uniqueAttribute/type/hive_process?attr:qualifiedName=QUERY:default.tablejslubj7mjl@primary:1523278339000-%3E
HTTP/1.1" 200 2421 "-" "Java/1.8.0_152"
127.0.0.1 - - [09/Apr/2018:12:52:32 +0000] "GET //localhost:31000/api/atlas/v2/entity/guid/43833d51-8a28-4b98-adbf-4682e3b61117
HTTP/1.1" 200 2421 "-" "Java/1.8.0_152"
127.0.0.1 - - [09/Apr/2018:12:52:32 +0000] "GET //localhost:31000/api/atlas/v2/entity/guid/964d03ca-47b8-488b-8016-a3a43dd727f2
HTTP/1.1" 200 5150 "-" "Java/1.8.0_152"
127.0.0.1 - - [09/Apr/2018:12:52:32 +0000] "GET //localhost:31000/api/atlas/v2/entity/guid/55afb611-45c1-41c6-8973-9add0d36ff84
HTTP/1.1" 200 1385 "-" "Java/1.8.0_152"
127.0.0.1 - - [09/Apr/2018:12:52:32 +0000] "GET //localhost:31000/api/atlas/v2/entity/guid/f7845c6b-3d10-4f30-9f29-f317d7402685
HTTP/1.1" 200 1385 "-" "Java/1.8.0_152"
127.0.0.1 - - [09/Apr/2018:12:52:32 +0000] "GET //localhost:31000/api/atlas/v2/entity/uniqueAttribute/type/hdfs_path?attr:qualifiedName=pfile:/home/jenkins/jenkins-slave/workspace/atlas-master-integrationtests/addons/hive-bridge/target/somedfspath2-data-wi2wyonvbg
HTTP/1.1" 200 1385 "-" "Java/1.8.0_152"
127.0.0.1 - - [09/Apr/2018:12:52:32 +0000] "GET //localhost:31000/api/atlas/v2/entity/uniqueAttribute/type/hdfs_path?attr:qualifiedName=pfile:/home/jenkins/jenkins-slave/workspace/atlas-master-integrationtests/addons/hive-bridge/target/somedfspath2-data-wi2wyonvbg
HTTP/1.1" 200 1385 "-" "Java/1.8.0_152"
Tests run: 46, Failures: 3, Errors: 0, Skipped: 0, Time elapsed: 473.485 sec <<<
FAILURE! - in TestSuite
testCreateTableHiveProcessNameAttribute(org.apache.atlas.hive.bridge.HiveMetastoreBridgeIT)
 Time elapsed: 0.038 sec  <<< FAILURE!
java.lang.AssertionError: expected [0] but found [40000]
	at org.testng.Assert.fail(Assert.java:94)
	at org.testng.Assert.failNotEquals(Assert.java:496)
	at org.testng.Assert.assertEquals(Assert.java:125)
	at org.testng.Assert.assertEquals(Assert.java:372)
	at org.testng.Assert.assertEquals(Assert.java:382)
	at org.apache.atlas.hive.HiveITBase.runCommandWithDelay(HiveITBase.java:154)
	at org.apache.atlas.hive.HiveITBase.runCommandWithDelay(HiveITBase.java:147)
	at org.apache.atlas.hive.HiveITBase.runCommand(HiveITBase.java:139)
	at org.apache.atlas.hive.bridge.HiveMetastoreBridgeIT.testCreateTableHiveProcessNameAttribute(HiveMetastoreBridgeIT.java:105)

testAlterTablePartitionColumnType(org.apache.atlas.hive.hook.HiveHookIT)  Time elapsed: 80.488
sec  <<< FAILURE!
java.lang.AssertionError: Assertions failed. Failing after waiting for timeout 80000 msecs
	at org.apache.atlas.AtlasBaseClient.callAPIWithResource(AtlasBaseClient.java:388)
	at org.apache.atlas.AtlasBaseClient.callAPIWithResource(AtlasBaseClient.java:323)
	at org.apache.atlas.AtlasBaseClient.callAPI(AtlasBaseClient.java:228)
	at org.apache.atlas.AtlasClientV2.getEntityByAttribute(AtlasClientV2.java:264)
	at org.apache.atlas.hive.HiveITBase$1.evaluate(HiveITBase.java:209)
	at org.apache.atlas.hive.HiveITBase.waitFor(HiveITBase.java:266)
	at org.apache.atlas.hive.HiveITBase.assertEntityIsRegistered(HiveITBase.java:206)
	at org.apache.atlas.hive.hook.HiveHookIT.assertColumnIsRegistered(HiveHookIT.java:288)
	at org.apache.atlas.hive.hook.HiveHookIT.testAlterTablePartitionColumnType(HiveHookIT.java:1309)

testAlterTableRename(org.apache.atlas.hive.hook.HiveHookIT)  Time elapsed: 13.828 sec  <<<
FAILURE!
java.lang.IndexOutOfBoundsException: Index: 0, Size: 0
	at java.util.ArrayList.rangeCheck(ArrayList.java:657)
	at java.util.ArrayList.get(ArrayList.java:433)
	at org.apache.atlas.hive.hook.HiveHookIT.assertTrait(HiveHookIT.java:1018)
	at org.apache.atlas.hive.hook.HiveHookIT.testAlterTableRename(HiveHookIT.java:970)


Results :

Failed tests: 
  HiveMetastoreBridgeIT.testCreateTableHiveProcessNameAttribute:105->HiveITBase.runCommand:139->HiveITBase.runCommandWithDelay:147->HiveITBase.runCommandWithDelay:154
expected [0] but found [40000]
  HiveHookIT.testAlterTablePartitionColumnType:1309->assertColumnIsRegistered:288->HiveITBase.assertEntityIsRegistered:206->HiveITBase.waitFor:270
Assertions failed. Failing after waiting for timeout 80000 msecs
  HiveHookIT.testAlterTableRename:970->assertTrait:1018 » IndexOutOfBounds Index...

Tests run: 46, Failures: 3, Errors: 0, Skipped: 0

[INFO] 
[INFO] --- jetty-maven-plugin:9.3.14.v20161028:stop (stop-jetty) @ hive-bridge ---
[INFO] Waiting 10 seconds for jetty to stop
[INFO] Stopped ServerConnector@1e9c5107{HTTP/1.1,[http/1.1]}{0.0.0.0:31000}
[INFO] Closing Spring root WebApplicationContext
[INFO] Shutting down log4j
[INFO] Stopped o.e.j.m.p.JettyWebAppContext@65ac8d9c{/,file://<https://builds.apache.org/job/Atlas-master-IntegrationTests/ws/webapp/target/atlas-webapp-1.0.0-SNAPSHOT/,UNAVAILABLE}{/home/jenkins/jenkins-slave/workspace/Atlas-master-IntegrationTests/webapp/target/atlas-webapp-1.0.0-SNAPSHOT.war}>
[INFO] Server reports itself as stopped
[INFO] 
[INFO] --- maven-source-plugin:2.4:jar-no-fork (attach-sources) @ hive-bridge ---
[INFO] Building jar: <https://builds.apache.org/job/Atlas-master-IntegrationTests/ws/addons/hive-bridge/target/hive-bridge-1.0.0-SNAPSHOT-sources.jar>
[INFO] 
[INFO] --- maven-source-plugin:2.4:test-jar-no-fork (attach-sources) @ hive-bridge ---
[INFO] Building jar: <https://builds.apache.org/job/Atlas-master-IntegrationTests/ws/addons/hive-bridge/target/hive-bridge-1.0.0-SNAPSHOT-test-sources.jar>
[INFO] 
[INFO] --- maven-failsafe-plugin:2.18.1:verify (verify) @ hive-bridge ---
[INFO] Failsafe report directory: <https://builds.apache.org/job/Atlas-master-IntegrationTests/ws/addons/hive-bridge/target/failsafe-reports>
[INFO] ------------------------------------------------------------------------
[INFO] Reactor Summary:
[INFO] 
[INFO] Apache Atlas Server Build Tools .................... SUCCESS [  0.637 s]
[INFO] apache-atlas ....................................... SUCCESS [  4.218 s]
[INFO] Apache Atlas Test Utility Tools .................... SUCCESS [ 10.087 s]
[INFO] Open Connector Framework (OCF) ..................... SUCCESS [ 10.334 s]
[INFO] Open Metadata Repository Services (OMRS) ........... SUCCESS [ 31.109 s]
[INFO] Open Metadata and Governance (OMAG) Server APIs .... SUCCESS [  8.056 s]
[INFO] Apache Atlas Integration ........................... SUCCESS [ 19.569 s]
[INFO] Apache Atlas Common ................................ SUCCESS [  8.121 s]
[INFO] Apache Atlas Client ................................ SUCCESS [  0.531 s]
[INFO] atlas-client-common ................................ SUCCESS [  7.140 s]
[INFO] atlas-client-v1 .................................... SUCCESS [  7.215 s]
[INFO] Apache Atlas Server API ............................ SUCCESS [  5.401 s]
[INFO] Apache Atlas Notification .......................... SUCCESS [  9.193 s]
[INFO] atlas-client-v2 .................................... SUCCESS [  6.000 s]
[INFO] Apache Atlas Graph Database Projects ............... SUCCESS [  0.456 s]
[INFO] Apache Atlas Graph Database API .................... SUCCESS [  5.019 s]
[INFO] Graph Database Common Code ......................... SUCCESS [  5.292 s]
[INFO] Apache Atlas JanusGraph DB Impl .................... SUCCESS [ 16.765 s]
[INFO] Apache Atlas Graph Database Implementation Dependencies SUCCESS [  2.387 s]
[INFO] Shaded version of Apache hbase client .............. SUCCESS [  8.413 s]
[INFO] Apache Atlas Titan 0.5.4 Graph DB Impl ............. SUCCESS [ 39.329 s]
[INFO] Shaded version of Apache hbase server .............. SUCCESS [ 21.710 s]
[INFO] Apache Atlas Authorization ......................... SUCCESS [  6.879 s]
[INFO] Apache Atlas Repository ............................ SUCCESS [ 31.646 s]
[INFO] Apache Atlas UI .................................... SUCCESS [01:19 min]
[INFO] Apache Atlas Web Application ....................... SUCCESS [04:32 min]
[INFO] Apache Atlas Documentation ......................... SUCCESS [  3.251 s]
[INFO] Apache Atlas FileSystem Model ...................... SUCCESS [  2.887 s]
[INFO] Apache Atlas Plugin Classloader .................... SUCCESS [  6.124 s]
[INFO] Apache Atlas Hive Bridge Shim ...................... SUCCESS [  5.254 s]
[INFO] Apache Atlas Hive Bridge ........................... FAILURE [08:47 min]
[INFO] Apache Atlas Falcon Bridge Shim .................... SKIPPED
[INFO] Apache Atlas Falcon Bridge ......................... SKIPPED
[INFO] Apache Atlas Sqoop Bridge Shim ..................... SKIPPED
[INFO] Apache Atlas Sqoop Bridge .......................... SKIPPED
[INFO] Apache Atlas Storm Bridge Shim ..................... SKIPPED
[INFO] Apache Atlas Storm Bridge .......................... SKIPPED
[INFO] Apache Atlas Hbase Bridge Shim ..................... SKIPPED
[INFO] Apache Atlas Hbase Bridge .......................... SKIPPED
[INFO] Apache Atlas Migration Exporter .................... SKIPPED
[INFO] Apache Atlas Distribution .......................... SKIPPED
[INFO] ------------------------------------------------------------------------
[INFO] BUILD FAILURE
[INFO] ------------------------------------------------------------------------
[INFO] Total time: 19:24 min
[INFO] Finished at: 2018-04-09T12:52:35Z
[INFO] Final Memory: 599M/2340M
[INFO] ------------------------------------------------------------------------
log4j:WARN No appenders could be found for logger (org.apache.zookeeper.ClientCnxn).
log4j:WARN Please initialize the log4j system properly.
log4j:WARN See http://logging.apache.org/log4j/1.2/faq.html#noconfig for more info.
[ERROR] Failed to execute goal org.apache.maven.plugins:maven-failsafe-plugin:2.18.1:verify
(verify) on project hive-bridge: There are test failures.
[ERROR] 
[ERROR] Please refer to <https://builds.apache.org/job/Atlas-master-IntegrationTests/ws/addons/hive-bridge/target/failsafe-reports>
for the individual test results.
[ERROR] -> [Help 1]
[ERROR] 
[ERROR] To see the full stack trace of the errors, re-run Maven with the -e switch.
[ERROR] Re-run Maven using the -X switch to enable full debug logging.
[ERROR] 
[ERROR] For more information about the errors and possible solutions, please read the following
articles:
[ERROR] [Help 1] http://cwiki.apache.org/confluence/display/MAVEN/MojoFailureException
[ERROR] 
[ERROR] After correcting the problems, you can resume the build with the command
[ERROR]   mvn <goals> -rf :hive-bridge
Build step 'Execute shell' marked build as failure
[CHECKSTYLE] Collecting checkstyle analysis files...
[CHECKSTYLE] Searching for all files in <https://builds.apache.org/job/Atlas-master-IntegrationTests/ws/>
that match the pattern **/target/checkstyle-result.xml
[CHECKSTYLE] Parsing 29 files in <https://builds.apache.org/job/Atlas-master-IntegrationTests/ws/>
[CHECKSTYLE] Successfully parsed file <https://builds.apache.org/job/Atlas-master-IntegrationTests/ws/addons/hdfs-model/target/checkstyle-result.xml>
with 0 unique warnings and 0 duplicates.
[CHECKSTYLE] Successfully parsed file <https://builds.apache.org/job/Atlas-master-IntegrationTests/ws/addons/hive-bridge-shim/target/checkstyle-result.xml>
with 15 unique warnings and 0 duplicates.
[CHECKSTYLE] Successfully parsed file <https://builds.apache.org/job/Atlas-master-IntegrationTests/ws/authorization/target/checkstyle-result.xml>
with 684 unique warnings and 0 duplicates.
[CHECKSTYLE] Successfully parsed file <https://builds.apache.org/job/Atlas-master-IntegrationTests/ws/client/client-v1/target/checkstyle-result.xml>
with 1568 unique warnings and 0 duplicates.
[CHECKSTYLE] Successfully parsed file <https://builds.apache.org/job/Atlas-master-IntegrationTests/ws/client/client-v2/target/checkstyle-result.xml>
with 1927 unique warnings and 0 duplicates.
[CHECKSTYLE] Successfully parsed file <https://builds.apache.org/job/Atlas-master-IntegrationTests/ws/client/common/target/checkstyle-result.xml>
with 2415 unique warnings and 0 duplicates.
[CHECKSTYLE] Successfully parsed file <https://builds.apache.org/job/Atlas-master-IntegrationTests/ws/client/target/checkstyle-result.xml>
with 2415 unique warnings and 0 duplicates.
[CHECKSTYLE] Successfully parsed file <https://builds.apache.org/job/Atlas-master-IntegrationTests/ws/common/target/checkstyle-result.xml>
with 3463 unique warnings and 0 duplicates.
[CHECKSTYLE] Successfully parsed file <https://builds.apache.org/job/Atlas-master-IntegrationTests/ws/dashboardv2/target/checkstyle-result.xml>
with 3463 unique warnings and 0 duplicates.
[CHECKSTYLE] Successfully parsed file <https://builds.apache.org/job/Atlas-master-IntegrationTests/ws/docs/target/checkstyle-result.xml>
with 3463 unique warnings and 0 duplicates.
[CHECKSTYLE] Successfully parsed file <https://builds.apache.org/job/Atlas-master-IntegrationTests/ws/graphdb/api/target/checkstyle-result.xml>
with 3757 unique warnings and 0 duplicates.
[CHECKSTYLE] Successfully parsed file <https://builds.apache.org/job/Atlas-master-IntegrationTests/ws/graphdb/common/target/checkstyle-result.xml>
with 3966 unique warnings and 0 duplicates.
[CHECKSTYLE] Successfully parsed file <https://builds.apache.org/job/Atlas-master-IntegrationTests/ws/graphdb/graphdb-impls/target/checkstyle-result.xml>
with 3966 unique warnings and 0 duplicates.
[CHECKSTYLE] Successfully parsed file <https://builds.apache.org/job/Atlas-master-IntegrationTests/ws/graphdb/janus/target/checkstyle-result.xml>
with 5658 unique warnings and 0 duplicates.
[CHECKSTYLE] Successfully parsed file <https://builds.apache.org/job/Atlas-master-IntegrationTests/ws/graphdb/target/checkstyle-result.xml>
with 5658 unique warnings and 0 duplicates.
[CHECKSTYLE] Successfully parsed file <https://builds.apache.org/job/Atlas-master-IntegrationTests/ws/graphdb/titan0/target/checkstyle-result.xml>
with 8159 unique warnings and 0 duplicates.
[CHECKSTYLE] Successfully parsed file <https://builds.apache.org/job/Atlas-master-IntegrationTests/ws/intg/target/checkstyle-result.xml>
with 19170 unique warnings and 0 duplicates.
[CHECKSTYLE] Successfully parsed file <https://builds.apache.org/job/Atlas-master-IntegrationTests/ws/notification/target/checkstyle-result.xml>
with 20406 unique warnings and 0 duplicates.
[CHECKSTYLE] Successfully parsed file <https://builds.apache.org/job/Atlas-master-IntegrationTests/ws/om-fwk-ocf/target/checkstyle-result.xml>
with 25448 unique warnings and 0 duplicates.
[CHECKSTYLE] Successfully parsed file <https://builds.apache.org/job/Atlas-master-IntegrationTests/ws/omag-api/target/checkstyle-result.xml>
with 26794 unique warnings and 0 duplicates.
[CHECKSTYLE] Successfully parsed file <https://builds.apache.org/job/Atlas-master-IntegrationTests/ws/omrs/target/checkstyle-result.xml>
with 64423 unique warnings and 0 duplicates.
[CHECKSTYLE] Successfully parsed file <https://builds.apache.org/job/Atlas-master-IntegrationTests/ws/plugin-classloader/target/checkstyle-result.xml>
with 64536 unique warnings and 0 duplicates.
[CHECKSTYLE] Successfully parsed file <https://builds.apache.org/job/Atlas-master-IntegrationTests/ws/repository/target/checkstyle-result.xml>
with 84294 unique warnings and 0 duplicates.
[CHECKSTYLE] Successfully parsed file <https://builds.apache.org/job/Atlas-master-IntegrationTests/ws/server-api/target/checkstyle-result.xml>
with 84445 unique warnings and 0 duplicates.
[CHECKSTYLE] Successfully parsed file <https://builds.apache.org/job/Atlas-master-IntegrationTests/ws/shaded/hbase-client-shaded/target/checkstyle-result.xml>
with 84445 unique warnings and 0 duplicates.
[CHECKSTYLE] Successfully parsed file <https://builds.apache.org/job/Atlas-master-IntegrationTests/ws/shaded/hbase-server-shaded/target/checkstyle-result.xml>
with 84445 unique warnings and 0 duplicates.
[CHECKSTYLE] Successfully parsed file <https://builds.apache.org/job/Atlas-master-IntegrationTests/ws/target/checkstyle-result.xml>
with 84445 unique warnings and 0 duplicates.
[CHECKSTYLE] Successfully parsed file <https://builds.apache.org/job/Atlas-master-IntegrationTests/ws/test-tools/target/checkstyle-result.xml>
with 84483 unique warnings and 0 duplicates.
[CHECKSTYLE] Successfully parsed file <https://builds.apache.org/job/Atlas-master-IntegrationTests/ws/webapp/target/checkstyle-result.xml>
with 92484 unique warnings and 0 duplicates.
<Git Blamer> Using GitBlamer to create author and commit information for all warnings.
<Git Blamer> GIT_COMMIT=cd686f6fc97cf2de4fe0c152476444d3544e4dd1, workspace=<https://builds.apache.org/job/Atlas-master-IntegrationTests/ws/>
 > git rev-parse cd686f6fc97cf2de4fe0c152476444d3544e4dd1^{commit} # timeout=10
[CHECKSTYLE] Computing warning deltas based on reference build #950
[FINDBUGS] Collecting findbugs analysis files...
[FINDBUGS] Searching for all files in <https://builds.apache.org/job/Atlas-master-IntegrationTests/ws/>
that match the pattern **/target/findbugs.xml
[FINDBUGS] Parsing 20 files in <https://builds.apache.org/job/Atlas-master-IntegrationTests/ws/>
[FINDBUGS] Successfully parsed file <https://builds.apache.org/job/Atlas-master-IntegrationTests/ws/addons/hive-bridge-shim/target/findbugs.xml>
with 0 unique warnings and 0 duplicates.
[FINDBUGS] Successfully parsed file <https://builds.apache.org/job/Atlas-master-IntegrationTests/ws/authorization/target/findbugs.xml>
with 0 unique warnings and 0 duplicates.
[FINDBUGS] Successfully parsed file <https://builds.apache.org/job/Atlas-master-IntegrationTests/ws/client/client-v1/target/findbugs.xml>
with 0 unique warnings and 0 duplicates.
[FINDBUGS] Successfully parsed file <https://builds.apache.org/job/Atlas-master-IntegrationTests/ws/client/client-v2/target/findbugs.xml>
with 0 unique warnings and 0 duplicates.
[FINDBUGS] Successfully parsed file <https://builds.apache.org/job/Atlas-master-IntegrationTests/ws/client/common/target/findbugs.xml>
with 0 unique warnings and 0 duplicates.
[FINDBUGS] Successfully parsed file <https://builds.apache.org/job/Atlas-master-IntegrationTests/ws/common/target/findbugs.xml>
with 0 unique warnings and 0 duplicates.
[FINDBUGS] Successfully parsed file <https://builds.apache.org/job/Atlas-master-IntegrationTests/ws/graphdb/api/target/findbugs.xml>
with 0 unique warnings and 0 duplicates.
[FINDBUGS] Successfully parsed file <https://builds.apache.org/job/Atlas-master-IntegrationTests/ws/graphdb/common/target/findbugs.xml>
with 0 unique warnings and 0 duplicates.
[FINDBUGS] Successfully parsed file <https://builds.apache.org/job/Atlas-master-IntegrationTests/ws/graphdb/janus/target/findbugs.xml>
with 0 unique warnings and 0 duplicates.
[FINDBUGS] Successfully parsed file <https://builds.apache.org/job/Atlas-master-IntegrationTests/ws/graphdb/titan0/target/findbugs.xml>
with 0 unique warnings and 0 duplicates.
[FINDBUGS] Successfully parsed file <https://builds.apache.org/job/Atlas-master-IntegrationTests/ws/intg/target/findbugs.xml>
with 0 unique warnings and 0 duplicates.
[FINDBUGS] Successfully parsed file <https://builds.apache.org/job/Atlas-master-IntegrationTests/ws/notification/target/findbugs.xml>
with 0 unique warnings and 0 duplicates.
[FINDBUGS] Successfully parsed file <https://builds.apache.org/job/Atlas-master-IntegrationTests/ws/om-fwk-ocf/target/findbugs.xml>
with 0 unique warnings and 0 duplicates.
[FINDBUGS] Successfully parsed file <https://builds.apache.org/job/Atlas-master-IntegrationTests/ws/omag-api/target/findbugs.xml>
with 0 unique warnings and 0 duplicates.
[FINDBUGS] Successfully parsed file <https://builds.apache.org/job/Atlas-master-IntegrationTests/ws/omrs/target/findbugs.xml>
with 0 unique warnings and 0 duplicates.
[FINDBUGS] Successfully parsed file <https://builds.apache.org/job/Atlas-master-IntegrationTests/ws/plugin-classloader/target/findbugs.xml>
with 0 unique warnings and 0 duplicates.
[FINDBUGS] Successfully parsed file <https://builds.apache.org/job/Atlas-master-IntegrationTests/ws/repository/target/findbugs.xml>
with 0 unique warnings and 0 duplicates.
[FINDBUGS] Successfully parsed file <https://builds.apache.org/job/Atlas-master-IntegrationTests/ws/server-api/target/findbugs.xml>
with 0 unique warnings and 0 duplicates.
[FINDBUGS] Successfully parsed file <https://builds.apache.org/job/Atlas-master-IntegrationTests/ws/test-tools/target/findbugs.xml>
with 0 unique warnings and 0 duplicates.
[FINDBUGS] Successfully parsed file <https://builds.apache.org/job/Atlas-master-IntegrationTests/ws/webapp/target/findbugs.xml>
with 0 unique warnings and 0 duplicates.
<Git Blamer> Using GitBlamer to create author and commit information for all warnings.
<Git Blamer> GIT_COMMIT=cd686f6fc97cf2de4fe0c152476444d3544e4dd1, workspace=<https://builds.apache.org/job/Atlas-master-IntegrationTests/ws/>
[FINDBUGS] Computing warning deltas based on reference build #950
Archiving artifacts
[Fast Archiver] Compressed 167.45 MB of artifacts by 65.9% relative to #950
TestNG Reports Processing: START
Looking for TestNG results report in workspace using pattern: **/target/surefire-reports/testng-results.xml,**/target/failsafe-reports/testng-results.xml
Saving reports...
Processing '/x1/jenkins/jenkins-home/jobs/Atlas-master-IntegrationTests/builds/995/testng/testng-results-1.xml'
Processing '/x1/jenkins/jenkins-home/jobs/Atlas-master-IntegrationTests/builds/995/testng/testng-results.xml'
1.744186% of tests failed, which exceeded threshold of 0%. Marking build as UNSTABLE
TestNG Reports Processing: FINISH

Mime
View raw message