atlas-dev mailing list archives

Site index · List index
Message view « Date » · « Thread »
Top « Date » · « Thread »
From Apache Jenkins Server <jenk...@builds.apache.org>
Subject Build failed in Jenkins: Atlas-master-IntegrationTests #974
Date Sat, 07 Apr 2018 01:08:13 GMT
See <https://builds.apache.org/job/Atlas-master-IntegrationTests/974/display/redirect>

------------------------------------------
[...truncated 682.83 KB...]
127.0.0.1 - - [07/Apr/2018:00:51:41 +0000] "GET //localhost:31000/api/atlas/v2/entity/guid/478be35e-dc33-4654-b0cf-c15f2c3d62e8
HTTP/1.1" 200 2018 "-" "Java/1.8.0_152"
127.0.0.1 - - [07/Apr/2018:00:51:41 +0000] "GET //localhost:31000/api/atlas/v2/entity/guid/a0cb7b30-dfd5-4cd0-bedb-918991f91324
HTTP/1.1" 200 5150 "-" "Java/1.8.0_152"
127.0.0.1 - - [07/Apr/2018:00:51:41 +0000] "GET //localhost:31000/api/atlas/v2/entity/guid/c704ace4-52af-4d24-9d13-2ba7c64c740d
HTTP/1.1" 200 1385 "-" "Java/1.8.0_152"
127.0.0.1 - - [07/Apr/2018:00:51:41 +0000] "GET //localhost:31000/api/atlas/v2/entity/uniqueAttribute/type/hdfs_path?attr:qualifiedName=pfile:/home/jenkins/jenkins-slave/workspace/atlas-master-integrationtests/addons/hive-bridge/target/somedfspath1-data-t6cev6r7i6
HTTP/1.1" 200 1385 "-" "Java/1.8.0_152"
127.0.0.1 - - [07/Apr/2018:00:51:41 +0000] "GET //localhost:31000/api/atlas/v2/entity/uniqueAttribute/type/hdfs_path?attr:qualifiedName=pfile:/home/jenkins/jenkins-slave/workspace/atlas-master-integrationtests/addons/hive-bridge/target/somedfspath1-data-t6cev6r7i6
HTTP/1.1" 200 1385 "-" "Java/1.8.0_152"
127.0.0.1 - - [07/Apr/2018:00:51:44 +0000] "GET //localhost:31000/api/atlas/v2/entity/uniqueAttribute/type/hive_table?attr:qualifiedName=default.tablecc82cxntcn@primary
HTTP/1.1" 200 5150 "-" "Java/1.8.0_152"
127.0.0.1 - - [07/Apr/2018:00:51:44 +0000] "GET //localhost:31000/api/atlas/v2/entity/uniqueAttribute/type/hive_table?attr:qualifiedName=default.tablecc82cxntcn@primary
HTTP/1.1" 200 5150 "-" "Java/1.8.0_152"
127.0.0.1 - - [07/Apr/2018:00:51:44 +0000] "GET //localhost:31000/api/atlas/v2/entity/uniqueAttribute/type/hive_process?attr:qualifiedName=QUERY:default.tablecc82cxntcn@primary:1523062291000-%3E
HTTP/1.1" 200 2421 "-" "Java/1.8.0_152"
127.0.0.1 - - [07/Apr/2018:00:51:45 +0000] "GET //localhost:31000/api/atlas/v2/entity/uniqueAttribute/type/hive_process?attr:qualifiedName=QUERY:default.tablecc82cxntcn@primary:1523062291000-%3E
HTTP/1.1" 200 2421 "-" "Java/1.8.0_152"
127.0.0.1 - - [07/Apr/2018:00:51:45 +0000] "GET //localhost:31000/api/atlas/v2/entity/guid/478be35e-dc33-4654-b0cf-c15f2c3d62e8
HTTP/1.1" 200 2421 "-" "Java/1.8.0_152"
127.0.0.1 - - [07/Apr/2018:00:51:45 +0000] "GET //localhost:31000/api/atlas/v2/entity/guid/a0cb7b30-dfd5-4cd0-bedb-918991f91324
HTTP/1.1" 200 5150 "-" "Java/1.8.0_152"
127.0.0.1 - - [07/Apr/2018:00:51:45 +0000] "GET //localhost:31000/api/atlas/v2/entity/guid/1b85e40b-ef3b-4d4e-983d-06a90e3641de
HTTP/1.1" 200 1385 "-" "Java/1.8.0_152"
127.0.0.1 - - [07/Apr/2018:00:51:45 +0000] "GET //localhost:31000/api/atlas/v2/entity/guid/c704ace4-52af-4d24-9d13-2ba7c64c740d
HTTP/1.1" 200 1385 "-" "Java/1.8.0_152"
127.0.0.1 - - [07/Apr/2018:00:51:45 +0000] "GET //localhost:31000/api/atlas/v2/entity/uniqueAttribute/type/hdfs_path?attr:qualifiedName=pfile:/home/jenkins/jenkins-slave/workspace/atlas-master-integrationtests/addons/hive-bridge/target/somedfspath2-data-6qgl7bkle0
HTTP/1.1" 200 1385 "-" "Java/1.8.0_152"
127.0.0.1 - - [07/Apr/2018:00:51:45 +0000] "GET //localhost:31000/api/atlas/v2/entity/uniqueAttribute/type/hdfs_path?attr:qualifiedName=pfile:/home/jenkins/jenkins-slave/workspace/atlas-master-integrationtests/addons/hive-bridge/target/somedfspath2-data-6qgl7bkle0
HTTP/1.1" 200 1385 "-" "Java/1.8.0_152"
127.0.0.1 - - [07/Apr/2018:00:51:46 +0000] "GET //localhost:31000/api/atlas/v2/entity/uniqueAttribute/type/hive_db?attr:qualifiedName=default@primary
HTTP/1.1" 200 14242 "-" "Java/1.8.0_152"
127.0.0.1 - - [07/Apr/2018:00:51:46 +0000] "GET //localhost:31000/api/atlas/v2/entity/uniqueAttribute/type/hive_db?attr:qualifiedName=default@primary
HTTP/1.1" 200 14242 "-" "Java/1.8.0_152"
127.0.0.1 - - [07/Apr/2018:00:51:46 +0000] "GET //localhost:31000/api/atlas/v2/entity/uniqueAttribute/type/hive_table?attr:qualifiedName=default.tableqflgd8xnnp@primary
HTTP/1.1" 404 154 "-" "Java/1.8.0_152"
127.0.0.1 - - [07/Apr/2018:00:51:51 +0000] "GET //localhost:31000/api/atlas/v2/entity/uniqueAttribute/type/hive_table?attr:qualifiedName=default.tableqflgd8xnnp@primary
HTTP/1.1" 200 5133 "-" "Java/1.8.0_152"
127.0.0.1 - - [07/Apr/2018:00:51:51 +0000] "GET //localhost:31000/api/atlas/v2/entity/uniqueAttribute/type/hive_table?attr:qualifiedName=default.tableqflgd8xnnp@primary
HTTP/1.1" 200 5133 "-" "Java/1.8.0_152"
127.0.0.1 - - [07/Apr/2018:00:51:51 +0000] "GET //localhost:31000/api/atlas/v2/entity/uniqueAttribute/type/hive_process?attr:qualifiedName=default.tableqflgd8xnnp@primary:1523062305000
HTTP/1.1" 200 2017 "-" "Java/1.8.0_152"
127.0.0.1 - - [07/Apr/2018:00:51:51 +0000] "GET //localhost:31000/api/atlas/v2/entity/uniqueAttribute/type/hive_process?attr:qualifiedName=default.tableqflgd8xnnp@primary:1523062305000
HTTP/1.1" 200 2017 "-" "Java/1.8.0_152"
127.0.0.1 - - [07/Apr/2018:00:51:51 +0000] "GET //localhost:31000/api/atlas/v2/entity/guid/d1716952-2fae-426d-930c-de7f3dcc062e
HTTP/1.1" 200 2017 "-" "Java/1.8.0_152"
127.0.0.1 - - [07/Apr/2018:00:51:51 +0000] "GET //localhost:31000/api/atlas/v2/entity/uniqueAttribute/type/hdfs_path?attr:qualifiedName=pfile:/home/jenkins/jenkins-slave/workspace/atlas-master-integrationtests/addons/hive-bridge/target/parentpath-data-czaisrzscg
HTTP/1.1" 200 1379 "-" "Java/1.8.0_152"
127.0.0.1 - - [07/Apr/2018:00:51:51 +0000] "GET //localhost:31000/api/atlas/v2/entity/uniqueAttribute/type/hdfs_path?attr:qualifiedName=pfile:/home/jenkins/jenkins-slave/workspace/atlas-master-integrationtests/addons/hive-bridge/target/parentpath-data-czaisrzscg
HTTP/1.1" 200 1379 "-" "Java/1.8.0_152"
127.0.0.1 - - [07/Apr/2018:00:51:51 +0000] "GET //localhost:31000/api/atlas/entities?type=hive_table
HTTP/1.1" 200 2731 "-" "Java/1.8.0_152"
127.0.0.1 - - [07/Apr/2018:00:51:51 +0000] "GET //localhost:31000/api/atlas/v2/entity/guid/85edd23d-8990-485f-b553-977767b51802
HTTP/1.1" 200 14459 "-" "Java/1.8.0_152"
127.0.0.1 - - [07/Apr/2018:00:51:51 +0000] "GET //localhost:31000/api/atlas/v2/entity/uniqueAttribute/type/hive_table?attr:qualifiedName=default.tableqflgd8xnnp@primary
HTTP/1.1" 200 5133 "-" "Java/1.8.0_152"
127.0.0.1 - - [07/Apr/2018:00:51:51 +0000] "POST //localhost:31000/api/atlas/v2/entity/ HTTP/1.1"
200 387 "-" "Java/1.8.0_152"
127.0.0.1 - - [07/Apr/2018:00:51:51 +0000] "GET //localhost:31000/api/atlas/v2/entity/uniqueAttribute/type/hive_process?attr:qualifiedName=default.tableqflgd8xnnp@primary:1523062305000
HTTP/1.1" 200 2017 "-" "Java/1.8.0_152"
127.0.0.1 - - [07/Apr/2018:00:51:51 +0000] "GET //localhost:31000/api/atlas/v2/entity/uniqueAttribute/type/hive_table?attr:qualifiedName=default.tableqflgd8xnnp@primary
HTTP/1.1" 200 5131 "-" "Java/1.8.0_152"
127.0.0.1 - - [07/Apr/2018:00:51:51 +0000] "GET //localhost:31000/api/atlas/v2/entity/uniqueAttribute/type/hive_table?attr:qualifiedName=default.tableqflgd8xnnp@primary
HTTP/1.1" 200 5131 "-" "Java/1.8.0_152"
127.0.0.1 - - [07/Apr/2018:00:51:51 +0000] "GET //localhost:31000/api/atlas/v2/entity/uniqueAttribute/type/hive_process?attr:qualifiedName=default.tableqflgd8xnnp@primary:1523062305000
HTTP/1.1" 200 2017 "-" "Java/1.8.0_152"
127.0.0.1 - - [07/Apr/2018:00:51:51 +0000] "GET //localhost:31000/api/atlas/v2/entity/uniqueAttribute/type/hive_process?attr:qualifiedName=default.tableqflgd8xnnp@primary:1523062305000
HTTP/1.1" 200 2017 "-" "Java/1.8.0_152"
127.0.0.1 - - [07/Apr/2018:00:51:51 +0000] "GET //localhost:31000/api/atlas/entities?type=hive_table
HTTP/1.1" 200 2731 "-" "Java/1.8.0_152"
127.0.0.1 - - [07/Apr/2018:00:51:51 +0000] "GET //localhost:31000/api/atlas/v2/entity/uniqueAttribute/type/hive_db?attr:qualifiedName=default@primary
HTTP/1.1" 200 14459 "-" "Java/1.8.0_152"
127.0.0.1 - - [07/Apr/2018:00:51:51 +0000] "GET //localhost:31000/api/atlas/v2/entity/uniqueAttribute/type/hive_db?attr:qualifiedName=default@primary
HTTP/1.1" 200 14459 "-" "Java/1.8.0_152"
127.0.0.1 - - [07/Apr/2018:00:51:51 +0000] "GET //localhost:31000/api/atlas/v2/entity/guid/85edd23d-8990-485f-b553-977767b51802
HTTP/1.1" 200 14459 "-" "Java/1.8.0_152"
127.0.0.1 - - [07/Apr/2018:00:51:51 +0000] "GET //localhost:31000/api/atlas/v2/entity/uniqueAttribute/type/hive_table?attr:qualifiedName=default.tableq0zsvyden5@primary
HTTP/1.1" 404 154 "-" "Java/1.8.0_152"
127.0.0.1 - - [07/Apr/2018:00:51:51 +0000] "POST //localhost:31000/api/atlas/v2/entity/ HTTP/1.1"
200 862 "-" "Java/1.8.0_152"
127.0.0.1 - - [07/Apr/2018:00:51:51 +0000] "GET //localhost:31000/api/atlas/v2/entity/guid/6c713465-22ea-4609-bfc2-90fddee7805b
HTTP/1.1" 200 3658 "-" "Java/1.8.0_152"
127.0.0.1 - - [07/Apr/2018:00:51:51 +0000] "GET //localhost:31000/api/atlas/v2/entity/uniqueAttribute/type/hive_process?attr:qualifiedName=default.tableq0zsvyden5@primary:1523062311000
HTTP/1.1" 404 170 "-" "Java/1.8.0_152"
127.0.0.1 - - [07/Apr/2018:00:51:51 +0000] "POST //localhost:31000/api/atlas/v2/entity/bulk/
HTTP/1.1" 200 758 "-" "Java/1.8.0_152"
127.0.0.1 - - [07/Apr/2018:00:51:52 +0000] "GET //localhost:31000/api/atlas/v2/entity/guid/e86ce3e1-6f6f-490e-85ac-67f083c9523e
HTTP/1.1" 200 2095 "-" "Java/1.8.0_152"
127.0.0.1 - - [07/Apr/2018:00:51:52 +0000] "GET //localhost:31000/api/atlas/v2/entity/guid/d139202f-1517-4efb-ba04-1f7b6b230422
HTTP/1.1" 200 1362 "-" "Java/1.8.0_152"
127.0.0.1 - - [07/Apr/2018:00:51:52 +0000] "GET //localhost:31000/api/atlas/v2/entity/uniqueAttribute/type/hive_table?attr:qualifiedName=default.tableq0zsvyden5@primary
HTTP/1.1" 200 4056 "-" "Java/1.8.0_152"
127.0.0.1 - - [07/Apr/2018:00:51:52 +0000] "GET //localhost:31000/api/atlas/v2/entity/uniqueAttribute/type/hive_table?attr:qualifiedName=default.tableq0zsvyden5@primary
HTTP/1.1" 200 4056 "-" "Java/1.8.0_152"
127.0.0.1 - - [07/Apr/2018:00:51:52 +0000] "GET //localhost:31000/api/atlas/v2/entity/uniqueAttribute/type/hive_process?attr:qualifiedName=default.tableq0zsvyden5@primary:1523062311000
HTTP/1.1" 200 2095 "-" "Java/1.8.0_152"
127.0.0.1 - - [07/Apr/2018:00:51:52 +0000] "GET //localhost:31000/api/atlas/v2/entity/uniqueAttribute/type/hive_process?attr:qualifiedName=default.tableq0zsvyden5@primary:1523062311000
HTTP/1.1" 200 2095 "-" "Java/1.8.0_152"
127.0.0.1 - - [07/Apr/2018:00:51:52 +0000] "GET //localhost:31000/api/atlas/v2/entity/guid/e86ce3e1-6f6f-490e-85ac-67f083c9523e
HTTP/1.1" 200 2095 "-" "Java/1.8.0_152"
Tests run: 46, Failures: 3, Errors: 0, Skipped: 0, Time elapsed: 477.548 sec <<<
FAILURE! - in TestSuite
testAlterTablePartitionColumnType(org.apache.atlas.hive.hook.HiveHookIT)  Time elapsed: 80.675
sec  <<< FAILURE!
java.lang.AssertionError: Assertions failed. Failing after waiting for timeout 80000 msecs
	at org.apache.atlas.AtlasBaseClient.callAPIWithResource(AtlasBaseClient.java:388)
	at org.apache.atlas.AtlasBaseClient.callAPIWithResource(AtlasBaseClient.java:323)
	at org.apache.atlas.AtlasBaseClient.callAPI(AtlasBaseClient.java:228)
	at org.apache.atlas.AtlasClientV2.getEntityByAttribute(AtlasClientV2.java:264)
	at org.apache.atlas.hive.HiveITBase$1.evaluate(HiveITBase.java:209)
	at org.apache.atlas.hive.HiveITBase.waitFor(HiveITBase.java:266)
	at org.apache.atlas.hive.HiveITBase.assertEntityIsRegistered(HiveITBase.java:206)
	at org.apache.atlas.hive.hook.HiveHookIT.assertColumnIsRegistered(HiveHookIT.java:288)
	at org.apache.atlas.hive.hook.HiveHookIT.testAlterTablePartitionColumnType(HiveHookIT.java:1309)

testAlterTableRename(org.apache.atlas.hive.hook.HiveHookIT)  Time elapsed: 14.137 sec  <<<
FAILURE!
java.lang.IndexOutOfBoundsException: Index: 0, Size: 0
	at java.util.ArrayList.rangeCheck(ArrayList.java:657)
	at java.util.ArrayList.get(ArrayList.java:433)
	at org.apache.atlas.hive.hook.HiveHookIT.assertTrait(HiveHookIT.java:1018)
	at org.apache.atlas.hive.hook.HiveHookIT.testAlterTableRename(HiveHookIT.java:970)

testCreateTableHiveProcessNameAttribute(org.apache.atlas.hive.bridge.HiveMetastoreBridgeIT)
 Time elapsed: 0.01 sec  <<< FAILURE!
java.lang.AssertionError: expected [0] but found [40000]
	at org.testng.Assert.fail(Assert.java:94)
	at org.testng.Assert.failNotEquals(Assert.java:496)
	at org.testng.Assert.assertEquals(Assert.java:125)
	at org.testng.Assert.assertEquals(Assert.java:372)
	at org.testng.Assert.assertEquals(Assert.java:382)
	at org.apache.atlas.hive.HiveITBase.runCommandWithDelay(HiveITBase.java:154)
	at org.apache.atlas.hive.HiveITBase.runCommandWithDelay(HiveITBase.java:147)
	at org.apache.atlas.hive.HiveITBase.runCommand(HiveITBase.java:139)
	at org.apache.atlas.hive.bridge.HiveMetastoreBridgeIT.testCreateTableHiveProcessNameAttribute(HiveMetastoreBridgeIT.java:105)


Results :

Failed tests: 
  HiveMetastoreBridgeIT.testCreateTableHiveProcessNameAttribute:105->HiveITBase.runCommand:139->HiveITBase.runCommandWithDelay:147->HiveITBase.runCommandWithDelay:154
expected [0] but found [40000]
  HiveHookIT.testAlterTablePartitionColumnType:1309->assertColumnIsRegistered:288->HiveITBase.assertEntityIsRegistered:206->HiveITBase.waitFor:270
Assertions failed. Failing after waiting for timeout 80000 msecs
  HiveHookIT.testAlterTableRename:970->assertTrait:1018 » IndexOutOfBounds Index...

Tests run: 46, Failures: 3, Errors: 0, Skipped: 0

[INFO] 
[INFO] --- jetty-maven-plugin:9.3.14.v20161028:stop (stop-jetty) @ hive-bridge ---
[INFO] Waiting 10 seconds for jetty to stop
[INFO] Stopped ServerConnector@10788a08{HTTP/1.1,[http/1.1]}{0.0.0.0:31000}
[INFO] Closing Spring root WebApplicationContext
[INFO] Shutting down log4j
[INFO] Stopped o.e.j.m.p.JettyWebAppContext@7f37281f{/,file://<https://builds.apache.org/job/Atlas-master-IntegrationTests/ws/webapp/target/atlas-webapp-1.0.0-SNAPSHOT/,UNAVAILABLE}{/home/jenkins/jenkins-slave/workspace/Atlas-master-IntegrationTests/webapp/target/atlas-webapp-1.0.0-SNAPSHOT.war}>
[INFO] Server reports itself as stopped
[INFO] 
[INFO] --- maven-source-plugin:2.4:jar-no-fork (attach-sources) @ hive-bridge ---
[INFO] Building jar: <https://builds.apache.org/job/Atlas-master-IntegrationTests/ws/addons/hive-bridge/target/hive-bridge-1.0.0-SNAPSHOT-sources.jar>
[INFO] 
[INFO] --- maven-source-plugin:2.4:test-jar-no-fork (attach-sources) @ hive-bridge ---
[INFO] Building jar: <https://builds.apache.org/job/Atlas-master-IntegrationTests/ws/addons/hive-bridge/target/hive-bridge-1.0.0-SNAPSHOT-test-sources.jar>
[INFO] 
[INFO] --- maven-failsafe-plugin:2.18.1:verify (verify) @ hive-bridge ---
[INFO] Failsafe report directory: <https://builds.apache.org/job/Atlas-master-IntegrationTests/ws/addons/hive-bridge/target/failsafe-reports>
[INFO] ------------------------------------------------------------------------
[INFO] Reactor Summary:
[INFO] 
[INFO] Apache Atlas Server Build Tools .................... SUCCESS [  0.711 s]
[INFO] apache-atlas ....................................... SUCCESS [  4.076 s]
[INFO] Apache Atlas Test Utility Tools .................... SUCCESS [ 10.351 s]
[INFO] Open Connector Framework (OCF) ..................... SUCCESS [ 10.314 s]
[INFO] Open Metadata Repository Services (OMRS) ........... SUCCESS [ 28.806 s]
[INFO] Open Metadata and Governance (OMAG) Server APIs .... SUCCESS [  6.953 s]
[INFO] Apache Atlas Integration ........................... SUCCESS [ 17.460 s]
[INFO] Apache Atlas Common ................................ SUCCESS [  7.180 s]
[INFO] Apache Atlas Client ................................ SUCCESS [  0.463 s]
[INFO] atlas-client-common ................................ SUCCESS [  6.613 s]
[INFO] atlas-client-v1 .................................... SUCCESS [  6.449 s]
[INFO] Apache Atlas Server API ............................ SUCCESS [  5.642 s]
[INFO] Apache Atlas Notification .......................... SUCCESS [  8.415 s]
[INFO] atlas-client-v2 .................................... SUCCESS [  5.441 s]
[INFO] Apache Atlas Graph Database Projects ............... SUCCESS [  0.524 s]
[INFO] Apache Atlas Graph Database API .................... SUCCESS [  4.984 s]
[INFO] Graph Database Common Code ......................... SUCCESS [  5.403 s]
[INFO] Apache Atlas JanusGraph DB Impl .................... SUCCESS [ 16.236 s]
[INFO] Apache Atlas Graph Database Implementation Dependencies SUCCESS [  2.293 s]
[INFO] Shaded version of Apache hbase client .............. SUCCESS [  9.053 s]
[INFO] Apache Atlas Titan 0.5.4 Graph DB Impl ............. SUCCESS [ 38.261 s]
[INFO] Shaded version of Apache hbase server .............. SUCCESS [ 19.142 s]
[INFO] Apache Atlas Authorization ......................... SUCCESS [  6.130 s]
[INFO] Apache Atlas Repository ............................ SUCCESS [ 29.647 s]
[INFO] Apache Atlas UI .................................... SUCCESS [01:10 min]
[INFO] Apache Atlas Web Application ....................... SUCCESS [04:18 min]
[INFO] Apache Atlas Documentation ......................... SUCCESS [  3.029 s]
[INFO] Apache Atlas FileSystem Model ...................... SUCCESS [  2.703 s]
[INFO] Apache Atlas Plugin Classloader .................... SUCCESS [  6.031 s]
[INFO] Apache Atlas Hive Bridge Shim ...................... SUCCESS [  4.610 s]
[INFO] Apache Atlas Hive Bridge ........................... FAILURE [08:48 min]
[INFO] Apache Atlas Falcon Bridge Shim .................... SKIPPED
[INFO] Apache Atlas Falcon Bridge ......................... SKIPPED
[INFO] Apache Atlas Sqoop Bridge Shim ..................... SKIPPED
[INFO] Apache Atlas Sqoop Bridge .......................... SKIPPED
[INFO] Apache Atlas Storm Bridge Shim ..................... SKIPPED
[INFO] Apache Atlas Storm Bridge .......................... SKIPPED
[INFO] Apache Atlas Hbase Bridge Shim ..................... SKIPPED
[INFO] Apache Atlas Hbase Bridge .......................... SKIPPED
[INFO] Apache Atlas Migration Exporter .................... SKIPPED
[INFO] Apache Atlas Distribution .......................... SKIPPED
[INFO] ------------------------------------------------------------------------
[INFO] BUILD FAILURE
[INFO] ------------------------------------------------------------------------
[INFO] Total time: 18:45 min
[INFO] Finished at: 2018-04-07T00:51:57Z
[INFO] Final Memory: 598M/3241M
[INFO] ------------------------------------------------------------------------
[ERROR] Failed to execute goal org.apache.maven.plugins:maven-failsafe-plugin:2.18.1:verify
(verify) on project hive-bridge: There are test failures.
[ERROR] 
[ERROR] Please refer to <https://builds.apache.org/job/Atlas-master-IntegrationTests/ws/addons/hive-bridge/target/failsafe-reports>
for the individual test results.
log4j:WARN No appenders could be found for logger (org.apache.zookeeper.ClientCnxn).
log4j:WARN Please initialize the log4j system properly.
log4j:WARN See http://logging.apache.org/log4j/1.2/faq.html#noconfig for more info.
[ERROR] -> [Help 1]
[ERROR] 
[ERROR] To see the full stack trace of the errors, re-run Maven with the -e switch.
[ERROR] Re-run Maven using the -X switch to enable full debug logging.
[ERROR] 
[ERROR] For more information about the errors and possible solutions, please read the following
articles:
[ERROR] [Help 1] http://cwiki.apache.org/confluence/display/MAVEN/MojoFailureException
[ERROR] 
[ERROR] After correcting the problems, you can resume the build with the command
[ERROR]   mvn <goals> -rf :hive-bridge
Build step 'Execute shell' marked build as failure
[CHECKSTYLE] Collecting checkstyle analysis files...
[CHECKSTYLE] Searching for all files in <https://builds.apache.org/job/Atlas-master-IntegrationTests/ws/>
that match the pattern **/target/checkstyle-result.xml
[CHECKSTYLE] Parsing 29 files in <https://builds.apache.org/job/Atlas-master-IntegrationTests/ws/>
[CHECKSTYLE] Successfully parsed file <https://builds.apache.org/job/Atlas-master-IntegrationTests/ws/addons/hdfs-model/target/checkstyle-result.xml>
with 0 unique warnings and 0 duplicates.
[CHECKSTYLE] Successfully parsed file <https://builds.apache.org/job/Atlas-master-IntegrationTests/ws/addons/hive-bridge-shim/target/checkstyle-result.xml>
with 15 unique warnings and 0 duplicates.
[CHECKSTYLE] Successfully parsed file <https://builds.apache.org/job/Atlas-master-IntegrationTests/ws/authorization/target/checkstyle-result.xml>
with 684 unique warnings and 0 duplicates.
[CHECKSTYLE] Successfully parsed file <https://builds.apache.org/job/Atlas-master-IntegrationTests/ws/client/client-v1/target/checkstyle-result.xml>
with 1568 unique warnings and 0 duplicates.
[CHECKSTYLE] Successfully parsed file <https://builds.apache.org/job/Atlas-master-IntegrationTests/ws/client/client-v2/target/checkstyle-result.xml>
with 1927 unique warnings and 0 duplicates.
[CHECKSTYLE] Successfully parsed file <https://builds.apache.org/job/Atlas-master-IntegrationTests/ws/client/common/target/checkstyle-result.xml>
with 2415 unique warnings and 0 duplicates.
[CHECKSTYLE] Successfully parsed file <https://builds.apache.org/job/Atlas-master-IntegrationTests/ws/client/target/checkstyle-result.xml>
with 2415 unique warnings and 0 duplicates.
[CHECKSTYLE] Successfully parsed file <https://builds.apache.org/job/Atlas-master-IntegrationTests/ws/common/target/checkstyle-result.xml>
with 3463 unique warnings and 0 duplicates.
[CHECKSTYLE] Successfully parsed file <https://builds.apache.org/job/Atlas-master-IntegrationTests/ws/dashboardv2/target/checkstyle-result.xml>
with 3463 unique warnings and 0 duplicates.
[CHECKSTYLE] Successfully parsed file <https://builds.apache.org/job/Atlas-master-IntegrationTests/ws/docs/target/checkstyle-result.xml>
with 3463 unique warnings and 0 duplicates.
[CHECKSTYLE] Successfully parsed file <https://builds.apache.org/job/Atlas-master-IntegrationTests/ws/graphdb/api/target/checkstyle-result.xml>
with 3757 unique warnings and 0 duplicates.
[CHECKSTYLE] Successfully parsed file <https://builds.apache.org/job/Atlas-master-IntegrationTests/ws/graphdb/common/target/checkstyle-result.xml>
with 3966 unique warnings and 0 duplicates.
[CHECKSTYLE] Successfully parsed file <https://builds.apache.org/job/Atlas-master-IntegrationTests/ws/graphdb/graphdb-impls/target/checkstyle-result.xml>
with 3966 unique warnings and 0 duplicates.
[CHECKSTYLE] Successfully parsed file <https://builds.apache.org/job/Atlas-master-IntegrationTests/ws/graphdb/janus/target/checkstyle-result.xml>
with 5658 unique warnings and 0 duplicates.
[CHECKSTYLE] Successfully parsed file <https://builds.apache.org/job/Atlas-master-IntegrationTests/ws/graphdb/target/checkstyle-result.xml>
with 5658 unique warnings and 0 duplicates.
[CHECKSTYLE] Successfully parsed file <https://builds.apache.org/job/Atlas-master-IntegrationTests/ws/graphdb/titan0/target/checkstyle-result.xml>
with 8159 unique warnings and 0 duplicates.
[CHECKSTYLE] Successfully parsed file <https://builds.apache.org/job/Atlas-master-IntegrationTests/ws/intg/target/checkstyle-result.xml>
with 19170 unique warnings and 0 duplicates.
[CHECKSTYLE] Successfully parsed file <https://builds.apache.org/job/Atlas-master-IntegrationTests/ws/notification/target/checkstyle-result.xml>
with 20406 unique warnings and 0 duplicates.
[CHECKSTYLE] Successfully parsed file <https://builds.apache.org/job/Atlas-master-IntegrationTests/ws/om-fwk-ocf/target/checkstyle-result.xml>
with 25448 unique warnings and 0 duplicates.
[CHECKSTYLE] Successfully parsed file <https://builds.apache.org/job/Atlas-master-IntegrationTests/ws/omag-api/target/checkstyle-result.xml>
with 26794 unique warnings and 0 duplicates.
[CHECKSTYLE] Successfully parsed file <https://builds.apache.org/job/Atlas-master-IntegrationTests/ws/omrs/target/checkstyle-result.xml>
with 64423 unique warnings and 0 duplicates.
[CHECKSTYLE] Successfully parsed file <https://builds.apache.org/job/Atlas-master-IntegrationTests/ws/plugin-classloader/target/checkstyle-result.xml>
with 64536 unique warnings and 0 duplicates.
[CHECKSTYLE] Successfully parsed file <https://builds.apache.org/job/Atlas-master-IntegrationTests/ws/repository/target/checkstyle-result.xml>
with 84294 unique warnings and 0 duplicates.
[CHECKSTYLE] Successfully parsed file <https://builds.apache.org/job/Atlas-master-IntegrationTests/ws/server-api/target/checkstyle-result.xml>
with 84445 unique warnings and 0 duplicates.
[CHECKSTYLE] Successfully parsed file <https://builds.apache.org/job/Atlas-master-IntegrationTests/ws/shaded/hbase-client-shaded/target/checkstyle-result.xml>
with 84445 unique warnings and 0 duplicates.
[CHECKSTYLE] Successfully parsed file <https://builds.apache.org/job/Atlas-master-IntegrationTests/ws/shaded/hbase-server-shaded/target/checkstyle-result.xml>
with 84445 unique warnings and 0 duplicates.
[CHECKSTYLE] Successfully parsed file <https://builds.apache.org/job/Atlas-master-IntegrationTests/ws/target/checkstyle-result.xml>
with 84445 unique warnings and 0 duplicates.
[CHECKSTYLE] Successfully parsed file <https://builds.apache.org/job/Atlas-master-IntegrationTests/ws/test-tools/target/checkstyle-result.xml>
with 84483 unique warnings and 0 duplicates.
[CHECKSTYLE] Successfully parsed file <https://builds.apache.org/job/Atlas-master-IntegrationTests/ws/webapp/target/checkstyle-result.xml>
with 92484 unique warnings and 0 duplicates.
<Git Blamer> Using GitBlamer to create author and commit information for all warnings.
<Git Blamer> GIT_COMMIT=37d7b8b8f72b906cb2c133f9b3d843009c92e408, workspace=<https://builds.apache.org/job/Atlas-master-IntegrationTests/ws/>
 > git rev-parse 37d7b8b8f72b906cb2c133f9b3d843009c92e408^{commit} # timeout=10
<Git Blamer> Skipping file <https://builds.apache.org/job/Atlas-master-IntegrationTests/ws/repository/src/main/java/org/apache/atlas/discovery/SearchIndexer.java,>
no result found.
[CHECKSTYLE] Computing warning deltas based on reference build #950
[FINDBUGS] Collecting findbugs analysis files...
[FINDBUGS] Searching for all files in <https://builds.apache.org/job/Atlas-master-IntegrationTests/ws/>
that match the pattern **/target/findbugs.xml
[FINDBUGS] Parsing 20 files in <https://builds.apache.org/job/Atlas-master-IntegrationTests/ws/>
[FINDBUGS] Successfully parsed file <https://builds.apache.org/job/Atlas-master-IntegrationTests/ws/addons/hive-bridge-shim/target/findbugs.xml>
with 0 unique warnings and 0 duplicates.
[FINDBUGS] Successfully parsed file <https://builds.apache.org/job/Atlas-master-IntegrationTests/ws/authorization/target/findbugs.xml>
with 0 unique warnings and 0 duplicates.
[FINDBUGS] Successfully parsed file <https://builds.apache.org/job/Atlas-master-IntegrationTests/ws/client/client-v1/target/findbugs.xml>
with 0 unique warnings and 0 duplicates.
[FINDBUGS] Successfully parsed file <https://builds.apache.org/job/Atlas-master-IntegrationTests/ws/client/client-v2/target/findbugs.xml>
with 0 unique warnings and 0 duplicates.
[FINDBUGS] Successfully parsed file <https://builds.apache.org/job/Atlas-master-IntegrationTests/ws/client/common/target/findbugs.xml>
with 0 unique warnings and 0 duplicates.
[FINDBUGS] Successfully parsed file <https://builds.apache.org/job/Atlas-master-IntegrationTests/ws/common/target/findbugs.xml>
with 0 unique warnings and 0 duplicates.
[FINDBUGS] Successfully parsed file <https://builds.apache.org/job/Atlas-master-IntegrationTests/ws/graphdb/api/target/findbugs.xml>
with 0 unique warnings and 0 duplicates.
[FINDBUGS] Successfully parsed file <https://builds.apache.org/job/Atlas-master-IntegrationTests/ws/graphdb/common/target/findbugs.xml>
with 0 unique warnings and 0 duplicates.
[FINDBUGS] Successfully parsed file <https://builds.apache.org/job/Atlas-master-IntegrationTests/ws/graphdb/janus/target/findbugs.xml>
with 0 unique warnings and 0 duplicates.
[FINDBUGS] Successfully parsed file <https://builds.apache.org/job/Atlas-master-IntegrationTests/ws/graphdb/titan0/target/findbugs.xml>
with 0 unique warnings and 0 duplicates.
[FINDBUGS] Successfully parsed file <https://builds.apache.org/job/Atlas-master-IntegrationTests/ws/intg/target/findbugs.xml>
with 0 unique warnings and 0 duplicates.
[FINDBUGS] Successfully parsed file <https://builds.apache.org/job/Atlas-master-IntegrationTests/ws/notification/target/findbugs.xml>
with 0 unique warnings and 0 duplicates.
[FINDBUGS] Successfully parsed file <https://builds.apache.org/job/Atlas-master-IntegrationTests/ws/om-fwk-ocf/target/findbugs.xml>
with 0 unique warnings and 0 duplicates.
[FINDBUGS] Successfully parsed file <https://builds.apache.org/job/Atlas-master-IntegrationTests/ws/omag-api/target/findbugs.xml>
with 0 unique warnings and 0 duplicates.
[FINDBUGS] Successfully parsed file <https://builds.apache.org/job/Atlas-master-IntegrationTests/ws/omrs/target/findbugs.xml>
with 0 unique warnings and 0 duplicates.
[FINDBUGS] Successfully parsed file <https://builds.apache.org/job/Atlas-master-IntegrationTests/ws/plugin-classloader/target/findbugs.xml>
with 0 unique warnings and 0 duplicates.
[FINDBUGS] Successfully parsed file <https://builds.apache.org/job/Atlas-master-IntegrationTests/ws/repository/target/findbugs.xml>
with 0 unique warnings and 0 duplicates.
[FINDBUGS] Successfully parsed file <https://builds.apache.org/job/Atlas-master-IntegrationTests/ws/server-api/target/findbugs.xml>
with 0 unique warnings and 0 duplicates.
[FINDBUGS] Successfully parsed file <https://builds.apache.org/job/Atlas-master-IntegrationTests/ws/test-tools/target/findbugs.xml>
with 0 unique warnings and 0 duplicates.
[FINDBUGS] Successfully parsed file <https://builds.apache.org/job/Atlas-master-IntegrationTests/ws/webapp/target/findbugs.xml>
with 0 unique warnings and 0 duplicates.
<Git Blamer> Using GitBlamer to create author and commit information for all warnings.
<Git Blamer> GIT_COMMIT=37d7b8b8f72b906cb2c133f9b3d843009c92e408, workspace=<https://builds.apache.org/job/Atlas-master-IntegrationTests/ws/>
[FINDBUGS] Computing warning deltas based on reference build #950
Archiving artifacts
[Fast Archiver] Compressed 167.56 MB of artifacts by 65.9% relative to #950
TestNG Reports Processing: START
Looking for TestNG results report in workspace using pattern: **/target/surefire-reports/testng-results.xml,**/target/failsafe-reports/testng-results.xml
Saving reports...
Processing '/x1/jenkins/jenkins-home/jobs/Atlas-master-IntegrationTests/builds/974/testng/testng-results-1.xml'
Processing '/x1/jenkins/jenkins-home/jobs/Atlas-master-IntegrationTests/builds/974/testng/testng-results.xml'
1.744186% of tests failed, which exceeded threshold of 0%. Marking build as UNSTABLE
TestNG Reports Processing: FINISH

Mime
View raw message