atlas-dev mailing list archives

Site index · List index
Message view « Date » · « Thread »
Top « Date » · « Thread »
From Apache Jenkins Server <jenk...@builds.apache.org>
Subject Build failed in Jenkins: Atlas-master-IntegrationTests #1182
Date Fri, 27 Apr 2018 20:00:31 GMT
See <https://builds.apache.org/job/Atlas-master-IntegrationTests/1182/display/redirect>

------------------------------------------
[...truncated 583.60 KB...]
	at org.eclipse.jetty.util.thread.strategy.ExecuteProduceConsume.produceConsume(ExecuteProduceConsume.java:148)
	at org.eclipse.jetty.util.thread.strategy.ExecuteProduceConsume.run(ExecuteProduceConsume.java:136)
	at org.eclipse.jetty.util.thread.QueuedThreadPool.runJob(QueuedThreadPool.java:671)
	at org.eclipse.jetty.util.thread.QueuedThreadPool$2.run(QueuedThreadPool.java:589)
	at java.lang.Thread.run(Thread.java:748)

127.0.0.1 - - [27/Apr/2018:18:42:29 +0000] "GET //localhost:31000/api/atlas/lineage/hive/table/blah/schema
HTTP/1.1" 500 89 "-" "Java/1.8.0_172"
127.0.0.1 - - [27/Apr/2018:18:42:29 +0000] "GET //localhost:31000/api/atlas/v2/types/typedef/name/database
HTTP/1.1" 200 755 "-" "Java/1.8.0_172"
127.0.0.1 - - [27/Apr/2018:18:42:29 +0000] "GET //localhost:31000/api/atlas/v2/types/typedef/name/table
HTTP/1.1" 200 1546 "-" "Java/1.8.0_172"
127.0.0.1 - - [27/Apr/2018:18:42:29 +0000] "GET //localhost:31000/api/atlas/v2/types/typedef/name/fetl
HTTP/1.1" 200 451 "-" "Java/1.8.0_172"
127.0.0.1 - - [27/Apr/2018:18:42:29 +0000] "POST //localhost:31000/api/atlas/v2/types/typedefs/
HTTP/1.1" 200 93 "-" "Java/1.8.0_172"
127.0.0.1 - - [27/Apr/2018:18:42:29 +0000] "GET //localhost:31000/api/atlas/v2/types/classificationdef/name/fetl
HTTP/1.1" 200 451 "-" "Java/1.8.0_172"
127.0.0.1 - - [27/Apr/2018:18:42:29 +0000] "GET //localhost:31000/api/atlas/v2/types/entitydef/name/database
HTTP/1.1" 200 755 "-" "Java/1.8.0_172"
127.0.0.1 - - [27/Apr/2018:18:42:29 +0000] "GET //localhost:31000/api/atlas/v2/types/entitydef/name/table
HTTP/1.1" 200 1546 "-" "Java/1.8.0_172"
127.0.0.1 - - [27/Apr/2018:18:42:29 +0000] "POST //localhost:31000/api/atlas/v2/types/typedefs/
HTTP/1.1" 200 532 "-" "Java/1.8.0_172"
127.0.0.1 - - [27/Apr/2018:18:42:29 +0000] "POST //localhost:31000/api/atlas/v2/types/typedefs/
HTTP/1.1" 409 86 "-" "Java/1.8.0_172"
127.0.0.1 - - [27/Apr/2018:18:42:29 +0000] "GET //localhost:31000/api/atlas/v2/types/enumdef/name/blah
HTTP/1.1" 404 81 "-" "Java/1.8.0_172"
127.0.0.1 - - [27/Apr/2018:18:42:29 +0000] "GET //localhost:31000/api/atlas/v2/types/enumdef/guid/blah
HTTP/1.1" 404 82 "-" "Java/1.8.0_172"
127.0.0.1 - - [27/Apr/2018:18:42:29 +0000] "GET //localhost:31000/api/atlas/v2/types/structdef/name/blah
HTTP/1.1" 404 81 "-" "Java/1.8.0_172"
127.0.0.1 - - [27/Apr/2018:18:42:29 +0000] "GET //localhost:31000/api/atlas/v2/types/structdef/guid/blah
HTTP/1.1" 404 82 "-" "Java/1.8.0_172"
127.0.0.1 - - [27/Apr/2018:18:42:29 +0000] "GET //localhost:31000/api/atlas/v2/types/classificationdef/name/blah
HTTP/1.1" 404 81 "-" "Java/1.8.0_172"
127.0.0.1 - - [27/Apr/2018:18:42:29 +0000] "GET //localhost:31000/api/atlas/v2/types/classificationdef/guid/blah
HTTP/1.1" 404 82 "-" "Java/1.8.0_172"
127.0.0.1 - - [27/Apr/2018:18:42:29 +0000] "GET //localhost:31000/api/atlas/v2/types/entitydef/name/blah
HTTP/1.1" 404 81 "-" "Java/1.8.0_172"
127.0.0.1 - - [27/Apr/2018:18:42:29 +0000] "GET //localhost:31000/api/atlas/v2/types/entitydef/guid/blah
HTTP/1.1" 404 82 "-" "Java/1.8.0_172"
127.0.0.1 - - [27/Apr/2018:18:42:29 +0000] "POST //localhost:31000/api/atlas/v2/types/typedefs/
HTTP/1.1" 200 1947 "-" "Java/1.8.0_172"
127.0.0.1 - - [27/Apr/2018:18:42:29 +0000] "GET //localhost:31000/api/atlas/v2/types/typedefs/?supertype=ATaDREOkWxs&type=CLASS
HTTP/1.1" 200 1020 "-" "Java/1.8.0_172"
127.0.0.1 - - [27/Apr/2018:18:42:29 +0000] "GET //localhost:31000/api/atlas/v2/types/typedefs/?supertype=ATaDREOkWxs&type=CLASS&notsupertype=BPaGsxp1KoZ
HTTP/1.1" 200 550 "-" "Java/1.8.0_172"
127.0.0.1 - - [27/Apr/2018:18:42:29 +0000] "POST //localhost:31000/api/atlas/v2/types/typedefs/
HTTP/1.1" 200 532 "-" "Java/1.8.0_172"
127.0.0.1 - - [27/Apr/2018:18:42:29 +0000] "PUT //localhost:31000/api/atlas/v2/types/typedefs/
HTTP/1.1" 200 691 "-" "Java/1.8.0_172"
127.0.0.1 - - [27/Apr/2018:18:42:29 +0000] "GET //localhost:31000/api/atlas/v2/types/typedefs/?type=ENTITY
HTTP/1.1" 200 69018 "-" "Java/1.8.0_172"
127.0.0.1 - - [27/Apr/2018:18:42:29 +0000] "GET //localhost:31000/api/atlas/v2/types/classificationdef/name/fetl
HTTP/1.1" 200 451 "-" "Java/1.8.0_172"
127.0.0.1 - - [27/Apr/2018:18:42:29 +0000] "GET //localhost:31000/api/atlas/v2/types/entitydef/name/database
HTTP/1.1" 200 755 "-" "Java/1.8.0_172"
127.0.0.1 - - [27/Apr/2018:18:42:29 +0000] "GET //localhost:31000/api/atlas/v2/types/entitydef/name/table
HTTP/1.1" 200 1546 "-" "Java/1.8.0_172"
Tests run: 126, Failures: 4, Errors: 0, Skipped: 0, Time elapsed: 118.008 sec <<<
FAILURE! - in TestSuite
testEnterEmptyValues(org.apache.atlas.CredentialProviderUtilityIT)  Time elapsed: 0.782 sec
 <<< FAILURE!
java.io.IOException: Invalid secret key format
	at com.sun.crypto.provider.JceKeyStore.engineLoad(JceKeyStore.java:856)
	at java.security.KeyStore.load(KeyStore.java:1445)
	at org.apache.hadoop.security.alias.AbstractJavaKeyStoreProvider.<init>(AbstractJavaKeyStoreProvider.java:106)
	at org.apache.hadoop.security.alias.JavaKeyStoreProvider.<init>(JavaKeyStoreProvider.java:49)
	at org.apache.hadoop.security.alias.JavaKeyStoreProvider.<init>(JavaKeyStoreProvider.java:41)
	at org.apache.hadoop.security.alias.JavaKeyStoreProvider$Factory.createProvider(JavaKeyStoreProvider.java:100)
	at org.apache.hadoop.security.alias.CredentialProviderFactory.getProviders(CredentialProviderFactory.java:58)
	at org.apache.atlas.CredentialProviderUtilityIT.testEnterEmptyValues(CredentialProviderUtilityIT.java:138)

testEnterMismatchedValues(org.apache.atlas.CredentialProviderUtilityIT)  Time elapsed: 0.614
sec  <<< FAILURE!
java.io.IOException: Invalid secret key format
	at com.sun.crypto.provider.JceKeyStore.engineLoad(JceKeyStore.java:856)
	at java.security.KeyStore.load(KeyStore.java:1445)
	at org.apache.hadoop.security.alias.AbstractJavaKeyStoreProvider.<init>(AbstractJavaKeyStoreProvider.java:106)
	at org.apache.hadoop.security.alias.JavaKeyStoreProvider.<init>(JavaKeyStoreProvider.java:49)
	at org.apache.hadoop.security.alias.JavaKeyStoreProvider.<init>(JavaKeyStoreProvider.java:41)
	at org.apache.hadoop.security.alias.JavaKeyStoreProvider$Factory.createProvider(JavaKeyStoreProvider.java:100)
	at org.apache.hadoop.security.alias.CredentialProviderFactory.getProviders(CredentialProviderFactory.java:58)
	at org.apache.atlas.CredentialProviderUtilityIT.testEnterMismatchedValues(CredentialProviderUtilityIT.java:192)

testEnterValidValues(org.apache.atlas.CredentialProviderUtilityIT)  Time elapsed: 0.625 sec
 <<< FAILURE!
java.io.IOException: Invalid secret key format
	at com.sun.crypto.provider.JceKeyStore.engineLoad(JceKeyStore.java:856)
	at java.security.KeyStore.load(KeyStore.java:1445)
	at org.apache.hadoop.security.alias.AbstractJavaKeyStoreProvider.<init>(AbstractJavaKeyStoreProvider.java:106)
	at org.apache.hadoop.security.alias.JavaKeyStoreProvider.<init>(JavaKeyStoreProvider.java:49)
	at org.apache.hadoop.security.alias.JavaKeyStoreProvider.<init>(JavaKeyStoreProvider.java:41)
	at org.apache.hadoop.security.alias.JavaKeyStoreProvider$Factory.createProvider(JavaKeyStoreProvider.java:100)
	at org.apache.hadoop.security.alias.CredentialProviderFactory.getProviders(CredentialProviderFactory.java:58)
	at org.apache.atlas.CredentialProviderUtilityIT.testEnterValidValues(CredentialProviderUtilityIT.java:76)

testOverwriteValues(org.apache.atlas.CredentialProviderUtilityIT)  Time elapsed: 0.606 sec
 <<< FAILURE!
java.io.IOException: Invalid secret key format
	at com.sun.crypto.provider.JceKeyStore.engineLoad(JceKeyStore.java:856)
	at java.security.KeyStore.load(KeyStore.java:1445)
	at org.apache.hadoop.security.alias.AbstractJavaKeyStoreProvider.<init>(AbstractJavaKeyStoreProvider.java:106)
	at org.apache.hadoop.security.alias.JavaKeyStoreProvider.<init>(JavaKeyStoreProvider.java:49)
	at org.apache.hadoop.security.alias.JavaKeyStoreProvider.<init>(JavaKeyStoreProvider.java:41)
	at org.apache.hadoop.security.alias.JavaKeyStoreProvider$Factory.createProvider(JavaKeyStoreProvider.java:100)
	at org.apache.hadoop.security.alias.CredentialProviderFactory.getProviders(CredentialProviderFactory.java:58)
	at org.apache.atlas.util.CredentialProviderUtility.getCredentialProvider(CredentialProviderUtility.java:150)
	at org.apache.atlas.util.CredentialProviderUtility.main(CredentialProviderUtility.java:75)
	at org.apache.atlas.CredentialProviderUtilityIT.testOverwriteValues(CredentialProviderUtilityIT.java:251)


Results :

Failed tests: 
  CredentialProviderUtilityIT.testEnterEmptyValues:138 » IO Invalid secret key f...
  CredentialProviderUtilityIT.testEnterMismatchedValues:192 » IO Invalid secret ...
  CredentialProviderUtilityIT.testEnterValidValues:76 » IO Invalid secret key fo...
  CredentialProviderUtilityIT.testOverwriteValues:251 » IO Invalid secret key fo...

Tests run: 126, Failures: 4, Errors: 0, Skipped: 0

[INFO] 
[INFO] --- jetty-maven-plugin:9.3.14.v20161028:stop (stop-jetty) @ atlas-webapp ---
[INFO] Waiting 10 seconds for jetty to stop
[INFO] Stopped ServerConnector@56ec3be3{HTTP/1.1,[http/1.1]}{0.0.0.0:31000}
[INFO] Closing Spring root WebApplicationContext
[INFO] Shutting down log4j
[INFO] Stopped o.e.j.m.p.JettyWebAppContext@6d4b49ae{/,file://<https://builds.apache.org/job/Atlas-master-IntegrationTests/ws/webapp/target/atlas-webapp-1.0.0-SNAPSHOT/,UNAVAILABLE}{/home/jenkins/jenkins-slave/workspace/Atlas-master-IntegrationTests/webapp/target/atlas-webapp-1.0.0-SNAPSHOT.war}>
[INFO] Server reports itself as stopped
[INFO] 
[INFO] --- maven-source-plugin:2.4:jar-no-fork (attach-sources) @ atlas-webapp ---
[INFO] Building jar: <https://builds.apache.org/job/Atlas-master-IntegrationTests/ws/webapp/target/atlas-webapp-1.0.0-SNAPSHOT-sources.jar>
log4j:WARN No appenders could be found for logger (org.apache.zookeeper.ClientCnxn).
log4j:WARN Please initialize the log4j system properly.
log4j:WARN See http://logging.apache.org/log4j/1.2/faq.html#noconfig for more info.
[INFO] 
[INFO] --- maven-source-plugin:2.4:test-jar-no-fork (attach-sources) @ atlas-webapp ---
[INFO] Building jar: <https://builds.apache.org/job/Atlas-master-IntegrationTests/ws/webapp/target/atlas-webapp-1.0.0-SNAPSHOT-test-sources.jar>
[INFO] 
[INFO] --- maven-failsafe-plugin:2.18.1:verify (verify) @ atlas-webapp ---
[INFO] Failsafe report directory: <https://builds.apache.org/job/Atlas-master-IntegrationTests/ws/webapp/target/failsafe-reports>
[INFO] ------------------------------------------------------------------------
[INFO] Reactor Summary:
[INFO] 
[INFO] Apache Atlas Server Build Tools .................... SUCCESS [  0.623 s]
[INFO] apache-atlas ....................................... SUCCESS [  4.161 s]
[INFO] Apache Atlas Test Utility Tools .................... SUCCESS [ 10.867 s]
[INFO] Open Connector Framework (OCF) ..................... SUCCESS [ 11.923 s]
[INFO] Open Metadata Repository Services (OMRS) ........... SUCCESS [ 32.091 s]
[INFO] Open Metadata and Governance (OMAG) Server APIs .... SUCCESS [  7.659 s]
[INFO] Connected Asset Open Metadata Access Service (OMAS)  SUCCESS [  7.864 s]
[INFO] Asset Consumer Open Metadata Access Service (OMAS) . SUCCESS [  7.542 s]
[INFO] Open Metadata and Governance (OMAG) Server ......... SUCCESS [  4.024 s]
[INFO] Apache Atlas Integration ........................... SUCCESS [ 19.879 s]
[INFO] Apache Atlas Common ................................ SUCCESS [  9.407 s]
[INFO] Apache Atlas Client ................................ SUCCESS [  0.495 s]
[INFO] atlas-client-common ................................ SUCCESS [  6.893 s]
[INFO] atlas-client-v1 .................................... SUCCESS [  6.914 s]
[INFO] Apache Atlas Server API ............................ SUCCESS [  5.431 s]
[INFO] Apache Atlas Notification .......................... SUCCESS [  8.665 s]
[INFO] atlas-client-v2 .................................... SUCCESS [  5.953 s]
[INFO] Apache Atlas Graph Database Projects ............... SUCCESS [  0.468 s]
[INFO] Apache Atlas Graph Database API .................... SUCCESS [  5.144 s]
[INFO] Graph Database Common Code ......................... SUCCESS [  5.005 s]
[INFO] Apache Atlas JanusGraph DB Impl .................... SUCCESS [ 14.952 s]
[INFO] Apache Atlas Graph Database Implementation Dependencies SUCCESS [  2.076 s]
[INFO] Shaded version of Apache hbase client .............. SUCCESS [  7.868 s]
[INFO] Apache Atlas Titan 0.5.4 Graph DB Impl ............. SUCCESS [ 38.995 s]
[INFO] Shaded version of Apache hbase server .............. SUCCESS [ 20.282 s]
[INFO] Apache Atlas Authorization ......................... SUCCESS [  6.722 s]
[INFO] Apache Atlas Repository ............................ SUCCESS [ 32.605 s]
[INFO] Apache Atlas UI .................................... SUCCESS [01:28 min]
[INFO] Apache Atlas Web Application ....................... FAILURE [03:07 min]
[INFO] Apache Atlas Documentation ......................... SKIPPED
[INFO] Apache Atlas FileSystem Model ...................... SKIPPED
[INFO] Apache Atlas Plugin Classloader .................... SKIPPED
[INFO] Apache Atlas Hive Bridge Shim ...................... SKIPPED
[INFO] Apache Atlas Hive Bridge ........................... SKIPPED
[INFO] Apache Atlas Falcon Bridge Shim .................... SKIPPED
[INFO] Apache Atlas Falcon Bridge ......................... SKIPPED
[INFO] Apache Atlas Sqoop Bridge Shim ..................... SKIPPED
[INFO] Apache Atlas Sqoop Bridge .......................... SKIPPED
[INFO] Apache Atlas Storm Bridge Shim ..................... SKIPPED
[INFO] Apache Atlas Storm Bridge .......................... SKIPPED
[INFO] Apache Atlas Hbase Bridge Shim ..................... SKIPPED
[INFO] Apache Atlas Hbase Bridge .......................... SKIPPED
[INFO] Apache Atlas Kafka Bridge .......................... SKIPPED
[INFO] Apache Atlas Migration Exporter .................... SKIPPED
[INFO] Apache Atlas Distribution .......................... SKIPPED
[INFO] ------------------------------------------------------------------------
[INFO] BUILD FAILURE
[INFO] ------------------------------------------------------------------------
[INFO] Total time: 09:22 min
[INFO] Finished at: 2018-04-27T18:42:34Z
[INFO] Final Memory: 387M/3052M
[INFO] ------------------------------------------------------------------------
[ERROR] Failed to execute goal org.apache.maven.plugins:maven-failsafe-plugin:2.18.1:verify
(verify) on project atlas-webapp: There are test failures.
[ERROR] 
[ERROR] Please refer to <https://builds.apache.org/job/Atlas-master-IntegrationTests/ws/webapp/target/failsafe-reports>
for the individual test results.
[ERROR] -> [Help 1]
[ERROR] 
[ERROR] To see the full stack trace of the errors, re-run Maven with the -e switch.
[ERROR] Re-run Maven using the -X switch to enable full debug logging.
[ERROR] 
[ERROR] For more information about the errors and possible solutions, please read the following
articles:
[ERROR] [Help 1] http://cwiki.apache.org/confluence/display/MAVEN/MojoFailureException
[ERROR] 
[ERROR] After correcting the problems, you can resume the build with the command
[ERROR]   mvn <goals> -rf :atlas-webapp
Build step 'Execute shell' marked build as failure
[CHECKSTYLE] Collecting checkstyle analysis files...
[CHECKSTYLE] Searching for all files in <https://builds.apache.org/job/Atlas-master-IntegrationTests/ws/>
that match the pattern **/target/checkstyle-result.xml
[CHECKSTYLE] Parsing 27 files in <https://builds.apache.org/job/Atlas-master-IntegrationTests/ws/>
[CHECKSTYLE] Successfully parsed file <https://builds.apache.org/job/Atlas-master-IntegrationTests/ws/authorization/target/checkstyle-result.xml>
with 669 unique warnings and 0 duplicates.
[CHECKSTYLE] Successfully parsed file <https://builds.apache.org/job/Atlas-master-IntegrationTests/ws/client/client-v1/target/checkstyle-result.xml>
with 1556 unique warnings and 0 duplicates.
[CHECKSTYLE] Successfully parsed file <https://builds.apache.org/job/Atlas-master-IntegrationTests/ws/client/client-v2/target/checkstyle-result.xml>
with 1915 unique warnings and 0 duplicates.
[CHECKSTYLE] Successfully parsed file <https://builds.apache.org/job/Atlas-master-IntegrationTests/ws/client/common/target/checkstyle-result.xml>
with 2406 unique warnings and 0 duplicates.
[CHECKSTYLE] Successfully parsed file <https://builds.apache.org/job/Atlas-master-IntegrationTests/ws/client/target/checkstyle-result.xml>
with 2406 unique warnings and 0 duplicates.
[CHECKSTYLE] Successfully parsed file <https://builds.apache.org/job/Atlas-master-IntegrationTests/ws/common/target/checkstyle-result.xml>
with 3463 unique warnings and 0 duplicates.
[CHECKSTYLE] Successfully parsed file <https://builds.apache.org/job/Atlas-master-IntegrationTests/ws/dashboardv2/target/checkstyle-result.xml>
with 3463 unique warnings and 0 duplicates.
[CHECKSTYLE] Successfully parsed file <https://builds.apache.org/job/Atlas-master-IntegrationTests/ws/graphdb/api/target/checkstyle-result.xml>
with 3763 unique warnings and 0 duplicates.
[CHECKSTYLE] Successfully parsed file <https://builds.apache.org/job/Atlas-master-IntegrationTests/ws/graphdb/common/target/checkstyle-result.xml>
with 3989 unique warnings and 0 duplicates.
[CHECKSTYLE] Successfully parsed file <https://builds.apache.org/job/Atlas-master-IntegrationTests/ws/graphdb/graphdb-impls/target/checkstyle-result.xml>
with 3989 unique warnings and 0 duplicates.
[CHECKSTYLE] Successfully parsed file <https://builds.apache.org/job/Atlas-master-IntegrationTests/ws/graphdb/janus/target/checkstyle-result.xml>
with 5767 unique warnings and 0 duplicates.
[CHECKSTYLE] Successfully parsed file <https://builds.apache.org/job/Atlas-master-IntegrationTests/ws/graphdb/target/checkstyle-result.xml>
with 5767 unique warnings and 0 duplicates.
[CHECKSTYLE] Successfully parsed file <https://builds.apache.org/job/Atlas-master-IntegrationTests/ws/graphdb/titan0/target/checkstyle-result.xml>
with 8271 unique warnings and 0 duplicates.
[CHECKSTYLE] Successfully parsed file <https://builds.apache.org/job/Atlas-master-IntegrationTests/ws/intg/target/checkstyle-result.xml>
with 20092 unique warnings and 0 duplicates.
[CHECKSTYLE] Successfully parsed file <https://builds.apache.org/job/Atlas-master-IntegrationTests/ws/notification/target/checkstyle-result.xml>
with 21328 unique warnings and 0 duplicates.
[CHECKSTYLE] Successfully parsed file <https://builds.apache.org/job/Atlas-master-IntegrationTests/ws/om-fwk-ocf/target/checkstyle-result.xml>
with 26369 unique warnings and 0 duplicates.
[CHECKSTYLE] Successfully parsed file <https://builds.apache.org/job/Atlas-master-IntegrationTests/ws/omag-api/target/checkstyle-result.xml>
with 27924 unique warnings and 0 duplicates.
[CHECKSTYLE] Successfully parsed file <https://builds.apache.org/job/Atlas-master-IntegrationTests/ws/omag-server/target/checkstyle-result.xml>
with 27933 unique warnings and 0 duplicates.
[CHECKSTYLE] Successfully parsed file <https://builds.apache.org/job/Atlas-master-IntegrationTests/ws/omas-assetconsumer/target/checkstyle-result.xml>
with 30772 unique warnings and 0 duplicates.
[CHECKSTYLE] Successfully parsed file <https://builds.apache.org/job/Atlas-master-IntegrationTests/ws/omas-connectedasset/target/checkstyle-result.xml>
with 34185 unique warnings and 0 duplicates.
[CHECKSTYLE] Successfully parsed file <https://builds.apache.org/job/Atlas-master-IntegrationTests/ws/omrs/target/checkstyle-result.xml>
with 73728 unique warnings and 0 duplicates.
[CHECKSTYLE] Successfully parsed file <https://builds.apache.org/job/Atlas-master-IntegrationTests/ws/repository/target/checkstyle-result.xml>
with 93905 unique warnings and 0 duplicates.
[CHECKSTYLE] Successfully parsed file <https://builds.apache.org/job/Atlas-master-IntegrationTests/ws/server-api/target/checkstyle-result.xml>
with 94071 unique warnings and 0 duplicates.
[CHECKSTYLE] Successfully parsed file <https://builds.apache.org/job/Atlas-master-IntegrationTests/ws/shaded/hbase-client-shaded/target/checkstyle-result.xml>
with 94071 unique warnings and 0 duplicates.
[CHECKSTYLE] Successfully parsed file <https://builds.apache.org/job/Atlas-master-IntegrationTests/ws/shaded/hbase-server-shaded/target/checkstyle-result.xml>
with 94071 unique warnings and 0 duplicates.
[CHECKSTYLE] Successfully parsed file <https://builds.apache.org/job/Atlas-master-IntegrationTests/ws/target/checkstyle-result.xml>
with 94071 unique warnings and 0 duplicates.
[CHECKSTYLE] Successfully parsed file <https://builds.apache.org/job/Atlas-master-IntegrationTests/ws/test-tools/target/checkstyle-result.xml>
with 94109 unique warnings and 0 duplicates.
<Git Blamer> Using GitBlamer to create author and commit information for all warnings.
<Git Blamer> GIT_COMMIT=3f7c5811faa9c9c9b61f9e6760904aeafb221224, workspace=<https://builds.apache.org/job/Atlas-master-IntegrationTests/ws/>
 > git rev-parse 3f7c5811faa9c9c9b61f9e6760904aeafb221224^{commit} # timeout=10
<Git Blamer> Skipping file <https://builds.apache.org/job/Atlas-master-IntegrationTests/ws/graphdb/janus/src/main/java/org/apache/atlas/repository/graphdb/janus/graphson/AtlasGraphSONMode.java,>
no result found.
[CHECKSTYLE] Computing warning deltas based on reference build #1179
[FINDBUGS] Collecting findbugs analysis files...
[FINDBUGS] Searching for all files in <https://builds.apache.org/job/Atlas-master-IntegrationTests/ws/>
that match the pattern **/target/findbugs.xml
[FINDBUGS] Parsing 20 files in <https://builds.apache.org/job/Atlas-master-IntegrationTests/ws/>
[FINDBUGS] Successfully parsed file <https://builds.apache.org/job/Atlas-master-IntegrationTests/ws/authorization/target/findbugs.xml>
with 0 unique warnings and 0 duplicates.
[FINDBUGS] Successfully parsed file <https://builds.apache.org/job/Atlas-master-IntegrationTests/ws/client/client-v1/target/findbugs.xml>
with 0 unique warnings and 0 duplicates.
[FINDBUGS] Successfully parsed file <https://builds.apache.org/job/Atlas-master-IntegrationTests/ws/client/client-v2/target/findbugs.xml>
with 0 unique warnings and 0 duplicates.
[FINDBUGS] Successfully parsed file <https://builds.apache.org/job/Atlas-master-IntegrationTests/ws/client/common/target/findbugs.xml>
with 0 unique warnings and 0 duplicates.
[FINDBUGS] Successfully parsed file <https://builds.apache.org/job/Atlas-master-IntegrationTests/ws/common/target/findbugs.xml>
with 0 unique warnings and 0 duplicates.
[FINDBUGS] Successfully parsed file <https://builds.apache.org/job/Atlas-master-IntegrationTests/ws/graphdb/api/target/findbugs.xml>
with 0 unique warnings and 0 duplicates.
[FINDBUGS] Successfully parsed file <https://builds.apache.org/job/Atlas-master-IntegrationTests/ws/graphdb/common/target/findbugs.xml>
with 0 unique warnings and 0 duplicates.
[FINDBUGS] Successfully parsed file <https://builds.apache.org/job/Atlas-master-IntegrationTests/ws/graphdb/janus/target/findbugs.xml>
with 0 unique warnings and 0 duplicates.
[FINDBUGS] Successfully parsed file <https://builds.apache.org/job/Atlas-master-IntegrationTests/ws/graphdb/titan0/target/findbugs.xml>
with 0 unique warnings and 0 duplicates.
[FINDBUGS] Successfully parsed file <https://builds.apache.org/job/Atlas-master-IntegrationTests/ws/intg/target/findbugs.xml>
with 0 unique warnings and 0 duplicates.
[FINDBUGS] Successfully parsed file <https://builds.apache.org/job/Atlas-master-IntegrationTests/ws/notification/target/findbugs.xml>
with 0 unique warnings and 0 duplicates.
[FINDBUGS] Successfully parsed file <https://builds.apache.org/job/Atlas-master-IntegrationTests/ws/om-fwk-ocf/target/findbugs.xml>
with 0 unique warnings and 0 duplicates.
[FINDBUGS] Successfully parsed file <https://builds.apache.org/job/Atlas-master-IntegrationTests/ws/omag-api/target/findbugs.xml>
with 0 unique warnings and 0 duplicates.
[FINDBUGS] Successfully parsed file <https://builds.apache.org/job/Atlas-master-IntegrationTests/ws/omag-server/target/findbugs.xml>
with 0 unique warnings and 0 duplicates.
[FINDBUGS] Successfully parsed file <https://builds.apache.org/job/Atlas-master-IntegrationTests/ws/omas-assetconsumer/target/findbugs.xml>
with 0 unique warnings and 0 duplicates.
[FINDBUGS] Successfully parsed file <https://builds.apache.org/job/Atlas-master-IntegrationTests/ws/omas-connectedasset/target/findbugs.xml>
with 0 unique warnings and 0 duplicates.
[FINDBUGS] Successfully parsed file <https://builds.apache.org/job/Atlas-master-IntegrationTests/ws/omrs/target/findbugs.xml>
with 0 unique warnings and 0 duplicates.
[FINDBUGS] Successfully parsed file <https://builds.apache.org/job/Atlas-master-IntegrationTests/ws/repository/target/findbugs.xml>
with 0 unique warnings and 0 duplicates.
[FINDBUGS] Successfully parsed file <https://builds.apache.org/job/Atlas-master-IntegrationTests/ws/server-api/target/findbugs.xml>
with 0 unique warnings and 0 duplicates.
[FINDBUGS] Successfully parsed file <https://builds.apache.org/job/Atlas-master-IntegrationTests/ws/test-tools/target/findbugs.xml>
with 0 unique warnings and 0 duplicates.
<Git Blamer> Using GitBlamer to create author and commit information for all warnings.
<Git Blamer> GIT_COMMIT=3f7c5811faa9c9c9b61f9e6760904aeafb221224, workspace=<https://builds.apache.org/job/Atlas-master-IntegrationTests/ws/>
[FINDBUGS] Computing warning deltas based on reference build #1179
Archiving artifacts
[Fast Archiver] Compressed 165.42 MB of artifacts by 84.2% relative to #1179
TestNG Reports Processing: START
Looking for TestNG results report in workspace using pattern: **/target/surefire-reports/testng-results.xml,**/target/failsafe-reports/testng-results.xml
Saving reports...
Processing '/x1/jenkins/jenkins-home/jobs/Atlas-master-IntegrationTests/builds/1182/testng/testng-results.xml'
3.174603% of tests failed, which exceeded threshold of 0%. Marking build as UNSTABLE
TestNG Reports Processing: FINISH

Mime
View raw message