atlas-dev mailing list archives

Site index · List index
Message view « Date » · « Thread »
Top « Date » · « Thread »
From Apache Jenkins Server <jenk...@builds.apache.org>
Subject Build failed in Jenkins: Atlas-0.8-IntegrationTests #193
Date Fri, 30 Mar 2018 18:54:30 GMT
See <https://builds.apache.org/job/Atlas-0.8-IntegrationTests/193/display/redirect?page=changes>

Changes:

[madhan] ATLAS-2524: fix Hive hook for incorrect handling of 'alter view as'

------------------------------------------
[...truncated 530.02 KB...]
127.0.0.1 - - [30/Mar/2018:18:48:37 +0000] "GET /api/atlas/v2/entity/guid/15671ae9-b3c8-4285-a024-f2a34ddd1e05
HTTP/1.1" 200 - "-" "Java/1.8.0_152"
127.0.0.1 - - [30/Mar/2018:18:48:37 +0000] "POST /api/atlas/v2/entity HTTP/1.1" 200 - "-"
"Java/1.8.0_152"
127.0.0.1 - - [30/Mar/2018:18:48:37 +0000] "GET /api/atlas/v2/entity/guid/f33957b3-2006-4d29-92a6-642419f67df7
HTTP/1.1" 200 - "-" "Java/1.8.0_152"
127.0.0.1 - - [30/Mar/2018:18:48:37 +0000] "POST /api/atlas/v2/entity HTTP/1.1" 200 - "-"
"Java/1.8.0_152"
127.0.0.1 - - [30/Mar/2018:18:48:37 +0000] "GET /api/atlas/v2/entity/guid/d93aa6ae-46a1-41b6-934a-bcf81d4d0d08
HTTP/1.1" 200 - "-" "Java/1.8.0_152"
127.0.0.1 - - [30/Mar/2018:18:48:37 +0000] "POST /api/atlas/v2/entity HTTP/1.1" 200 - "-"
"Java/1.8.0_152"
127.0.0.1 - - [30/Mar/2018:18:48:37 +0000] "GET /api/atlas/v2/entity/guid/a83fce98-60d5-4fbd-8f41-b4b7e0bf4f8c
HTTP/1.1" 200 - "-" "Java/1.8.0_152"
127.0.0.1 - - [30/Mar/2018:18:48:37 +0000] "POST /api/atlas/v2/entity HTTP/1.1" 200 - "-"
"Java/1.8.0_152"
127.0.0.1 - - [30/Mar/2018:18:48:37 +0000] "GET /api/atlas/v2/entity/guid/f763c6fb-ea39-4867-9ff5-18fb5c98e43b
HTTP/1.1" 200 - "-" "Java/1.8.0_152"
127.0.0.1 - - [30/Mar/2018:18:48:37 +0000] "POST /api/atlas/v2/entity HTTP/1.1" 200 - "-"
"Java/1.8.0_152"
127.0.0.1 - - [30/Mar/2018:18:48:37 +0000] "GET /api/atlas/v2/entity/guid/b319cb76-abb9-4c9c-846f-76f5bb133f91
HTTP/1.1" 200 - "-" "Java/1.8.0_152"
127.0.0.1 - - [30/Mar/2018:18:48:37 +0000] "POST /api/atlas/v2/entity HTTP/1.1" 200 - "-"
"Java/1.8.0_152"
127.0.0.1 - - [30/Mar/2018:18:48:37 +0000] "GET /api/atlas/v2/entity/guid/9fdc5856-8320-47f9-9481-6508e4bf63ef
HTTP/1.1" 200 - "-" "Java/1.8.0_152"
127.0.0.1 - - [30/Mar/2018:18:48:37 +0000] "GET /api/atlas/v2/search/dsl?offset=0&query=from+DB&limit=10
HTTP/1.1" 200 - "-" "Java/1.8.0_152"
127.0.0.1 - - [30/Mar/2018:18:48:38 +0000] "GET /api/atlas/v2/search/dsl?offset=0&query=DB&limit=10
HTTP/1.1" 200 - "-" "Java/1.8.0_152"
127.0.0.1 - - [30/Mar/2018:18:48:38 +0000] "GET /api/atlas/v2/search/dsl?offset=0&query=DB+where+name%3D%22Reporting%22&limit=10
HTTP/1.1" 200 - "-" "Java/1.8.0_152"
127.0.0.1 - - [30/Mar/2018:18:48:39 +0000] "GET /api/atlas/v2/search/dsl?offset=0&query=DB+where+DB.name%3D%22Reporting%22&limit=10
HTTP/1.1" 200 - "-" "Java/1.8.0_152"
127.0.0.1 - - [30/Mar/2018:18:48:40 +0000] "GET /api/atlas/v2/search/dsl?offset=0&query=DB+name+%3D+%22Reporting%22&limit=10
HTTP/1.1" 200 - "-" "Java/1.8.0_152"
127.0.0.1 - - [30/Mar/2018:18:48:40 +0000] "GET /api/atlas/v2/search/dsl?offset=0&query=DB+DB.name+%3D+%22Reporting%22&limit=10
HTTP/1.1" 200 - "-" "Java/1.8.0_152"
127.0.0.1 - - [30/Mar/2018:18:48:41 +0000] "GET /api/atlas/v2/search/dsl?offset=0&query=DB+where+name%3D%22Reporting%22+select+name,+owner&limit=10
HTTP/1.1" 200 - "-" "Java/1.8.0_152"
127.0.0.1 - - [30/Mar/2018:18:48:42 +0000] "GET /api/atlas/v2/search/dsl?offset=0&query=DB+where+DB.name%3D%22Reporting%22+select+name,+owner&limit=10
HTTP/1.1" 200 - "-" "Java/1.8.0_152"
127.0.0.1 - - [30/Mar/2018:18:48:43 +0000] "GET /api/atlas/v2/search/dsl?offset=0&query=DB+has+name&limit=10
HTTP/1.1" 200 - "-" "Java/1.8.0_152"
127.0.0.1 - - [30/Mar/2018:18:48:44 +0000] "GET /api/atlas/v2/search/dsl?offset=0&query=DB+where+DB+has+name&limit=10
HTTP/1.1" 200 - "-" "Java/1.8.0_152"
127.0.0.1 - - [30/Mar/2018:18:48:45 +0000] "GET /api/atlas/v2/search/dsl?offset=0&query=DB,+Table&limit=10
HTTP/1.1" 200 - "-" "Java/1.8.0_152"
127.0.0.1 - - [30/Mar/2018:18:48:45 +0000] "GET /api/atlas/v2/search/dsl?offset=0&query=DB+is+JdbcAccess&limit=10
HTTP/1.1" 200 - "-" "Java/1.8.0_152"
127.0.0.1 - - [30/Mar/2018:18:48:46 +0000] "GET /api/atlas/v2/search/dsl?offset=0&query=from+Table&limit=10
HTTP/1.1" 200 - "-" "Java/1.8.0_152"
127.0.0.1 - - [30/Mar/2018:18:48:46 +0000] "GET /api/atlas/v2/search/dsl?offset=0&query=Table&limit=10
HTTP/1.1" 200 - "-" "Java/1.8.0_152"
127.0.0.1 - - [30/Mar/2018:18:48:47 +0000] "GET /api/atlas/v2/search/dsl?offset=0&query=Table+is+Dimension&limit=10
HTTP/1.1" 200 - "-" "Java/1.8.0_152"
127.0.0.1 - - [30/Mar/2018:18:48:48 +0000] "GET /api/atlas/v2/search/dsl?offset=0&query=Column+where+Column+isa+PII&limit=10
HTTP/1.1" 200 - "-" "Java/1.8.0_152"
127.0.0.1 - - [30/Mar/2018:18:48:48 +0000] "GET /api/atlas/v2/search/dsl?offset=0&query=View+is+Dimension&limit=10
HTTP/1.1" 200 - "-" "Java/1.8.0_152"
127.0.0.1 - - [30/Mar/2018:18:48:49 +0000] "GET /api/atlas/v2/search/dsl?offset=0&query=Column+select+Column.name&limit=10
HTTP/1.1" 200 - "-" "Java/1.8.0_152"
127.0.0.1 - - [30/Mar/2018:18:48:50 +0000] "GET /api/atlas/v2/search/dsl?offset=0&query=Column+select+name&limit=10
HTTP/1.1" 200 - "-" "Java/1.8.0_152"
127.0.0.1 - - [30/Mar/2018:18:48:51 +0000] "GET /api/atlas/v2/search/dsl?offset=0&query=Column+where+Column.name%3D%22customer_id%22&limit=10
HTTP/1.1" 200 - "-" "Java/1.8.0_152"
127.0.0.1 - - [30/Mar/2018:18:48:51 +0000] "GET /api/atlas/v2/search/dsl?offset=0&query=from+Table+select+Table.name&limit=10
HTTP/1.1" 200 - "-" "Java/1.8.0_152"
127.0.0.1 - - [30/Mar/2018:18:48:52 +0000] "GET /api/atlas/v2/search/dsl?offset=0&query=DB+where+(name+%3D+%22Reporting%22)&limit=10
HTTP/1.1" 200 - "-" "Java/1.8.0_152"
127.0.0.1 - - [30/Mar/2018:18:48:53 +0000] "GET /api/atlas/v2/search/dsl?offset=0&query=DB+where+(name+%3D+%22Reporting%22)+select+name+as+_col_0,+owner+as+_col_1&limit=10
HTTP/1.1" 200 - "-" "Java/1.8.0_152"
127.0.0.1 - - [30/Mar/2018:18:48:54 +0000] "GET /api/atlas/v2/search/dsl?offset=0&query=DB+where+DB+is+JdbcAccess&limit=10
HTTP/1.1" 200 - "-" "Java/1.8.0_152"
127.0.0.1 - - [30/Mar/2018:18:48:55 +0000] "GET /api/atlas/v2/search/dsl?offset=0&query=DB+where+DB+has+name&limit=10
HTTP/1.1" 200 - "-" "Java/1.8.0_152"
127.0.0.1 - - [30/Mar/2018:18:48:55 +0000] "GET /api/atlas/v2/search/dsl?offset=0&query=DB+Table&limit=10
HTTP/1.1" 200 - "-" "Java/1.8.0_152"
127.0.0.1 - - [30/Mar/2018:18:48:56 +0000] "GET /api/atlas/v2/search/dsl?offset=0&query=DB+as+db1+Table+where+(db1.name+%3D+%22Reporting%22)&limit=10
HTTP/1.1" 200 - "-" "Java/1.8.0_152"
127.0.0.1 - - [30/Mar/2018:18:48:57 +0000] "GET /api/atlas/v2/search/dsl?offset=0&query=DB+where+(name+%3D+%22Reporting%22)+select+name+as+_col_0,+(createTime+%2B+1)+as+_col_1+&limit=10
HTTP/1.1" 200 - "-" "Java/1.8.0_152"
127.0.0.1 - - [30/Mar/2018:18:48:58 +0000] "GET /api/atlas/v2/search/dsl?offset=0&query=Dimension&limit=10
HTTP/1.1" 200 - "-" "Java/1.8.0_152"
127.0.0.1 - - [30/Mar/2018:18:48:58 +0000] "GET /api/atlas/v2/search/dsl?offset=0&query=JdbcAccess&limit=10
HTTP/1.1" 200 - "-" "Java/1.8.0_152"
127.0.0.1 - - [30/Mar/2018:18:48:59 +0000] "GET /api/atlas/v2/search/dsl?offset=0&query=ETL&limit=10
HTTP/1.1" 200 - "-" "Java/1.8.0_152"
127.0.0.1 - - [30/Mar/2018:18:49:00 +0000] "GET /api/atlas/v2/search/dsl?offset=0&query=Metric&limit=10
HTTP/1.1" 200 - "-" "Java/1.8.0_152"
127.0.0.1 - - [30/Mar/2018:18:49:01 +0000] "GET /api/atlas/v2/search/dsl?offset=0&query=PII&limit=10
HTTP/1.1" 200 - "-" "Java/1.8.0_152"
127.0.0.1 - - [30/Mar/2018:18:49:01 +0000] "GET /api/atlas/v2/search/dsl?offset=0&query=%60Log+Data%60&limit=10
HTTP/1.1" 200 - "-" "Java/1.8.0_152"
127.0.0.1 - - [30/Mar/2018:18:49:02 +0000] "GET /api/atlas/v2/search/dsl?offset=0&query=Table+where+name%3D%22sales_fact%22,+columns&limit=10
HTTP/1.1" 200 - "-" "Java/1.8.0_152"
127.0.0.1 - - [30/Mar/2018:18:49:03 +0000] "GET /api/atlas/v2/search/dsl?offset=0&query=Table+where+name%3D%22sales_fact%22,+columns+as+column+select+column.name,+column.dataType,+column.comment&limit=10
HTTP/1.1" 200 - "-" "Java/1.8.0_152"
127.0.0.1 - - [30/Mar/2018:18:49:04 +0000] "GET /api/atlas/v2/search/dsl?offset=0&query=from+DataSet&limit=10
HTTP/1.1" 200 - "-" "Java/1.8.0_152"
127.0.0.1 - - [30/Mar/2018:18:49:05 +0000] "GET /api/atlas/v2/search/dsl?offset=0&query=from+Process&limit=10
HTTP/1.1" 200 - "-" "Java/1.8.0_152"
127.0.0.1 - - [30/Mar/2018:18:49:05 +0000] "GET /api/atlas/v2/entity/uniqueAttribute/type/Table?attr:qualifiedName=sales_fact_daily_mv
HTTP/1.1" 200 - "-" "Java/1.8.0_152"
127.0.0.1 - - [30/Mar/2018:18:49:05 +0000] "GET /api/atlas/v2/lineage/15671ae9-b3c8-4285-a024-f2a34ddd1e05?depth=0&direction=BOTH
HTTP/1.1" 200 - "-" "Java/1.8.0_152"
127.0.0.1 - - [30/Mar/2018:18:49:07 +0000] "GET /api/atlas/v2/entity/uniqueAttribute/type/DB?attr:name=Sales
HTTP/1.1" 200 - "-" "Java/1.8.0_152"
127.0.0.1 - - [30/Mar/2018:18:49:07 +0000] "GET /api/atlas/v2/entity/uniqueAttribute/type/Table?attr:qualifiedName=sales_fact
HTTP/1.1" 200 - "-" "Java/1.8.0_152"
127.0.0.1 - - [30/Mar/2018:18:49:07 +0000] "GET /api/atlas/v2/entity/uniqueAttribute/type/Table?attr:qualifiedName=time_dim
HTTP/1.1" 200 - "-" "Java/1.8.0_152"
127.0.0.1 - - [30/Mar/2018:18:49:07 +0000] "GET /api/atlas/v2/entity/uniqueAttribute/type/Table?attr:qualifiedName=sales_fact_daily_mv
HTTP/1.1" 200 - "-" "Java/1.8.0_152"
127.0.0.1 - - [30/Mar/2018:18:49:07 +0000] "GET /api/atlas/v2/entity/uniqueAttribute/type/Table?attr:qualifiedName=sales_fact_monthly_mv
HTTP/1.1" 200 - "-" "Java/1.8.0_152"
127.0.0.1 - - [30/Mar/2018:18:49:07 +0000] "GET /api/atlas/v2/entity/uniqueAttribute/type/LoadProcess?attr:qualifiedName=loadSalesDaily
HTTP/1.1" 200 - "-" "Java/1.8.0_152"
127.0.0.1 - - [30/Mar/2018:18:49:07 +0000] "GET /api/atlas/v2/entity/uniqueAttribute/type/LoadProcess?attr:qualifiedName=loadSalesMonthly
HTTP/1.1" 200 - "-" "Java/1.8.0_152"
127.0.0.1 - - [30/Mar/2018:18:49:07 +0000] "GET /api/atlas/v2/lineage/15671ae9-b3c8-4285-a024-f2a34ddd1e05?depth=0&direction=BOTH
HTTP/1.1" 200 - "-" "Java/1.8.0_152"
127.0.0.1 - - [30/Mar/2018:18:49:09 +0000] "GET /api/atlas/v2/entity/uniqueAttribute/type/LoadProcess?attr:qualifiedName=loadSalesDaily
HTTP/1.1" 200 - "-" "Java/1.8.0_152"
127.0.0.1 - - [30/Mar/2018:18:49:09 +0000] "GET /api/atlas/v2/entity/uniqueAttribute/type/Table?attr:qualifiedName=sales_fact
HTTP/1.1" 200 - "-" "Java/1.8.0_152"
127.0.0.1 - - [30/Mar/2018:18:49:09 +0000] "GET /api/atlas/v2/entity/uniqueAttribute/type/Table?attr:qualifiedName=time_dim
HTTP/1.1" 200 - "-" "Java/1.8.0_152"
127.0.0.1 - - [30/Mar/2018:18:49:09 +0000] "GET /api/atlas/v2/entity/uniqueAttribute/type/Table?attr:qualifiedName=sales_fact_daily_mv
HTTP/1.1" 200 - "-" "Java/1.8.0_152"
127.0.0.1 - - [30/Mar/2018:18:49:09 +0000] "GET /api/atlas/v2/entity/uniqueAttribute/type/Table?attr:qualifiedName=sales_fact
HTTP/1.1" 200 - "-" "Java/1.8.0_152"
127.0.0.1 - - [30/Mar/2018:18:49:09 +0000] "GET /api/atlas/v2/entity/uniqueAttribute/type/DB?attr:name=Sales
HTTP/1.1" 200 - "-" "Java/1.8.0_152"
127.0.0.1 - - [30/Mar/2018:18:49:09 +0000] "GET /api/atlas/v2/entity/guid/1daf6edc-0b69-4b86-b443-fe1788da02e6/classifications
HTTP/1.1" 200 - "-" "Java/1.8.0_152"
127.0.0.1 - - [30/Mar/2018:18:49:09 +0000] "GET /api/atlas/v2/entity/uniqueAttribute/type/View?attr:qualifiedName=product_dim_view
HTTP/1.1" 200 - "-" "Java/1.8.0_152"
127.0.0.1 - - [30/Mar/2018:18:49:09 +0000] "GET /api/atlas/v2/entity/uniqueAttribute/type/Table?attr:qualifiedName=product_dim
HTTP/1.1" 200 - "-" "Java/1.8.0_152"
127.0.0.1 - - [30/Mar/2018:18:49:09 +0000] "GET /api/atlas/discovery/search/fulltext?query=dboTfJE9fYIj&limit=10&offset=0
HTTP/1.1" 200 - "-" "Java/1.8.0_152"
127.0.0.1 - - [30/Mar/2018:18:49:09 +0000] "GET /api/atlas/discovery/search/fulltext?query=dboTfJE9fYIj
HTTP/1.1" 200 - "-" "Java/1.8.0_152"
127.0.0.1 - - [30/Mar/2018:18:49:09 +0000] "GET /api/atlas/discovery/search/fulltext?query=dboTfJE9fYIj&limit=10&offset=0
HTTP/1.1" 200 - "-" "Java/1.8.0_152"
127.0.0.1 - - [30/Mar/2018:18:49:09 +0000] "GET /api/atlas/discovery/search/fulltext?query=dboTfJE9fYIj&limit=10&offset=1
HTTP/1.1" 200 - "-" "Java/1.8.0_152"
127.0.0.1 - - [30/Mar/2018:18:49:09 +0000] "GET /api/atlas/discovery/search/fulltext?query=dboTfJE9fYIj&limit=1&offset=0
HTTP/1.1" 200 - "-" "Java/1.8.0_152"
127.0.0.1 - - [30/Mar/2018:18:49:09 +0000] "GET /api/atlas/discovery/search/fulltext?query=dboTfJE9fYIj&limit=1&offset=2
HTTP/1.1" 200 - "-" "Java/1.8.0_152"
Tests run: 135, Failures: 2, Errors: 0, Skipped: 1, Time elapsed: 144.426 sec <<<
FAILURE! - in TestSuite
testCreate(org.apache.atlas.web.integration.TypedefsJerseyResourceIT)  Time elapsed: 0.104
sec  <<< FAILURE!
org.apache.atlas.AtlasServiceException: Metadata service API org.apache.atlas.AtlasBaseClient$API@a1cb7b6
failed with status 404 (Not Found) Response Body ({"errorCode":"ATLAS-404-00-001","errorMessage":"Given
typename fetl was invalid"})
	at org.apache.atlas.AtlasBaseClient.callAPIWithResource(AtlasBaseClient.java:387)
	at org.apache.atlas.AtlasBaseClient.callAPIWithResource(AtlasBaseClient.java:320)
	at org.apache.atlas.AtlasBaseClient.callAPI(AtlasBaseClient.java:236)
	at org.apache.atlas.AtlasClientV2.getTypeDefByName(AtlasClientV2.java:409)
	at org.apache.atlas.AtlasClientV2.getClassificationDefByName(AtlasClientV2.java:158)
	at org.apache.atlas.web.integration.TypedefsJerseyResourceIT.testCreate(TypedefsJerseyResourceIT.java:95)

testDiscoveryWithSearchParameters(org.apache.atlas.web.integration.BasicSearchIT)  Time elapsed:
0.243 sec  <<< FAILURE!
java.lang.AssertionError: expected [3] but found [21]
	at org.testng.Assert.fail(Assert.java:94)
	at org.testng.Assert.failNotEquals(Assert.java:496)
	at org.testng.Assert.assertEquals(Assert.java:125)
	at org.testng.Assert.assertEquals(Assert.java:372)
	at org.testng.Assert.assertEquals(Assert.java:382)
	at org.apache.atlas.web.integration.BasicSearchIT.testDiscoveryWithSearchParameters(BasicSearchIT.java:127)


Results :

Failed tests: 
org.apache.atlas.web.integration.BasicSearchIT.testDiscoveryWithSearchParameters(org.apache.atlas.web.integration.BasicSearchIT)
  Run 1: BasicSearchIT.testDiscoveryWithSearchParameters:127 expected [3] but found [21]
  Run 2: PASS
  Run 3: PASS

  TypedefsJerseyResourceIT.testCreate:95 » AtlasService Metadata service API org...

Tests run: 133, Failures: 2, Errors: 0, Skipped: 1

[INFO] 
[INFO] --- jetty-maven-plugin:9.2.12.v20150709:stop (stop-jetty) @ atlas-webapp ---
[INFO] Waiting 10 seconds for jetty to stop
[INFO] Stopped ServerConnector@5fef57b0{HTTP/1.1}{0.0.0.0:31000}
[INFO] Closing Spring root WebApplicationContext
[INFO] Shutting down log4j
[INFO] Not cleaning cached beans: no such field javax.el.BeanELResolver.properties
[INFO] Stopped o.e.j.m.p.JettyWebAppContext@49f158de{/,<https://builds.apache.org/job/Atlas-0.8-IntegrationTests/ws/webapp/target/atlas-webapp-0.8.3-SNAPSHOT/,UNAVAILABLE}{/home/jenkins/jenkins-slave/workspace/Atlas-0.8-IntegrationTests/webapp/target/atlas-webapp-0.8.3-SNAPSHOT.war}>
[INFO] Server reports itself as stopped
[INFO] 
[INFO] --- maven-source-plugin:2.4:jar-no-fork (attach-sources) @ atlas-webapp ---
[INFO] Building jar: <https://builds.apache.org/job/Atlas-0.8-IntegrationTests/ws/webapp/target/atlas-webapp-0.8.3-SNAPSHOT-sources.jar>
log4j:WARN No appenders could be found for logger (org.apache.zookeeper.ClientCnxn).
log4j:WARN Please initialize the log4j system properly.
log4j:WARN See http://logging.apache.org/log4j/1.2/faq.html#noconfig for more info.
[INFO] 
[INFO] --- maven-source-plugin:2.4:test-jar-no-fork (attach-sources) @ atlas-webapp ---
[INFO] Building jar: <https://builds.apache.org/job/Atlas-0.8-IntegrationTests/ws/webapp/target/atlas-webapp-0.8.3-SNAPSHOT-test-sources.jar>
[INFO] 
[INFO] --- maven-failsafe-plugin:2.18.1:verify (verify) @ atlas-webapp ---
[INFO] Failsafe report directory: <https://builds.apache.org/job/Atlas-0.8-IntegrationTests/ws/webapp/target/failsafe-reports>
[INFO] ------------------------------------------------------------------------
[INFO] Reactor Summary:
[INFO] 
[INFO] Apache Atlas Server Build Tools .................... SUCCESS [  0.576 s]
[INFO] apache-atlas ....................................... SUCCESS [  3.663 s]
[INFO] Apache Atlas Integration ........................... SUCCESS [ 16.787 s]
[INFO] Apache Atlas Common ................................ SUCCESS [  7.153 s]
[INFO] Apache Atlas Typesystem ............................ SUCCESS [ 41.768 s]
[INFO] Apache Atlas Client ................................ SUCCESS [  0.562 s]
[INFO] atlas-client-common ................................ SUCCESS [  6.122 s]
[INFO] atlas-client-v1 .................................... SUCCESS [  6.770 s]
[INFO] Apache Atlas Server API ............................ SUCCESS [  5.504 s]
[INFO] Apache Atlas Notification .......................... SUCCESS [  9.914 s]
[INFO] atlas-client-v2 .................................... SUCCESS [  5.107 s]
[INFO] Apache Atlas Graph Database Projects ............... SUCCESS [  0.453 s]
[INFO] Apache Atlas Graph Database API .................... SUCCESS [  4.588 s]
[INFO] Graph Database Common Code ......................... SUCCESS [  4.874 s]
[INFO] Apache Atlas Titan 1.0.0 GraphDB Impl .............. SUCCESS [ 33.434 s]
[INFO] Shaded version of Apache hbase client .............. SUCCESS [  6.973 s]
[INFO] Apache Atlas Titan 0.5.4 Graph DB Impl ............. SUCCESS [ 32.953 s]
[INFO] Apache Atlas Graph Database Implementation Dependencies SUCCESS [  0.643 s]
[INFO] Shaded version of Apache hbase server .............. SUCCESS [ 19.992 s]
[INFO] Apache Atlas Repository ............................ SUCCESS [01:13 min]
[INFO] Apache Atlas Authorization ......................... SUCCESS [  5.987 s]
[INFO] Apache Atlas Business Catalog ...................... SUCCESS [  9.429 s]
[INFO] Apache Atlas UI .................................... SUCCESS [01:08 min]
[INFO] Apache Atlas Web Application ....................... FAILURE [03:44 min]
[INFO] Apache Atlas Documentation ......................... SKIPPED
[INFO] Apache Atlas FileSystem Model ...................... SKIPPED
[INFO] Apache Atlas Plugin Classloader .................... SKIPPED
[INFO] Apache Atlas Hive Bridge Shim ...................... SKIPPED
[INFO] Apache Atlas Hive Bridge ........................... SKIPPED
[INFO] Apache Atlas Falcon Bridge Shim .................... SKIPPED
[INFO] Apache Atlas Falcon Bridge ......................... SKIPPED
[INFO] Apache Atlas Sqoop Bridge Shim ..................... SKIPPED
[INFO] Apache Atlas Sqoop Bridge .......................... SKIPPED
[INFO] Apache Atlas Storm Bridge Shim ..................... SKIPPED
[INFO] Apache Atlas Storm Bridge .......................... SKIPPED
[INFO] Apache Atlas Hbase Bridge Shim ..................... SKIPPED
[INFO] Apache Atlas Hbase Bridge .......................... SKIPPED
[INFO] Apache Atlas Migration Exporter .................... SKIPPED
[INFO] Apache Atlas Distribution .......................... SKIPPED
[INFO] ------------------------------------------------------------------------
[INFO] BUILD FAILURE
[INFO] ------------------------------------------------------------------------
[INFO] Total time: 09:50 min
[INFO] Finished at: 2018-03-30T18:49:12Z
[INFO] Final Memory: 381M/3389M
[INFO] ------------------------------------------------------------------------
[ERROR] Failed to execute goal org.apache.maven.plugins:maven-failsafe-plugin:2.18.1:verify
(verify) on project atlas-webapp: There are test failures.
[ERROR] 
[ERROR] Please refer to <https://builds.apache.org/job/Atlas-0.8-IntegrationTests/ws/webapp/target/failsafe-reports>
for the individual test results.
[ERROR] -> [Help 1]
[ERROR] 
[ERROR] To see the full stack trace of the errors, re-run Maven with the -e switch.
[ERROR] Re-run Maven using the -X switch to enable full debug logging.
[ERROR] 
[ERROR] For more information about the errors and possible solutions, please read the following
articles:
[ERROR] [Help 1] http://cwiki.apache.org/confluence/display/MAVEN/MojoFailureException
[ERROR] 
[ERROR] After correcting the problems, you can resume the build with the command
[ERROR]   mvn <goals> -rf :atlas-webapp
Build step 'Execute shell' marked build as failure
[CHECKSTYLE] Collecting checkstyle analysis files...
[CHECKSTYLE] Searching for all files in <https://builds.apache.org/job/Atlas-0.8-IntegrationTests/ws/>
that match the pattern **/target/checkstyle-result.xml
[CHECKSTYLE] Parsing 22 files in <https://builds.apache.org/job/Atlas-0.8-IntegrationTests/ws/>
[CHECKSTYLE] Successfully parsed file <https://builds.apache.org/job/Atlas-0.8-IntegrationTests/ws/authorization/target/checkstyle-result.xml>
with 471 unique warnings and 0 duplicates.
[CHECKSTYLE] Successfully parsed file <https://builds.apache.org/job/Atlas-0.8-IntegrationTests/ws/catalog/target/checkstyle-result.xml>
with 2608 unique warnings and 0 duplicates.
[CHECKSTYLE] Successfully parsed file <https://builds.apache.org/job/Atlas-0.8-IntegrationTests/ws/client/client-v1/target/checkstyle-result.xml>
with 3484 unique warnings and 0 duplicates.
[CHECKSTYLE] Successfully parsed file <https://builds.apache.org/job/Atlas-0.8-IntegrationTests/ws/client/client-v2/target/checkstyle-result.xml>
with 3814 unique warnings and 0 duplicates.
[CHECKSTYLE] Successfully parsed file <https://builds.apache.org/job/Atlas-0.8-IntegrationTests/ws/client/common/target/checkstyle-result.xml>
with 4304 unique warnings and 0 duplicates.
[CHECKSTYLE] Successfully parsed file <https://builds.apache.org/job/Atlas-0.8-IntegrationTests/ws/client/target/checkstyle-result.xml>
with 4304 unique warnings and 0 duplicates.
[CHECKSTYLE] Successfully parsed file <https://builds.apache.org/job/Atlas-0.8-IntegrationTests/ws/common/target/checkstyle-result.xml>
with 5263 unique warnings and 0 duplicates.
[CHECKSTYLE] Successfully parsed file <https://builds.apache.org/job/Atlas-0.8-IntegrationTests/ws/dashboardv2/target/checkstyle-result.xml>
with 5263 unique warnings and 0 duplicates.
[CHECKSTYLE] Successfully parsed file <https://builds.apache.org/job/Atlas-0.8-IntegrationTests/ws/graphdb/api/target/checkstyle-result.xml>
with 5536 unique warnings and 0 duplicates.
[CHECKSTYLE] Successfully parsed file <https://builds.apache.org/job/Atlas-0.8-IntegrationTests/ws/graphdb/common/target/checkstyle-result.xml>
with 5723 unique warnings and 0 duplicates.
[CHECKSTYLE] Successfully parsed file <https://builds.apache.org/job/Atlas-0.8-IntegrationTests/ws/graphdb/graphdb-impls/target/checkstyle-result.xml>
with 5723 unique warnings and 0 duplicates.
[CHECKSTYLE] Successfully parsed file <https://builds.apache.org/job/Atlas-0.8-IntegrationTests/ws/graphdb/target/checkstyle-result.xml>
with 5723 unique warnings and 0 duplicates.
[CHECKSTYLE] Successfully parsed file <https://builds.apache.org/job/Atlas-0.8-IntegrationTests/ws/graphdb/titan0/target/checkstyle-result.xml>
with 8178 unique warnings and 0 duplicates.
[CHECKSTYLE] Successfully parsed file <https://builds.apache.org/job/Atlas-0.8-IntegrationTests/ws/graphdb/titan1/target/checkstyle-result.xml>
with 9145 unique warnings and 0 duplicates.
[CHECKSTYLE] Successfully parsed file <https://builds.apache.org/job/Atlas-0.8-IntegrationTests/ws/intg/target/checkstyle-result.xml>
with 16065 unique warnings and 0 duplicates.
[CHECKSTYLE] Successfully parsed file <https://builds.apache.org/job/Atlas-0.8-IntegrationTests/ws/notification/target/checkstyle-result.xml>
with 17822 unique warnings and 0 duplicates.
[CHECKSTYLE] Successfully parsed file <https://builds.apache.org/job/Atlas-0.8-IntegrationTests/ws/repository/target/checkstyle-result.xml>
with 36850 unique warnings and 0 duplicates.
[CHECKSTYLE] Successfully parsed file <https://builds.apache.org/job/Atlas-0.8-IntegrationTests/ws/server-api/target/checkstyle-result.xml>
with 37240 unique warnings and 0 duplicates.
[CHECKSTYLE] Successfully parsed file <https://builds.apache.org/job/Atlas-0.8-IntegrationTests/ws/shaded/hbase-client-shaded/target/checkstyle-result.xml>
with 37240 unique warnings and 0 duplicates.
[CHECKSTYLE] Successfully parsed file <https://builds.apache.org/job/Atlas-0.8-IntegrationTests/ws/shaded/hbase-server-shaded/target/checkstyle-result.xml>
with 37240 unique warnings and 0 duplicates.
[CHECKSTYLE] Successfully parsed file <https://builds.apache.org/job/Atlas-0.8-IntegrationTests/ws/target/checkstyle-result.xml>
with 37240 unique warnings and 0 duplicates.
[CHECKSTYLE] Successfully parsed file <https://builds.apache.org/job/Atlas-0.8-IntegrationTests/ws/typesystem/target/checkstyle-result.xml>
with 41481 unique warnings and 0 duplicates.
<Git Blamer> Using GitBlamer to create author and commit information for all warnings.
<Git Blamer> GIT_COMMIT=d359f3043a4905af81f752c60f9dc838c87801eb, workspace=<https://builds.apache.org/job/Atlas-0.8-IntegrationTests/ws/>
 > git rev-parse d359f3043a4905af81f752c60f9dc838c87801eb^{commit} # timeout=10
<Git Blamer> Skipping file <https://builds.apache.org/job/Atlas-0.8-IntegrationTests/ws/typesystem/src/main/java/org/apache/atlas/typesystem/IStruct.java,>
no result found.
[FINDBUGS] Collecting findbugs analysis files...
[FINDBUGS] Searching for all files in <https://builds.apache.org/job/Atlas-0.8-IntegrationTests/ws/>
that match the pattern **/target/findbugs.xml
[FINDBUGS] Parsing 15 files in <https://builds.apache.org/job/Atlas-0.8-IntegrationTests/ws/>
[FINDBUGS] Successfully parsed file <https://builds.apache.org/job/Atlas-0.8-IntegrationTests/ws/authorization/target/findbugs.xml>
with 0 unique warnings and 0 duplicates.
[FINDBUGS] Successfully parsed file <https://builds.apache.org/job/Atlas-0.8-IntegrationTests/ws/catalog/target/findbugs.xml>
with 0 unique warnings and 0 duplicates.
[FINDBUGS] Successfully parsed file <https://builds.apache.org/job/Atlas-0.8-IntegrationTests/ws/client/client-v1/target/findbugs.xml>
with 0 unique warnings and 0 duplicates.
[FINDBUGS] Successfully parsed file <https://builds.apache.org/job/Atlas-0.8-IntegrationTests/ws/client/client-v2/target/findbugs.xml>
with 0 unique warnings and 0 duplicates.
[FINDBUGS] Successfully parsed file <https://builds.apache.org/job/Atlas-0.8-IntegrationTests/ws/client/common/target/findbugs.xml>
with 0 unique warnings and 0 duplicates.
[FINDBUGS] Successfully parsed file <https://builds.apache.org/job/Atlas-0.8-IntegrationTests/ws/common/target/findbugs.xml>
with 0 unique warnings and 0 duplicates.
[FINDBUGS] Successfully parsed file <https://builds.apache.org/job/Atlas-0.8-IntegrationTests/ws/graphdb/api/target/findbugs.xml>
with 0 unique warnings and 0 duplicates.
[FINDBUGS] Successfully parsed file <https://builds.apache.org/job/Atlas-0.8-IntegrationTests/ws/graphdb/common/target/findbugs.xml>
with 0 unique warnings and 0 duplicates.
[FINDBUGS] Successfully parsed file <https://builds.apache.org/job/Atlas-0.8-IntegrationTests/ws/graphdb/titan0/target/findbugs.xml>
with 0 unique warnings and 0 duplicates.
[FINDBUGS] Successfully parsed file <https://builds.apache.org/job/Atlas-0.8-IntegrationTests/ws/graphdb/titan1/target/findbugs.xml>
with 0 unique warnings and 0 duplicates.
[FINDBUGS] Successfully parsed file <https://builds.apache.org/job/Atlas-0.8-IntegrationTests/ws/intg/target/findbugs.xml>
with 0 unique warnings and 0 duplicates.
[FINDBUGS] Successfully parsed file <https://builds.apache.org/job/Atlas-0.8-IntegrationTests/ws/notification/target/findbugs.xml>
with 0 unique warnings and 0 duplicates.
[FINDBUGS] Successfully parsed file <https://builds.apache.org/job/Atlas-0.8-IntegrationTests/ws/repository/target/findbugs.xml>
with 0 unique warnings and 0 duplicates.
[FINDBUGS] Successfully parsed file <https://builds.apache.org/job/Atlas-0.8-IntegrationTests/ws/server-api/target/findbugs.xml>
with 0 unique warnings and 0 duplicates.
[FINDBUGS] Successfully parsed file <https://builds.apache.org/job/Atlas-0.8-IntegrationTests/ws/typesystem/target/findbugs.xml>
with 0 unique warnings and 0 duplicates.
<Git Blamer> Using GitBlamer to create author and commit information for all warnings.
<Git Blamer> GIT_COMMIT=d359f3043a4905af81f752c60f9dc838c87801eb, workspace=<https://builds.apache.org/job/Atlas-0.8-IntegrationTests/ws/>
Archiving artifacts
[Fast Archiver] No prior successful build to compare, so performing full copy of artifacts
TestNG Reports Processing: START
Looking for TestNG results report in workspace using pattern: **/target/surefire-reports/testng-results.xml,**/target/failsafe-reports/testng-results.xml
Saving reports...
Processing '/x1/jenkins/jenkins-home/jobs/Atlas-0.8-IntegrationTests/builds/193/testng/testng-results.xml'
1.481481% of tests failed, which exceeded threshold of 0%. Marking build as UNSTABLE
TestNG Reports Processing: FINISH

Mime
View raw message