atlas-dev mailing list archives

Site index · List index
Message view « Date » · « Thread »
Top « Date » · « Thread »
From Apache Jenkins Server <jenk...@builds.apache.org>
Subject Build failed in Jenkins: Atlas-master-IntegrationTests #750
Date Mon, 12 Mar 2018 09:45:32 GMT
See <https://builds.apache.org/job/Atlas-master-IntegrationTests/750/display/redirect>

------------------------------------------
[...truncated 284.16 KB...]
[INFO] │   │   │ ├── process-nextick-args@2.0.0 
[INFO] │   │   │ └── string_decoder@1.0.3 
[INFO] │   │   └── typedarray@0.0.6 
[INFO] │   └── pretty-bytes@1.0.4 
[INFO] ├─┬ grunt-contrib-htmlmin@2.2.0 
[INFO] │ ├─┬ html-minifier@3.3.3 
[INFO] │ │ ├─┬ camel-case@3.0.0 
[INFO] │ │ │ ├─┬ no-case@2.3.2 
[INFO] │ │ │ │ └── lower-case@1.1.4 
[INFO] │ │ │ └── upper-case@1.1.3 
[INFO] │ │ ├─┬ commander@2.9.0 
[INFO] │ │ │ └── graceful-readlink@1.0.1 
[INFO] │ │ ├── he@1.1.1 
[INFO] │ │ ├─┬ ncname@1.0.0 
[INFO] │ │ │ └── xml-char-classes@1.0.0 
[INFO] │ │ ├── param-case@2.1.1 
[INFO] │ │ └── relateurl@0.2.7 
[INFO] │ └── pretty-bytes@4.0.2 
[INFO] ├─┬ grunt-contrib-uglify@2.1.0 
[INFO] │ ├─┬ object.assign@4.1.0 
[INFO] │ │ ├─┬ define-properties@1.1.2 
[INFO] │ │ │ └── foreach@2.0.5 
[INFO] │ │ ├── function-bind@1.1.1 
[INFO] │ │ ├── has-symbols@1.0.0 
[INFO] │ │ └── object-keys@1.0.11 
[INFO] │ ├─┬ uglify-js@2.7.5 
[INFO] │ │ ├── async@0.2.10 
[INFO] │ │ ├── uglify-to-browserify@1.0.2 
[INFO] │ │ └─┬ yargs@3.10.0 
[INFO] │ │   ├── camelcase@1.2.1 
[INFO] │ │   ├─┬ cliui@2.1.0 
[INFO] │ │   │ ├─┬ center-align@0.1.3 
[INFO] │ │   │ │ ├─┬ align-text@0.1.4 
[INFO] │ │   │ │ │ ├─┬ kind-of@3.2.2 
[INFO] │ │   │ │ │ │ └── is-buffer@1.1.6 
[INFO] │ │   │ │ │ ├── longest@1.0.1 
[INFO] │ │   │ │ │ └── repeat-string@1.6.1 
[INFO] │ │   │ │ └── lazy-cache@1.0.4 
[INFO] │ │   │ ├── right-align@0.1.3 
[INFO] │ │   │ └── wordwrap@0.0.2 
[INFO] │ │   └── window-size@0.1.0 
[INFO] │ └── uri-path@1.0.0 
[INFO] ├─┬ grunt-contrib-watch@1.0.0 
[INFO] │ ├─┬ gaze@1.1.2 
[INFO] │ │ └─┬ globule@1.2.0 
[INFO] │ │   ├── glob@7.1.2 
[INFO] │ │   └── lodash@4.17.5 
[INFO] │ └─┬ tiny-lr@0.2.1 
[INFO] │   ├─┬ body-parser@1.14.2 
[ERROR] npm ERR! Linux 3.13.0-135-generic
[INFO] │   │ ├── bytes@2.2.0 
[INFO] │   │ ├── content-type@1.0.4 
[INFO] │   │ ├─┬ debug@2.2.0 
[INFO] │   │ │ └── ms@0.7.1 
[INFO] │   │ ├── http-errors@1.3.1 
[INFO] │   │ ├── iconv-lite@0.4.13 
[INFO] │   │ ├── qs@5.2.0 
[INFO] │   │ ├─┬ raw-body@2.1.7 
[INFO] │   │ │ ├── bytes@2.4.0 
[INFO] │   │ │ └── iconv-lite@0.4.13 
[INFO] │   │ └─┬ type-is@1.6.16 
[INFO] │   │   └── media-typer@0.3.0 
[INFO] │   ├─┬ debug@2.2.0 
[INFO] │   │ └── ms@0.7.1 
[INFO] │   ├─┬ faye-websocket@0.10.0 
[INFO] │   │ └─┬ websocket-driver@0.7.0 
[INFO] │   │   ├── http-parser-js@0.4.11 
[INFO] │   │   └── websocket-extensions@0.1.3 
[INFO] │   ├── livereload-js@2.3.0 
[INFO] │   └── qs@5.1.0 
[INFO] ├── grunt-middleware-proxy@1.0.7 
[INFO] ├── grunt-template@1.0.0 
[INFO] ├── jquery@3.3.1 
[INFO] ├── jquery-asBreadcrumbs@0.2.2 
[INFO] ├── jquery-placeholder@2.3.1 
[INFO] ├─┬ jQuery-QueryBuilder@2.4.3 
[INFO] │ ├── dot@1.1.2 
[INFO] │ └── jquery-extendext@0.1.2 
[ERROR] npm ERR! argv "<https://builds.apache.org/job/Atlas-master-IntegrationTests/ws/dashboardv2/target/node/node">
"<https://builds.apache.org/job/Atlas-master-IntegrationTests/ws/dashboardv2/target/node/node_modules/npm/bin/npm-cli.js">
"install"
[INFO] ├── jquery-sparkline@2.4.0 
[INFO] ├─┬ load-grunt-tasks@3.5.2 
[INFO] │ ├── arrify@1.0.1 
[INFO] │ ├─┬ multimatch@2.1.0 
[INFO] │ │ ├── array-differ@1.0.0 
[INFO] │ │ └─┬ array-union@1.0.2 
[INFO] │ │   └── array-uniq@1.0.3 
[INFO] │ ├─┬ pkg-up@1.0.0 
[INFO] │ │ └─┬ find-up@1.1.2 
[INFO] │ │   └── path-exists@2.1.0 
[INFO] │ └─┬ resolve-pkg@0.1.0 
[INFO] │   └── resolve-from@2.0.0 
[INFO] ├── moment@2.21.0 
[INFO] ├── moment-timezone@0.5.14 
[ERROR] npm ERR! node v4.4.2
[INFO] ├── nvd3@1.8.5 
[INFO] ├── platform@1.3.4 
[INFO] ├── pnotify@3.2.0 
[INFO] ├── requirejs@2.3.3 
[ERROR] npm ERR! npm  v3.8.5
[INFO] ├── requirejs-text@2.0.15 
[INFO] ├─┬ select2@4.0.3 
[INFO] │ ├── almond@0.3.3 
[INFO] │ └── jquery-mousewheel@3.1.13 
[INFO] ├─┬ table-dragger@1.0.2 
[INFO] │ ├─┬ babel-runtime@6.26.0 
[INFO] │ │ ├── core-js@2.5.3 
[INFO] │ │ └── regenerator-runtime@0.11.1 
[INFO] │ ├─┬ crossvent@1.5.5 
[INFO] │ │ └── custom-event@1.0.1 
[INFO] │ ├─┬ dragula-with-animation@3.7.2 
[ERROR] npm ERR! code ELIFECYCLE
[INFO] │ │ ├─┬ contra@1.9.4 
[ERROR] 
[INFO] │ │ │ ├── atoa@1.0.0 
[INFO] │ │ │ └── ticky@1.0.1 
[INFO] │ │ └─┬ crossvent@1.5.4 
[INFO] │ │   └── custom-event@1.0.0 
[INFO] │ └── rx@4.1.0 
[INFO] └── underscore@1.8.3 
[INFO] 
[ERROR] npm ERR! node-sass@3.13.1 install: `node scripts/install.js`
[ERROR] npm ERR! Exit status 1
[ERROR] npm ERR! 
[ERROR] npm ERR! Failed at the node-sass@3.13.1 install script 'node scripts/install.js'.
[ERROR] npm ERR! Make sure you have the latest version of node.js and npm installed.
[ERROR] npm ERR! If you do, this is most likely a problem with the node-sass package,
[ERROR] npm ERR! not with npm itself.
[ERROR] npm ERR! Tell the author that this fails on your system:
[ERROR] npm ERR!     node scripts/install.js
[ERROR] npm ERR! You can get information on how to open an issue for this project with:
[ERROR] npm ERR!     npm bugs node-sass
[ERROR] npm ERR! Or if that isn't available, you can get their info via:
[ERROR] npm ERR!     npm owner ls node-sass
[ERROR] npm ERR! There is likely additional logging output above.
[ERROR] 
[ERROR] npm ERR! Please include the following file with any support request:
[ERROR] npm ERR!     <https://builds.apache.org/job/Atlas-master-IntegrationTests/ws/dashboardv2/target/npm-debug.log>
[INFO] ------------------------------------------------------------------------
[INFO] Reactor Summary:
[INFO] 
[INFO] Apache Atlas Server Build Tools .................... SUCCESS [  1.560 s]
[INFO] apache-atlas ....................................... SUCCESS [ 10.926 s]
[INFO] Apache Atlas Test Utility Tools .................... SUCCESS [ 18.381 s]
[INFO] Open Connector Framework (OCF) ..................... SUCCESS [ 13.425 s]
[INFO] Apache Atlas Integration ........................... SUCCESS [ 22.122 s]
[INFO] Apache Atlas Common ................................ SUCCESS [  9.352 s]
[INFO] Apache Atlas Client ................................ SUCCESS [  0.739 s]
[INFO] atlas-client-common ................................ SUCCESS [  6.839 s]
[INFO] atlas-client-v1 .................................... SUCCESS [  7.259 s]
[INFO] Apache Atlas Server API ............................ SUCCESS [  5.873 s]
[INFO] Apache Atlas Notification .......................... SUCCESS [  9.733 s]
[INFO] atlas-client-v2 .................................... SUCCESS [  6.018 s]
[INFO] Apache Atlas Graph Database Projects ............... SUCCESS [  0.661 s]
[INFO] Apache Atlas Graph Database API .................... SUCCESS [  5.054 s]
[INFO] Graph Database Common Code ......................... SUCCESS [  5.310 s]
[INFO] Apache Atlas JanusGraph DB Impl .................... SUCCESS [ 17.319 s]
[INFO] Apache Atlas Graph Database Implementation Dependencies SUCCESS [  2.659 s]
[INFO] Shaded version of Apache hbase client .............. SUCCESS [  9.995 s]
[INFO] Apache Atlas Titan 0.5.4 Graph DB Impl ............. SUCCESS [ 43.955 s]
[INFO] Shaded version of Apache hbase server .............. SUCCESS [ 23.803 s]
[INFO] Apache Atlas Authorization ......................... SUCCESS [  6.790 s]
[INFO] Apache Atlas Repository ............................ SUCCESS [ 31.655 s]
[INFO] Apache Atlas UI .................................... FAILURE [ 54.083 s]
[INFO] Apache Atlas Web Application ....................... SKIPPED
[INFO] Apache Atlas Documentation ......................... SKIPPED
[INFO] Apache Atlas FileSystem Model ...................... SKIPPED
[INFO] Apache Atlas Plugin Classloader .................... SKIPPED
[INFO] Apache Atlas Hive Bridge Shim ...................... SKIPPED
[INFO] Apache Atlas Hive Bridge ........................... SKIPPED
[INFO] Apache Atlas Falcon Bridge Shim .................... SKIPPED
[INFO] Apache Atlas Falcon Bridge ......................... SKIPPED
[INFO] Apache Atlas Sqoop Bridge Shim ..................... SKIPPED
[INFO] Apache Atlas Sqoop Bridge .......................... SKIPPED
[INFO] Apache Atlas Storm Bridge Shim ..................... SKIPPED
[INFO] Apache Atlas Storm Bridge .......................... SKIPPED
[INFO] Apache Atlas Hbase Bridge Shim ..................... SKIPPED
[INFO] Apache Atlas Hbase Bridge .......................... SKIPPED
[INFO] Apache Atlas Distribution .......................... SKIPPED
[INFO] ------------------------------------------------------------------------
[INFO] BUILD FAILURE
[INFO] ------------------------------------------------------------------------
[INFO] Total time: 05:16 min
[INFO] Finished at: 2018-03-12T09:38:29Z
[INFO] Final Memory: 163M/1878M
[INFO] ------------------------------------------------------------------------
[ERROR] Failed to execute goal com.github.eirslett:frontend-maven-plugin:1.0:npm (npm install)
on project atlas-dashboardv2: Failed to run task: 'npm install' failed. (error code 1) ->
[Help 1]
[ERROR] 
[ERROR] To see the full stack trace of the errors, re-run Maven with the -e switch.
[ERROR] Re-run Maven using the -X switch to enable full debug logging.
[ERROR] 
[ERROR] For more information about the errors and possible solutions, please read the following
articles:
[ERROR] [Help 1] http://cwiki.apache.org/confluence/display/MAVEN/MojoFailureException
[ERROR] 
[ERROR] After correcting the problems, you can resume the build with the command
[ERROR]   mvn <goals> -rf :atlas-dashboardv2
Build step 'Execute shell' marked build as failure
[CHECKSTYLE] Collecting checkstyle analysis files...
[CHECKSTYLE] Searching for all files in <https://builds.apache.org/job/Atlas-master-IntegrationTests/ws/>
that match the pattern **/target/checkstyle-result.xml
[CHECKSTYLE] Parsing 21 files in <https://builds.apache.org/job/Atlas-master-IntegrationTests/ws/>
[CHECKSTYLE] Successfully parsed file <https://builds.apache.org/job/Atlas-master-IntegrationTests/ws/authorization/target/checkstyle-result.xml>
with 666 unique warnings and 0 duplicates.
[CHECKSTYLE] Successfully parsed file <https://builds.apache.org/job/Atlas-master-IntegrationTests/ws/client/client-v1/target/checkstyle-result.xml>
with 1550 unique warnings and 0 duplicates.
[CHECKSTYLE] Successfully parsed file <https://builds.apache.org/job/Atlas-master-IntegrationTests/ws/client/client-v2/target/checkstyle-result.xml>
with 1895 unique warnings and 0 duplicates.
[CHECKSTYLE] Successfully parsed file <https://builds.apache.org/job/Atlas-master-IntegrationTests/ws/client/common/target/checkstyle-result.xml>
with 2383 unique warnings and 0 duplicates.
[CHECKSTYLE] Successfully parsed file <https://builds.apache.org/job/Atlas-master-IntegrationTests/ws/client/target/checkstyle-result.xml>
with 2383 unique warnings and 0 duplicates.
[CHECKSTYLE] Successfully parsed file <https://builds.apache.org/job/Atlas-master-IntegrationTests/ws/common/target/checkstyle-result.xml>
with 3414 unique warnings and 0 duplicates.
[CHECKSTYLE] Successfully parsed file <https://builds.apache.org/job/Atlas-master-IntegrationTests/ws/graphdb/api/target/checkstyle-result.xml>
with 3706 unique warnings and 0 duplicates.
[CHECKSTYLE] Successfully parsed file <https://builds.apache.org/job/Atlas-master-IntegrationTests/ws/graphdb/common/target/checkstyle-result.xml>
with 3915 unique warnings and 0 duplicates.
[CHECKSTYLE] Successfully parsed file <https://builds.apache.org/job/Atlas-master-IntegrationTests/ws/graphdb/graphdb-impls/target/checkstyle-result.xml>
with 3915 unique warnings and 0 duplicates.
[CHECKSTYLE] Successfully parsed file <https://builds.apache.org/job/Atlas-master-IntegrationTests/ws/graphdb/janus/target/checkstyle-result.xml>
with 4961 unique warnings and 0 duplicates.
[CHECKSTYLE] Successfully parsed file <https://builds.apache.org/job/Atlas-master-IntegrationTests/ws/graphdb/target/checkstyle-result.xml>
with 4961 unique warnings and 0 duplicates.
[CHECKSTYLE] Successfully parsed file <https://builds.apache.org/job/Atlas-master-IntegrationTests/ws/graphdb/titan0/target/checkstyle-result.xml>
with 7459 unique warnings and 0 duplicates.
[CHECKSTYLE] Successfully parsed file <https://builds.apache.org/job/Atlas-master-IntegrationTests/ws/intg/target/checkstyle-result.xml>
with 18402 unique warnings and 0 duplicates.
[CHECKSTYLE] Successfully parsed file <https://builds.apache.org/job/Atlas-master-IntegrationTests/ws/notification/target/checkstyle-result.xml>
with 19637 unique warnings and 0 duplicates.
[CHECKSTYLE] Successfully parsed file <https://builds.apache.org/job/Atlas-master-IntegrationTests/ws/om-fwk-ocf/target/checkstyle-result.xml>
with 24367 unique warnings and 0 duplicates.
[CHECKSTYLE] Successfully parsed file <https://builds.apache.org/job/Atlas-master-IntegrationTests/ws/repository/target/checkstyle-result.xml>
with 43647 unique warnings and 0 duplicates.
[CHECKSTYLE] Successfully parsed file <https://builds.apache.org/job/Atlas-master-IntegrationTests/ws/server-api/target/checkstyle-result.xml>
with 43793 unique warnings and 0 duplicates.
[CHECKSTYLE] Successfully parsed file <https://builds.apache.org/job/Atlas-master-IntegrationTests/ws/shaded/hbase-client-shaded/target/checkstyle-result.xml>
with 43793 unique warnings and 0 duplicates.
[CHECKSTYLE] Successfully parsed file <https://builds.apache.org/job/Atlas-master-IntegrationTests/ws/shaded/hbase-server-shaded/target/checkstyle-result.xml>
with 43793 unique warnings and 0 duplicates.
[CHECKSTYLE] Successfully parsed file <https://builds.apache.org/job/Atlas-master-IntegrationTests/ws/target/checkstyle-result.xml>
with 43793 unique warnings and 0 duplicates.
[CHECKSTYLE] Successfully parsed file <https://builds.apache.org/job/Atlas-master-IntegrationTests/ws/test-tools/target/checkstyle-result.xml>
with 43831 unique warnings and 0 duplicates.
<Git Blamer> Using GitBlamer to create author and commit information for all warnings.
<Git Blamer> GIT_COMMIT=ebe99f1d210f3cf4fb95d99dbb77ed09fdca782e, workspace=<https://builds.apache.org/job/Atlas-master-IntegrationTests/ws/>
 > git rev-parse ebe99f1d210f3cf4fb95d99dbb77ed09fdca782e^{commit} # timeout=10
[CHECKSTYLE] Computing warning deltas based on reference build #749
[FINDBUGS] Collecting findbugs analysis files...
[FINDBUGS] Searching for all files in <https://builds.apache.org/job/Atlas-master-IntegrationTests/ws/>
that match the pattern **/target/findbugs.xml
[FINDBUGS] Parsing 15 files in <https://builds.apache.org/job/Atlas-master-IntegrationTests/ws/>
[FINDBUGS] Successfully parsed file <https://builds.apache.org/job/Atlas-master-IntegrationTests/ws/authorization/target/findbugs.xml>
with 0 unique warnings and 0 duplicates.
[FINDBUGS] Successfully parsed file <https://builds.apache.org/job/Atlas-master-IntegrationTests/ws/client/client-v1/target/findbugs.xml>
with 0 unique warnings and 0 duplicates.
[FINDBUGS] Successfully parsed file <https://builds.apache.org/job/Atlas-master-IntegrationTests/ws/client/client-v2/target/findbugs.xml>
with 0 unique warnings and 0 duplicates.
[FINDBUGS] Successfully parsed file <https://builds.apache.org/job/Atlas-master-IntegrationTests/ws/client/common/target/findbugs.xml>
with 0 unique warnings and 0 duplicates.
[FINDBUGS] Successfully parsed file <https://builds.apache.org/job/Atlas-master-IntegrationTests/ws/common/target/findbugs.xml>
with 0 unique warnings and 0 duplicates.
[FINDBUGS] Successfully parsed file <https://builds.apache.org/job/Atlas-master-IntegrationTests/ws/graphdb/api/target/findbugs.xml>
with 0 unique warnings and 0 duplicates.
[FINDBUGS] Successfully parsed file <https://builds.apache.org/job/Atlas-master-IntegrationTests/ws/graphdb/common/target/findbugs.xml>
with 0 unique warnings and 0 duplicates.
[FINDBUGS] Successfully parsed file <https://builds.apache.org/job/Atlas-master-IntegrationTests/ws/graphdb/janus/target/findbugs.xml>
with 0 unique warnings and 0 duplicates.
[FINDBUGS] Successfully parsed file <https://builds.apache.org/job/Atlas-master-IntegrationTests/ws/graphdb/titan0/target/findbugs.xml>
with 0 unique warnings and 0 duplicates.
[FINDBUGS] Successfully parsed file <https://builds.apache.org/job/Atlas-master-IntegrationTests/ws/intg/target/findbugs.xml>
with 0 unique warnings and 0 duplicates.
[FINDBUGS] Successfully parsed file <https://builds.apache.org/job/Atlas-master-IntegrationTests/ws/notification/target/findbugs.xml>
with 0 unique warnings and 0 duplicates.
[FINDBUGS] Successfully parsed file <https://builds.apache.org/job/Atlas-master-IntegrationTests/ws/om-fwk-ocf/target/findbugs.xml>
with 0 unique warnings and 0 duplicates.
[FINDBUGS] Successfully parsed file <https://builds.apache.org/job/Atlas-master-IntegrationTests/ws/repository/target/findbugs.xml>
with 0 unique warnings and 0 duplicates.
[FINDBUGS] Successfully parsed file <https://builds.apache.org/job/Atlas-master-IntegrationTests/ws/server-api/target/findbugs.xml>
with 0 unique warnings and 0 duplicates.
[FINDBUGS] Successfully parsed file <https://builds.apache.org/job/Atlas-master-IntegrationTests/ws/test-tools/target/findbugs.xml>
with 0 unique warnings and 0 duplicates.
<Git Blamer> Using GitBlamer to create author and commit information for all warnings.
<Git Blamer> GIT_COMMIT=ebe99f1d210f3cf4fb95d99dbb77ed09fdca782e, workspace=<https://builds.apache.org/job/Atlas-master-IntegrationTests/ws/>
[FINDBUGS] Computing warning deltas based on reference build #749
Archiving artifacts
TestNG Reports Processing: START
Looking for TestNG results report in workspace using pattern: **/target/surefire-reports/testng-results.xml,**/target/failsafe-reports/testng-results.xml
Did not find any matching files.

Mime
View raw message