atlas-dev mailing list archives

Site index · List index
Message view « Date » · « Thread »
Top « Date » · « Thread »
From Apache Jenkins Server <jenk...@builds.apache.org>
Subject Build failed in Jenkins: Atlas-master-IntegrationTests #819
Date Wed, 21 Mar 2018 00:38:51 GMT
See <https://builds.apache.org/job/Atlas-master-IntegrationTests/819/display/redirect>

------------------------------------------
[...truncated 655.88 KB...]
[INFO] 
[INFO] --- maven-failsafe-plugin:2.18.1:integration-test (integration-test) @ falcon-bridge
---
[WARNING] useSystemClassloader setting has no effect when not forking
[INFO] Failsafe report directory: <https://builds.apache.org/job/Atlas-master-IntegrationTests/ws/addons/falcon-bridge/target/failsafe-reports>
Running org.apache.atlas.falcon.hook.FalconHookIT
127.0.0.1 - - [21/Mar/2018:00:27:52 +0000] "GET //localhost:31000/api/atlas/entities?type=falcon_cluster&property=qualifiedName&value=clusterSlMnkNXaz5
HTTP/1.1" 404 106 "-" "Java/1.8.0_152"
127.0.0.1 - - [21/Mar/2018:00:27:53 +0000] "GET //localhost:31000/api/atlas/entities?type=falcon_cluster&property=qualifiedName&value=clusterSlMnkNXaz5
HTTP/1.1" 404 106 "-" "Java/1.8.0_152"
127.0.0.1 - - [21/Mar/2018:00:27:53 +0000] "GET //localhost:31000/api/atlas/entities?type=falcon_cluster&property=qualifiedName&value=clusterSlMnkNXaz5
HTTP/1.1" 404 106 "-" "Java/1.8.0_152"
127.0.0.1 - - [21/Mar/2018:00:27:53 +0000] "GET //localhost:31000/api/atlas/entities?type=falcon_cluster&property=qualifiedName&value=clusterSlMnkNXaz5
HTTP/1.1" 404 106 "-" "Java/1.8.0_152"
127.0.0.1 - - [21/Mar/2018:00:27:54 +0000] "GET //localhost:31000/api/atlas/entities?type=falcon_cluster&property=qualifiedName&value=clusterSlMnkNXaz5
HTTP/1.1" 404 106 "-" "Java/1.8.0_152"
127.0.0.1 - - [21/Mar/2018:00:27:54 +0000] "GET //localhost:31000/api/atlas/entities?type=falcon_cluster&property=qualifiedName&value=clusterSlMnkNXaz5
HTTP/1.1" 404 106 "-" "Java/1.8.0_152"
127.0.0.1 - - [21/Mar/2018:00:27:54 +0000] "GET //localhost:31000/api/atlas/entities?type=falcon_feed&property=qualifiedName&value=feedfwc8C0vMz7@clustervBeQ70DwXR
HTTP/1.1" 404 118 "-" "Java/1.8.0_152"
127.0.0.1 - - [21/Mar/2018:00:27:55 +0000] "GET //localhost:31000/api/atlas/entities?type=falcon_feed&property=qualifiedName&value=feedfwc8C0vMz7@clustervBeQ70DwXR
HTTP/1.1" 404 118 "-" "Java/1.8.0_152"
127.0.0.1 - - [21/Mar/2018:00:27:55 +0000] "GET //localhost:31000/api/atlas/entities?type=falcon_feed&property=qualifiedName&value=feedfwc8C0vMz7@clustervBeQ70DwXR
HTTP/1.1" 404 118 "-" "Java/1.8.0_152"
127.0.0.1 - - [21/Mar/2018:00:27:56 +0000] "GET //localhost:31000/api/atlas/entities?type=falcon_feed&property=qualifiedName&value=feedfwc8C0vMz7@clustervBeQ70DwXR
HTTP/1.1" 200 923 "-" "Java/1.8.0_152"
127.0.0.1 - - [21/Mar/2018:00:27:56 +0000] "GET //localhost:31000/api/atlas/entities?type=falcon_feed&property=qualifiedName&value=feedfwc8C0vMz7@clustervBeQ70DwXR
HTTP/1.1" 200 923 "-" "Java/1.8.0_152"
127.0.0.1 - - [21/Mar/2018:00:27:56 +0000] "GET //localhost:31000/api/atlas/entities/0c1e6553-66b0-4540-aabc-ad11e8d15c67
HTTP/1.1" 200 923 "-" "Java/1.8.0_152"
127.0.0.1 - - [21/Mar/2018:00:27:56 +0000] "GET //localhost:31000/api/atlas/entities?type=falcon_feed_creation&property=qualifiedName&value=feedfwc8C0vMz7@clustervBeQ70DwXR
HTTP/1.1" 200 1266 "-" "Java/1.8.0_152"
127.0.0.1 - - [21/Mar/2018:00:27:56 +0000] "GET //localhost:31000/api/atlas/entities?type=falcon_feed_creation&property=qualifiedName&value=feedfwc8C0vMz7@clustervBeQ70DwXR
HTTP/1.1" 200 1266 "-" "Java/1.8.0_152"
127.0.0.1 - - [21/Mar/2018:00:27:56 +0000] "GET //localhost:31000/api/atlas/entities/3c366bd8-9567-47ed-a7ac-520346996bc6
HTTP/1.1" 200 1266 "-" "Java/1.8.0_152"
127.0.0.1 - - [21/Mar/2018:00:27:56 +0000] "GET //localhost:31000/api/atlas/entities/236b3590-bf75-4bb5-937b-76b477be96f8
HTTP/1.1" 200 1018 "-" "Java/1.8.0_152"
127.0.0.1 - - [21/Mar/2018:00:27:56 +0000] "GET //localhost:31000/api/atlas/entities?type=falcon_feed&property=qualifiedName&value=feedR4qq8EInE3@clustervBeQ70DwXR
HTTP/1.1" 404 118 "-" "Java/1.8.0_152"
127.0.0.1 - - [21/Mar/2018:00:27:57 +0000] "GET //localhost:31000/api/atlas/entities?type=falcon_feed&property=qualifiedName&value=feedR4qq8EInE3@clustervBeQ70DwXR
HTTP/1.1" 200 923 "-" "Java/1.8.0_152"
127.0.0.1 - - [21/Mar/2018:00:27:57 +0000] "GET //localhost:31000/api/atlas/entities?type=falcon_feed&property=qualifiedName&value=feedR4qq8EInE3@clustervBeQ70DwXR
HTTP/1.1" 200 923 "-" "Java/1.8.0_152"
127.0.0.1 - - [21/Mar/2018:00:27:57 +0000] "GET //localhost:31000/api/atlas/entities/e5b580ca-aea9-4372-9f45-8e0c5c0ce175
HTTP/1.1" 200 923 "-" "Java/1.8.0_152"
127.0.0.1 - - [21/Mar/2018:00:27:57 +0000] "GET //localhost:31000/api/atlas/entities?type=falcon_feed_creation&property=qualifiedName&value=feedR4qq8EInE3@clustervBeQ70DwXR
HTTP/1.1" 200 1267 "-" "Java/1.8.0_152"
127.0.0.1 - - [21/Mar/2018:00:27:57 +0000] "GET //localhost:31000/api/atlas/entities?type=falcon_feed_creation&property=qualifiedName&value=feedR4qq8EInE3@clustervBeQ70DwXR
HTTP/1.1" 200 1267 "-" "Java/1.8.0_152"
127.0.0.1 - - [21/Mar/2018:00:27:57 +0000] "GET //localhost:31000/api/atlas/entities/923ef0bd-e682-40a2-acb9-22414e6c9c86
HTTP/1.1" 200 1267 "-" "Java/1.8.0_152"
127.0.0.1 - - [21/Mar/2018:00:27:57 +0000] "GET //localhost:31000/api/atlas/entities/005df8ea-8e28-4ae0-bee2-5cd08a19b592
HTTP/1.1" 200 1127 "-" "Java/1.8.0_152"
127.0.0.1 - - [21/Mar/2018:00:27:57 +0000] "GET //localhost:31000/api/atlas/entities?type=falcon_feed&property=qualifiedName&value=feedR4qq8EInE3@clustervBeQ70DwXR
HTTP/1.1" 200 923 "-" "Java/1.8.0_152"
127.0.0.1 - - [21/Mar/2018:00:27:57 +0000] "GET //localhost:31000/api/atlas/entities?type=falcon_process&property=qualifiedName&value=processjEPyAMjwtU@clustervBeQ70DwXR
HTTP/1.1" 404 124 "-" "Java/1.8.0_152"
127.0.0.1 - - [21/Mar/2018:00:27:57 +0000] "GET //localhost:31000/api/atlas/entities?type=falcon_process&property=qualifiedName&value=processjEPyAMjwtU@clustervBeQ70DwXR
HTTP/1.1" 200 1492 "-" "Java/1.8.0_152"
127.0.0.1 - - [21/Mar/2018:00:27:57 +0000] "GET //localhost:31000/api/atlas/entities?type=falcon_process&property=qualifiedName&value=processjEPyAMjwtU@clustervBeQ70DwXR
HTTP/1.1" 200 1492 "-" "Java/1.8.0_152"
127.0.0.1 - - [21/Mar/2018:00:27:57 +0000] "GET //localhost:31000/api/atlas/entities/70f306e5-2386-48b6-945e-d14f856f9c56
HTTP/1.1" 200 1492 "-" "Java/1.8.0_152"
127.0.0.1 - - [21/Mar/2018:00:27:58 +0000] "GET //localhost:31000/api/atlas/entities?type=falcon_cluster&property=qualifiedName&value=clusterFLoD3I838M
HTTP/1.1" 404 106 "-" "Java/1.8.0_152"
127.0.0.1 - - [21/Mar/2018:00:27:58 +0000] "GET //localhost:31000/api/atlas/entities?type=falcon_cluster&property=qualifiedName&value=clusterFLoD3I838M
HTTP/1.1" 200 704 "-" "Java/1.8.0_152"
127.0.0.1 - - [21/Mar/2018:00:27:58 +0000] "GET //localhost:31000/api/atlas/entities?type=falcon_cluster&property=qualifiedName&value=clusterFLoD3I838M
HTTP/1.1" 200 704 "-" "Java/1.8.0_152"
127.0.0.1 - - [21/Mar/2018:00:27:58 +0000] "GET //localhost:31000/api/atlas/entities?type=falcon_cluster&property=qualifiedName&value=clusterAdZAioFfj1
HTTP/1.1" 404 106 "-" "Java/1.8.0_152"
127.0.0.1 - - [21/Mar/2018:00:27:58 +0000] "GET //localhost:31000/api/atlas/entities?type=falcon_cluster&property=qualifiedName&value=clusterAdZAioFfj1
HTTP/1.1" 200 704 "-" "Java/1.8.0_152"
127.0.0.1 - - [21/Mar/2018:00:27:59 +0000] "GET //localhost:31000/api/atlas/entities?type=falcon_cluster&property=qualifiedName&value=clusterAdZAioFfj1
HTTP/1.1" 200 704 "-" "Java/1.8.0_152"
127.0.0.1 - - [21/Mar/2018:00:27:59 +0000] "GET //localhost:31000/api/atlas/entities?type=falcon_feed&property=qualifiedName&value=feednEQUkxM1Sp@clusterFLoD3I838M
HTTP/1.1" 404 118 "-" "Java/1.8.0_152"
127.0.0.1 - - [21/Mar/2018:00:27:59 +0000] "GET //localhost:31000/api/atlas/entities?type=falcon_feed&property=qualifiedName&value=feednEQUkxM1Sp@clusterFLoD3I838M
HTTP/1.1" 200 923 "-" "Java/1.8.0_152"
127.0.0.1 - - [21/Mar/2018:00:27:59 +0000] "GET //localhost:31000/api/atlas/entities?type=falcon_feed&property=qualifiedName&value=feednEQUkxM1Sp@clusterFLoD3I838M
HTTP/1.1" 200 923 "-" "Java/1.8.0_152"
127.0.0.1 - - [21/Mar/2018:00:27:59 +0000] "GET //localhost:31000/api/atlas/entities/49d536d0-e524-4dbf-b771-dd4a30a7f15d
HTTP/1.1" 200 923 "-" "Java/1.8.0_152"
127.0.0.1 - - [21/Mar/2018:00:27:59 +0000] "GET //localhost:31000/api/atlas/entities?type=falcon_feed_creation&property=qualifiedName&value=feednEQUkxM1Sp@clusterFLoD3I838M
HTTP/1.1" 200 1267 "-" "Java/1.8.0_152"
127.0.0.1 - - [21/Mar/2018:00:27:59 +0000] "GET //localhost:31000/api/atlas/entities?type=falcon_feed_creation&property=qualifiedName&value=feednEQUkxM1Sp@clusterFLoD3I838M
HTTP/1.1" 200 1267 "-" "Java/1.8.0_152"
127.0.0.1 - - [21/Mar/2018:00:27:59 +0000] "GET //localhost:31000/api/atlas/entities/a0d01639-45c4-44ba-8e64-172193cc682a
HTTP/1.1" 200 1267 "-" "Java/1.8.0_152"
127.0.0.1 - - [21/Mar/2018:00:27:59 +0000] "GET //localhost:31000/api/atlas/entities/fbde6820-70e3-45eb-a144-ee10806932f7
HTTP/1.1" 200 1127 "-" "Java/1.8.0_152"
127.0.0.1 - - [21/Mar/2018:00:27:59 +0000] "GET //localhost:31000/api/atlas/entities?type=falcon_feed&property=qualifiedName&value=feednEQUkxM1Sp@clusterAdZAioFfj1
HTTP/1.1" 200 923 "-" "Java/1.8.0_152"
127.0.0.1 - - [21/Mar/2018:00:27:59 +0000] "GET //localhost:31000/api/atlas/entities?type=falcon_feed&property=qualifiedName&value=feednEQUkxM1Sp@clusterAdZAioFfj1
HTTP/1.1" 200 923 "-" "Java/1.8.0_152"
127.0.0.1 - - [21/Mar/2018:00:27:59 +0000] "GET //localhost:31000/api/atlas/entities/a29cc6d7-61f5-4bc1-850c-8e914e621ddd
HTTP/1.1" 200 923 "-" "Java/1.8.0_152"
127.0.0.1 - - [21/Mar/2018:00:27:59 +0000] "GET //localhost:31000/api/atlas/entities?type=falcon_feed_creation&property=qualifiedName&value=feednEQUkxM1Sp@clusterAdZAioFfj1
HTTP/1.1" 200 1267 "-" "Java/1.8.0_152"
127.0.0.1 - - [21/Mar/2018:00:27:59 +0000] "GET //localhost:31000/api/atlas/entities?type=falcon_feed_creation&property=qualifiedName&value=feednEQUkxM1Sp@clusterAdZAioFfj1
HTTP/1.1" 200 1267 "-" "Java/1.8.0_152"
127.0.0.1 - - [21/Mar/2018:00:27:59 +0000] "GET //localhost:31000/api/atlas/entities/eb687690-f9ae-4f35-8123-e0af9bced239
HTTP/1.1" 200 1267 "-" "Java/1.8.0_152"
127.0.0.1 - - [21/Mar/2018:00:27:59 +0000] "GET //localhost:31000/api/atlas/entities/cea1287a-6eb6-4ad2-bf21-756f85f49396
HTTP/1.1" 200 1127 "-" "Java/1.8.0_152"
127.0.0.1 - - [21/Mar/2018:00:27:59 +0000] "GET //localhost:31000/api/atlas/entities?type=falcon_feed&property=qualifiedName&value=feednEQUkxM1Sp@clusterFLoD3I838M
HTTP/1.1" 200 923 "-" "Java/1.8.0_152"
127.0.0.1 - - [21/Mar/2018:00:27:59 +0000] "GET //localhost:31000/api/atlas/entities?type=falcon_feed&property=qualifiedName&value=feednEQUkxM1Sp@clusterAdZAioFfj1
HTTP/1.1" 200 923 "-" "Java/1.8.0_152"
127.0.0.1 - - [21/Mar/2018:00:27:59 +0000] "GET //localhost:31000/api/atlas/entities?type=falcon_feed_replication&property=qualifiedName&value=feednEQUkxM1Sp
HTTP/1.1" 200 1040 "-" "Java/1.8.0_152"
127.0.0.1 - - [21/Mar/2018:00:27:59 +0000] "GET //localhost:31000/api/atlas/entities?type=falcon_feed_replication&property=qualifiedName&value=feednEQUkxM1Sp
HTTP/1.1" 200 1040 "-" "Java/1.8.0_152"
127.0.0.1 - - [21/Mar/2018:00:27:59 +0000] "GET //localhost:31000/api/atlas/entities/b94e2d7c-1d08-4bf2-81d6-1fc1b11ed0e2
HTTP/1.1" 200 1040 "-" "Java/1.8.0_152"
Tests run: 3, Failures: 1, Errors: 0, Skipped: 0, Time elapsed: 9.31 sec <<< FAILURE!
- in org.apache.atlas.falcon.hook.FalconHookIT
testCreateProcess(org.apache.atlas.falcon.hook.FalconHookIT)  Time elapsed: 3.026 sec  <<<
FAILURE!
java.lang.AssertionError: Assertions failed. Failing after waiting for timeout 2000 msecs
	at org.apache.atlas.AtlasBaseClient.callAPIWithResource(AtlasBaseClient.java:388)
	at org.apache.atlas.AtlasBaseClient.callAPIWithResource(AtlasBaseClient.java:323)
	at org.apache.atlas.AtlasBaseClient.callAPIWithRetries(AtlasBaseClient.java:472)
	at org.apache.atlas.AtlasClient.callAPIWithRetries(AtlasClient.java:931)
	at org.apache.atlas.AtlasClient.getEntity(AtlasClient.java:640)
	at org.apache.atlas.falcon.hook.FalconHookIT$1.evaluate(FalconHookIT.java:310)
	at org.apache.atlas.falcon.hook.FalconHookIT.waitFor(FalconHookIT.java:340)
	at org.apache.atlas.falcon.hook.FalconHookIT.assertEntityIsRegistered(FalconHookIT.java:307)
	at org.apache.atlas.falcon.hook.FalconHookIT.assertClusterIsRegistered(FalconHookIT.java:161)
	at org.apache.atlas.falcon.hook.FalconHookIT.testCreateProcess(FalconHookIT.java:130)


Results :

Failed tests: 
  FalconHookIT.testCreateProcess:130->assertClusterIsRegistered:161->assertEntityIsRegistered:307->waitFor:344
Assertions failed. Failing after waiting for timeout 2000 msecs

Tests run: 3, Failures: 1, Errors: 0, Skipped: 0

[INFO] 
[INFO] --- jetty-maven-plugin:9.3.14.v20161028:stop (stop-jetty) @ falcon-bridge ---
[INFO] Waiting 10 seconds for jetty to stop
[INFO] Stopped ServerConnector@7ef3e222{HTTP/1.1,[http/1.1]}{0.0.0.0:31000}
[INFO] Closing Spring root WebApplicationContext
[INFO] Shutting down log4j
[INFO] Stopped o.e.j.m.p.JettyWebAppContext@6d792d5f{/,file://<https://builds.apache.org/job/Atlas-master-IntegrationTests/ws/webapp/target/atlas-webapp-1.0.0-SNAPSHOT/,UNAVAILABLE}{/home/jenkins/jenkins-slave/workspace/Atlas-master-IntegrationTests/webapp/target/atlas-webapp-1.0.0-SNAPSHOT.war}>
[INFO] Server reports itself as stopped
[INFO] 
[INFO] --- maven-antrun-plugin:1.7:run (default) @ falcon-bridge ---
[WARNING] Parameter tasks is deprecated, use target instead
[INFO] Executing tasks

main:
   [delete] Deleting directory <https://builds.apache.org/job/Atlas-master-IntegrationTests/ws/addons/hive-bridge/target/data>
   [delete] Deleting directory <https://builds.apache.org/job/Atlas-master-IntegrationTests/ws/addons/hive-bridge/target/logs>
[INFO] Executed tasks
[INFO] 
[INFO] --- maven-source-plugin:2.4:jar-no-fork (attach-sources) @ falcon-bridge ---
[INFO] Building jar: <https://builds.apache.org/job/Atlas-master-IntegrationTests/ws/addons/falcon-bridge/target/falcon-bridge-1.0.0-SNAPSHOT-sources.jar>
[INFO] 
[INFO] --- maven-source-plugin:2.4:test-jar-no-fork (attach-sources) @ falcon-bridge ---
[INFO] Building jar: <https://builds.apache.org/job/Atlas-master-IntegrationTests/ws/addons/falcon-bridge/target/falcon-bridge-1.0.0-SNAPSHOT-test-sources.jar>
[INFO] 
[INFO] --- maven-failsafe-plugin:2.18.1:verify (verify) @ falcon-bridge ---
[INFO] Failsafe report directory: <https://builds.apache.org/job/Atlas-master-IntegrationTests/ws/addons/falcon-bridge/target/failsafe-reports>
[INFO] ------------------------------------------------------------------------
[INFO] Reactor Summary:
[INFO] 
[INFO] Apache Atlas Server Build Tools .................... SUCCESS [  0.629 s]
[INFO] apache-atlas ....................................... SUCCESS [  3.929 s]
[INFO] Apache Atlas Test Utility Tools .................... SUCCESS [  9.794 s]
[INFO] Open Connector Framework (OCF) ..................... SUCCESS [  9.276 s]
[INFO] Apache Atlas Integration ........................... SUCCESS [ 19.422 s]
[INFO] Apache Atlas Common ................................ SUCCESS [  8.221 s]
[INFO] Apache Atlas Client ................................ SUCCESS [  0.444 s]
[INFO] atlas-client-common ................................ SUCCESS [  6.101 s]
[INFO] atlas-client-v1 .................................... SUCCESS [  6.517 s]
[INFO] Apache Atlas Server API ............................ SUCCESS [  4.921 s]
[INFO] Apache Atlas Notification .......................... SUCCESS [  7.893 s]
[INFO] atlas-client-v2 .................................... SUCCESS [  5.139 s]
[INFO] Apache Atlas Graph Database Projects ............... SUCCESS [  0.425 s]
[INFO] Apache Atlas Graph Database API .................... SUCCESS [  4.394 s]
[INFO] Graph Database Common Code ......................... SUCCESS [  4.329 s]
[INFO] Apache Atlas JanusGraph DB Impl .................... SUCCESS [  9.928 s]
[INFO] Apache Atlas Graph Database Implementation Dependencies SUCCESS [  1.781 s]
[INFO] Shaded version of Apache hbase client .............. SUCCESS [  7.464 s]
[INFO] Apache Atlas Titan 0.5.4 Graph DB Impl ............. SUCCESS [ 35.080 s]
[INFO] Shaded version of Apache hbase server .............. SUCCESS [ 18.409 s]
[INFO] Apache Atlas Authorization ......................... SUCCESS [  6.142 s]
[INFO] Apache Atlas Repository ............................ SUCCESS [ 27.626 s]
[INFO] Apache Atlas UI .................................... SUCCESS [01:06 min]
[INFO] Apache Atlas Web Application ....................... SUCCESS [03:55 min]
[INFO] Apache Atlas Documentation ......................... SUCCESS [  2.940 s]
[INFO] Apache Atlas FileSystem Model ...................... SUCCESS [  2.374 s]
[INFO] Apache Atlas Plugin Classloader .................... SUCCESS [  5.742 s]
[INFO] Apache Atlas Hive Bridge Shim ...................... SUCCESS [  4.582 s]
[INFO] Apache Atlas Hive Bridge ........................... SUCCESS [07:32 min]
[INFO] Apache Atlas Falcon Bridge Shim .................... SUCCESS [  5.344 s]
[INFO] Apache Atlas Falcon Bridge ......................... FAILURE [ 58.647 s]
[INFO] Apache Atlas Sqoop Bridge Shim ..................... SKIPPED
[INFO] Apache Atlas Sqoop Bridge .......................... SKIPPED
[INFO] Apache Atlas Storm Bridge Shim ..................... SKIPPED
[INFO] Apache Atlas Storm Bridge .......................... SKIPPED
[INFO] Apache Atlas Hbase Bridge Shim ..................... SKIPPED
[INFO] Apache Atlas Hbase Bridge .......................... SKIPPED
[INFO] Apache Atlas Distribution .......................... SKIPPED
[INFO] ------------------------------------------------------------------------
[INFO] BUILD FAILURE
[INFO] ------------------------------------------------------------------------
[INFO] Total time: 17:12 min
[INFO] Finished at: 2018-03-21T00:28:02Z
[INFO] Final Memory: 754M/3244M
[INFO] ------------------------------------------------------------------------
log4j:WARN No appenders could be found for logger (org.apache.zookeeper.server.NIOServerCnxnFactory).
log4j:WARN Please initialize the log4j system properly.
log4j:WARN See http://logging.apache.org/log4j/1.2/faq.html#noconfig for more info.
log4j:WARN No appenders could be found for logger (org.apache.zookeeper.server.NIOServerCnxnFactory).
log4j:WARN Please initialize the log4j system properly.
log4j:WARN See http://logging.apache.org/log4j/1.2/faq.html#noconfig for more info.
[ERROR] Failed to execute goal org.apache.maven.plugins:maven-failsafe-plugin:2.18.1:verify
(verify) on project falcon-bridge: There are test failures.
[ERROR] 
[ERROR] Please refer to <https://builds.apache.org/job/Atlas-master-IntegrationTests/ws/addons/falcon-bridge/target/failsafe-reports>
for the individual test results.
[ERROR] -> [Help 1]
[ERROR] 
[ERROR] To see the full stack trace of the errors, re-run Maven with the -e switch.
[ERROR] Re-run Maven using the -X switch to enable full debug logging.
[ERROR] 
[ERROR] For more information about the errors and possible solutions, please read the following
articles:
[ERROR] [Help 1] http://cwiki.apache.org/confluence/display/MAVEN/MojoFailureException
[ERROR] 
[ERROR] After correcting the problems, you can resume the build with the command
[ERROR]   mvn <goals> -rf :falcon-bridge
Build step 'Execute shell' marked build as failure
[CHECKSTYLE] Collecting checkstyle analysis files...
[CHECKSTYLE] Searching for all files in <https://builds.apache.org/job/Atlas-master-IntegrationTests/ws/>
that match the pattern **/target/checkstyle-result.xml
[CHECKSTYLE] Parsing 29 files in <https://builds.apache.org/job/Atlas-master-IntegrationTests/ws/>
[CHECKSTYLE] Successfully parsed file <https://builds.apache.org/job/Atlas-master-IntegrationTests/ws/addons/falcon-bridge-shim/target/checkstyle-result.xml>
with 29 unique warnings and 0 duplicates.
[CHECKSTYLE] Successfully parsed file <https://builds.apache.org/job/Atlas-master-IntegrationTests/ws/addons/hdfs-model/target/checkstyle-result.xml>
with 29 unique warnings and 0 duplicates.
[CHECKSTYLE] Successfully parsed file <https://builds.apache.org/job/Atlas-master-IntegrationTests/ws/addons/hive-bridge-shim/target/checkstyle-result.xml>
with 44 unique warnings and 0 duplicates.
[CHECKSTYLE] Successfully parsed file <https://builds.apache.org/job/Atlas-master-IntegrationTests/ws/addons/hive-bridge/target/checkstyle-result.xml>
with 2224 unique warnings and 0 duplicates.
[CHECKSTYLE] Successfully parsed file <https://builds.apache.org/job/Atlas-master-IntegrationTests/ws/authorization/target/checkstyle-result.xml>
with 2890 unique warnings and 0 duplicates.
[CHECKSTYLE] Successfully parsed file <https://builds.apache.org/job/Atlas-master-IntegrationTests/ws/client/client-v1/target/checkstyle-result.xml>
with 3774 unique warnings and 0 duplicates.
[CHECKSTYLE] Successfully parsed file <https://builds.apache.org/job/Atlas-master-IntegrationTests/ws/client/client-v2/target/checkstyle-result.xml>
with 4133 unique warnings and 0 duplicates.
[CHECKSTYLE] Successfully parsed file <https://builds.apache.org/job/Atlas-master-IntegrationTests/ws/client/common/target/checkstyle-result.xml>
with 4621 unique warnings and 0 duplicates.
[CHECKSTYLE] Successfully parsed file <https://builds.apache.org/job/Atlas-master-IntegrationTests/ws/client/target/checkstyle-result.xml>
with 4621 unique warnings and 0 duplicates.
[CHECKSTYLE] Successfully parsed file <https://builds.apache.org/job/Atlas-master-IntegrationTests/ws/common/target/checkstyle-result.xml>
with 5652 unique warnings and 0 duplicates.
[CHECKSTYLE] Successfully parsed file <https://builds.apache.org/job/Atlas-master-IntegrationTests/ws/dashboardv2/target/checkstyle-result.xml>
with 5652 unique warnings and 0 duplicates.
[CHECKSTYLE] Successfully parsed file <https://builds.apache.org/job/Atlas-master-IntegrationTests/ws/docs/target/checkstyle-result.xml>
with 5652 unique warnings and 0 duplicates.
[CHECKSTYLE] Successfully parsed file <https://builds.apache.org/job/Atlas-master-IntegrationTests/ws/graphdb/api/target/checkstyle-result.xml>
with 5944 unique warnings and 0 duplicates.
[CHECKSTYLE] Successfully parsed file <https://builds.apache.org/job/Atlas-master-IntegrationTests/ws/graphdb/common/target/checkstyle-result.xml>
with 6153 unique warnings and 0 duplicates.
[CHECKSTYLE] Successfully parsed file <https://builds.apache.org/job/Atlas-master-IntegrationTests/ws/graphdb/graphdb-impls/target/checkstyle-result.xml>
with 6153 unique warnings and 0 duplicates.
[CHECKSTYLE] Successfully parsed file <https://builds.apache.org/job/Atlas-master-IntegrationTests/ws/graphdb/janus/target/checkstyle-result.xml>
with 7199 unique warnings and 0 duplicates.
[CHECKSTYLE] Successfully parsed file <https://builds.apache.org/job/Atlas-master-IntegrationTests/ws/graphdb/target/checkstyle-result.xml>
with 7199 unique warnings and 0 duplicates.
[CHECKSTYLE] Successfully parsed file <https://builds.apache.org/job/Atlas-master-IntegrationTests/ws/graphdb/titan0/target/checkstyle-result.xml>
with 9697 unique warnings and 0 duplicates.
[CHECKSTYLE] Successfully parsed file <https://builds.apache.org/job/Atlas-master-IntegrationTests/ws/intg/target/checkstyle-result.xml>
with 20640 unique warnings and 0 duplicates.
[CHECKSTYLE] Successfully parsed file <https://builds.apache.org/job/Atlas-master-IntegrationTests/ws/notification/target/checkstyle-result.xml>
with 21876 unique warnings and 0 duplicates.
[CHECKSTYLE] Successfully parsed file <https://builds.apache.org/job/Atlas-master-IntegrationTests/ws/om-fwk-ocf/target/checkstyle-result.xml>
with 26606 unique warnings and 0 duplicates.
[CHECKSTYLE] Successfully parsed file <https://builds.apache.org/job/Atlas-master-IntegrationTests/ws/plugin-classloader/target/checkstyle-result.xml>
with 26719 unique warnings and 0 duplicates.
[CHECKSTYLE] Successfully parsed file <https://builds.apache.org/job/Atlas-master-IntegrationTests/ws/repository/target/checkstyle-result.xml>
with 46018 unique warnings and 0 duplicates.
[CHECKSTYLE] Successfully parsed file <https://builds.apache.org/job/Atlas-master-IntegrationTests/ws/server-api/target/checkstyle-result.xml>
with 46164 unique warnings and 0 duplicates.
[CHECKSTYLE] Successfully parsed file <https://builds.apache.org/job/Atlas-master-IntegrationTests/ws/shaded/hbase-client-shaded/target/checkstyle-result.xml>
with 46164 unique warnings and 0 duplicates.
[CHECKSTYLE] Successfully parsed file <https://builds.apache.org/job/Atlas-master-IntegrationTests/ws/shaded/hbase-server-shaded/target/checkstyle-result.xml>
with 46164 unique warnings and 0 duplicates.
[CHECKSTYLE] Successfully parsed file <https://builds.apache.org/job/Atlas-master-IntegrationTests/ws/target/checkstyle-result.xml>
with 46164 unique warnings and 0 duplicates.
[CHECKSTYLE] Successfully parsed file <https://builds.apache.org/job/Atlas-master-IntegrationTests/ws/test-tools/target/checkstyle-result.xml>
with 46202 unique warnings and 0 duplicates.
[CHECKSTYLE] Successfully parsed file <https://builds.apache.org/job/Atlas-master-IntegrationTests/ws/webapp/target/checkstyle-result.xml>
with 54161 unique warnings and 0 duplicates.
<Git Blamer> Using GitBlamer to create author and commit information for all warnings.
<Git Blamer> GIT_COMMIT=6e02ec5b3a97ee2bfaf16ef5e875c14e383d5823, workspace=<https://builds.apache.org/job/Atlas-master-IntegrationTests/ws/>
 > git rev-parse 6e02ec5b3a97ee2bfaf16ef5e875c14e383d5823^{commit} # timeout=10
<Git Blamer> Skipping file <https://builds.apache.org/job/Atlas-master-IntegrationTests/ws/repository/src/main/java/org/apache/atlas/discovery/SearchIndexer.java,>
no result found.
[CHECKSTYLE] Computing warning deltas based on reference build #818
[FINDBUGS] Collecting findbugs analysis files...
[FINDBUGS] Searching for all files in <https://builds.apache.org/job/Atlas-master-IntegrationTests/ws/>
that match the pattern **/target/findbugs.xml
[FINDBUGS] Parsing 20 files in <https://builds.apache.org/job/Atlas-master-IntegrationTests/ws/>
[FINDBUGS] Successfully parsed file <https://builds.apache.org/job/Atlas-master-IntegrationTests/ws/addons/falcon-bridge-shim/target/findbugs.xml>
with 0 unique warnings and 0 duplicates.
[FINDBUGS] Successfully parsed file <https://builds.apache.org/job/Atlas-master-IntegrationTests/ws/addons/hive-bridge-shim/target/findbugs.xml>
with 0 unique warnings and 0 duplicates.
[FINDBUGS] Successfully parsed file <https://builds.apache.org/job/Atlas-master-IntegrationTests/ws/addons/hive-bridge/target/findbugs.xml>
with 0 unique warnings and 0 duplicates.
[FINDBUGS] Successfully parsed file <https://builds.apache.org/job/Atlas-master-IntegrationTests/ws/authorization/target/findbugs.xml>
with 0 unique warnings and 0 duplicates.
[FINDBUGS] Successfully parsed file <https://builds.apache.org/job/Atlas-master-IntegrationTests/ws/client/client-v1/target/findbugs.xml>
with 0 unique warnings and 0 duplicates.
[FINDBUGS] Successfully parsed file <https://builds.apache.org/job/Atlas-master-IntegrationTests/ws/client/client-v2/target/findbugs.xml>
with 0 unique warnings and 0 duplicates.
[FINDBUGS] Successfully parsed file <https://builds.apache.org/job/Atlas-master-IntegrationTests/ws/client/common/target/findbugs.xml>
with 0 unique warnings and 0 duplicates.
[FINDBUGS] Successfully parsed file <https://builds.apache.org/job/Atlas-master-IntegrationTests/ws/common/target/findbugs.xml>
with 0 unique warnings and 0 duplicates.
[FINDBUGS] Successfully parsed file <https://builds.apache.org/job/Atlas-master-IntegrationTests/ws/graphdb/api/target/findbugs.xml>
with 0 unique warnings and 0 duplicates.
[FINDBUGS] Successfully parsed file <https://builds.apache.org/job/Atlas-master-IntegrationTests/ws/graphdb/common/target/findbugs.xml>
with 0 unique warnings and 0 duplicates.
[FINDBUGS] Successfully parsed file <https://builds.apache.org/job/Atlas-master-IntegrationTests/ws/graphdb/janus/target/findbugs.xml>
with 0 unique warnings and 0 duplicates.
[FINDBUGS] Successfully parsed file <https://builds.apache.org/job/Atlas-master-IntegrationTests/ws/graphdb/titan0/target/findbugs.xml>
with 0 unique warnings and 0 duplicates.
[FINDBUGS] Successfully parsed file <https://builds.apache.org/job/Atlas-master-IntegrationTests/ws/intg/target/findbugs.xml>
with 0 unique warnings and 0 duplicates.
[FINDBUGS] Successfully parsed file <https://builds.apache.org/job/Atlas-master-IntegrationTests/ws/notification/target/findbugs.xml>
with 0 unique warnings and 0 duplicates.
[FINDBUGS] Successfully parsed file <https://builds.apache.org/job/Atlas-master-IntegrationTests/ws/om-fwk-ocf/target/findbugs.xml>
with 0 unique warnings and 0 duplicates.
[FINDBUGS] Successfully parsed file <https://builds.apache.org/job/Atlas-master-IntegrationTests/ws/plugin-classloader/target/findbugs.xml>
with 0 unique warnings and 0 duplicates.
[FINDBUGS] Successfully parsed file <https://builds.apache.org/job/Atlas-master-IntegrationTests/ws/repository/target/findbugs.xml>
with 0 unique warnings and 0 duplicates.
[FINDBUGS] Successfully parsed file <https://builds.apache.org/job/Atlas-master-IntegrationTests/ws/server-api/target/findbugs.xml>
with 0 unique warnings and 0 duplicates.
[FINDBUGS] Successfully parsed file <https://builds.apache.org/job/Atlas-master-IntegrationTests/ws/test-tools/target/findbugs.xml>
with 0 unique warnings and 0 duplicates.
[FINDBUGS] Successfully parsed file <https://builds.apache.org/job/Atlas-master-IntegrationTests/ws/webapp/target/findbugs.xml>
with 0 unique warnings and 0 duplicates.
<Git Blamer> Using GitBlamer to create author and commit information for all warnings.
<Git Blamer> GIT_COMMIT=6e02ec5b3a97ee2bfaf16ef5e875c14e383d5823, workspace=<https://builds.apache.org/job/Atlas-master-IntegrationTests/ws/>
[FINDBUGS] Computing warning deltas based on reference build #818
Archiving artifacts
[Fast Archiver] Compressed 138.02 MB of artifacts by 81.7% relative to #818
TestNG Reports Processing: START
Looking for TestNG results report in workspace using pattern: **/target/surefire-reports/testng-results.xml,**/target/failsafe-reports/testng-results.xml
Saving reports...
Processing '/x1/jenkins/jenkins-home/jobs/Atlas-master-IntegrationTests/builds/819/testng/testng-results-1.xml'
Processing '/x1/jenkins/jenkins-home/jobs/Atlas-master-IntegrationTests/builds/819/testng/testng-results-2.xml'
Processing '/x1/jenkins/jenkins-home/jobs/Atlas-master-IntegrationTests/builds/819/testng/testng-results.xml'
0.574713% of tests failed, which exceeded threshold of 0%. Marking build as UNSTABLE
TestNG Reports Processing: FINISH

Mime
View raw message