atlas-dev mailing list archives

Site index · List index
Message view « Date » · « Thread »
Top « Date » · « Thread »
From Apache Jenkins Server <jenk...@builds.apache.org>
Subject Build failed in Jenkins: Atlas-master-IntegrationTests #828
Date Thu, 22 Mar 2018 02:37:04 GMT
See <https://builds.apache.org/job/Atlas-master-IntegrationTests/828/display/redirect>

------------------------------------------
[...truncated 661.58 KB...]
[INFO] Started ServerConnector@215bd35f{HTTP/1.1,[http/1.1]}{0.0.0.0:31000}
[INFO] Started @1323847ms
[INFO] Started Jetty Server
[INFO] 
[INFO] --- maven-failsafe-plugin:2.18.1:integration-test (integration-test) @ falcon-bridge
---
[WARNING] useSystemClassloader setting has no effect when not forking
[INFO] Failsafe report directory: <https://builds.apache.org/job/Atlas-master-IntegrationTests/ws/addons/falcon-bridge/target/failsafe-reports>
Running org.apache.atlas.falcon.hook.FalconHookIT
127.0.0.1 - - [22/Mar/2018:02:24:43 +0000] "GET //localhost:31000/api/atlas/entities?type=falcon_cluster&property=qualifiedName&value=clusterOSOIsTxVXm
HTTP/1.1" 404 106 "-" "Java/1.8.0_152"
127.0.0.1 - - [22/Mar/2018:02:24:44 +0000] "GET //localhost:31000/api/atlas/entities?type=falcon_cluster&property=qualifiedName&value=clusterOSOIsTxVXm
HTTP/1.1" 404 106 "-" "Java/1.8.0_152"
127.0.0.1 - - [22/Mar/2018:02:24:45 +0000] "GET //localhost:31000/api/atlas/entities?type=falcon_cluster&property=qualifiedName&value=clusterOSOIsTxVXm
HTTP/1.1" 404 106 "-" "Java/1.8.0_152"
127.0.0.1 - - [22/Mar/2018:02:24:45 +0000] "GET //localhost:31000/api/atlas/entities?type=falcon_cluster&property=qualifiedName&value=clusterOSOIsTxVXm
HTTP/1.1" 404 106 "-" "Java/1.8.0_152"
127.0.0.1 - - [22/Mar/2018:02:24:45 +0000] "GET //localhost:31000/api/atlas/entities?type=falcon_cluster&property=qualifiedName&value=clusterOSOIsTxVXm
HTTP/1.1" 404 106 "-" "Java/1.8.0_152"
127.0.0.1 - - [22/Mar/2018:02:24:46 +0000] "GET //localhost:31000/api/atlas/entities?type=falcon_feed&property=qualifiedName&value=feed85j8ZXvkoB@clusterqMyqO04YW7
HTTP/1.1" 404 118 "-" "Java/1.8.0_152"
127.0.0.1 - - [22/Mar/2018:02:24:46 +0000] "GET //localhost:31000/api/atlas/entities?type=falcon_feed&property=qualifiedName&value=feed85j8ZXvkoB@clusterqMyqO04YW7
HTTP/1.1" 404 118 "-" "Java/1.8.0_152"
127.0.0.1 - - [22/Mar/2018:02:24:46 +0000] "GET //localhost:31000/api/atlas/entities?type=falcon_feed&property=qualifiedName&value=feed85j8ZXvkoB@clusterqMyqO04YW7
HTTP/1.1" 404 118 "-" "Java/1.8.0_152"
127.0.0.1 - - [22/Mar/2018:02:24:47 +0000] "GET //localhost:31000/api/atlas/entities?type=falcon_feed&property=qualifiedName&value=feed85j8ZXvkoB@clusterqMyqO04YW7
HTTP/1.1" 404 118 "-" "Java/1.8.0_152"
127.0.0.1 - - [22/Mar/2018:02:24:47 +0000] "GET //localhost:31000/api/atlas/entities?type=falcon_feed&property=qualifiedName&value=feed85j8ZXvkoB@clusterqMyqO04YW7
HTTP/1.1" 404 118 "-" "Java/1.8.0_152"
127.0.0.1 - - [22/Mar/2018:02:24:48 +0000] "GET //localhost:31000/api/atlas/entities?type=falcon_feed&property=qualifiedName&value=feed85j8ZXvkoB@clusterqMyqO04YW7
HTTP/1.1" 404 118 "-" "Java/1.8.0_152"
127.0.0.1 - - [22/Mar/2018:02:24:48 +0000] "GET //localhost:31000/api/atlas/entities?type=falcon_cluster&property=qualifiedName&value=clusterIOEvuEpdcG
HTTP/1.1" 404 106 "-" "Java/1.8.0_152"
127.0.0.1 - - [22/Mar/2018:02:24:48 +0000] "GET //localhost:31000/api/atlas/entities?type=falcon_cluster&property=qualifiedName&value=clusterIOEvuEpdcG
HTTP/1.1" 404 106 "-" "Java/1.8.0_152"
127.0.0.1 - - [22/Mar/2018:02:24:49 +0000] "GET //localhost:31000/api/atlas/entities?type=falcon_cluster&property=qualifiedName&value=clusterIOEvuEpdcG
HTTP/1.1" 404 106 "-" "Java/1.8.0_152"
127.0.0.1 - - [22/Mar/2018:02:24:49 +0000] "GET //localhost:31000/api/atlas/entities?type=falcon_cluster&property=qualifiedName&value=clusterIOEvuEpdcG
HTTP/1.1" 404 106 "-" "Java/1.8.0_152"
127.0.0.1 - - [22/Mar/2018:02:24:50 +0000] "GET //localhost:31000/api/atlas/entities?type=falcon_cluster&property=qualifiedName&value=clusterIOEvuEpdcG
HTTP/1.1" 200 703 "-" "Java/1.8.0_152"
127.0.0.1 - - [22/Mar/2018:02:24:50 +0000] "GET //localhost:31000/api/atlas/entities?type=falcon_cluster&property=qualifiedName&value=clusterIOEvuEpdcG
HTTP/1.1" 200 703 "-" "Java/1.8.0_152"
127.0.0.1 - - [22/Mar/2018:02:24:50 +0000] "GET //localhost:31000/api/atlas/entities?type=falcon_cluster&property=qualifiedName&value=clusterTxlCqEcl0C
HTTP/1.1" 404 106 "-" "Java/1.8.0_152"
127.0.0.1 - - [22/Mar/2018:02:24:51 +0000] "GET //localhost:31000/api/atlas/entities?type=falcon_cluster&property=qualifiedName&value=clusterTxlCqEcl0C
HTTP/1.1" 200 703 "-" "Java/1.8.0_152"
127.0.0.1 - - [22/Mar/2018:02:24:51 +0000] "GET //localhost:31000/api/atlas/entities?type=falcon_cluster&property=qualifiedName&value=clusterTxlCqEcl0C
HTTP/1.1" 200 703 "-" "Java/1.8.0_152"
127.0.0.1 - - [22/Mar/2018:02:24:51 +0000] "GET //localhost:31000/api/atlas/entities?type=falcon_feed&property=qualifiedName&value=feedMSzvBinhsK@clusterIOEvuEpdcG
HTTP/1.1" 404 118 "-" "Java/1.8.0_152"
127.0.0.1 - - [22/Mar/2018:02:24:51 +0000] "GET //localhost:31000/api/atlas/entities?type=falcon_feed&property=qualifiedName&value=feedMSzvBinhsK@clusterIOEvuEpdcG
HTTP/1.1" 404 118 "-" "Java/1.8.0_152"
127.0.0.1 - - [22/Mar/2018:02:24:52 +0000] "GET //localhost:31000/api/atlas/entities?type=falcon_feed&property=qualifiedName&value=feedMSzvBinhsK@clusterIOEvuEpdcG
HTTP/1.1" 200 922 "-" "Java/1.8.0_152"
127.0.0.1 - - [22/Mar/2018:02:24:52 +0000] "GET //localhost:31000/api/atlas/entities?type=falcon_feed&property=qualifiedName&value=feedMSzvBinhsK@clusterIOEvuEpdcG
HTTP/1.1" 200 922 "-" "Java/1.8.0_152"
127.0.0.1 - - [22/Mar/2018:02:24:52 +0000] "GET //localhost:31000/api/atlas/entities/04fdfc86-0497-4a84-99c2-35746ac2f361
HTTP/1.1" 200 922 "-" "Java/1.8.0_152"
127.0.0.1 - - [22/Mar/2018:02:24:52 +0000] "GET //localhost:31000/api/atlas/entities?type=falcon_feed_creation&property=qualifiedName&value=feedMSzvBinhsK@clusterIOEvuEpdcG
HTTP/1.1" 200 1266 "-" "Java/1.8.0_152"
127.0.0.1 - - [22/Mar/2018:02:24:52 +0000] "GET //localhost:31000/api/atlas/entities?type=falcon_feed_creation&property=qualifiedName&value=feedMSzvBinhsK@clusterIOEvuEpdcG
HTTP/1.1" 200 1266 "-" "Java/1.8.0_152"
127.0.0.1 - - [22/Mar/2018:02:24:52 +0000] "GET //localhost:31000/api/atlas/entities/74e5ca87-3ba4-4df1-bcd9-d442a4c212bd
HTTP/1.1" 200 1266 "-" "Java/1.8.0_152"
127.0.0.1 - - [22/Mar/2018:02:24:52 +0000] "GET //localhost:31000/api/atlas/entities/1c9b61d6-e61e-497d-aa7b-0874466efa83
HTTP/1.1" 200 1126 "-" "Java/1.8.0_152"
127.0.0.1 - - [22/Mar/2018:02:24:52 +0000] "GET //localhost:31000/api/atlas/entities?type=falcon_feed&property=qualifiedName&value=feedMSzvBinhsK@clusterTxlCqEcl0C
HTTP/1.1" 200 922 "-" "Java/1.8.0_152"
127.0.0.1 - - [22/Mar/2018:02:24:52 +0000] "GET //localhost:31000/api/atlas/entities?type=falcon_feed&property=qualifiedName&value=feedMSzvBinhsK@clusterTxlCqEcl0C
HTTP/1.1" 200 922 "-" "Java/1.8.0_152"
127.0.0.1 - - [22/Mar/2018:02:24:52 +0000] "GET //localhost:31000/api/atlas/entities/9a01286a-97df-4b67-a17c-3a29d0c84305
HTTP/1.1" 200 922 "-" "Java/1.8.0_152"
127.0.0.1 - - [22/Mar/2018:02:24:52 +0000] "GET //localhost:31000/api/atlas/entities?type=falcon_feed_creation&property=qualifiedName&value=feedMSzvBinhsK@clusterTxlCqEcl0C
HTTP/1.1" 200 1266 "-" "Java/1.8.0_152"
127.0.0.1 - - [22/Mar/2018:02:24:52 +0000] "GET //localhost:31000/api/atlas/entities?type=falcon_feed_creation&property=qualifiedName&value=feedMSzvBinhsK@clusterTxlCqEcl0C
HTTP/1.1" 200 1266 "-" "Java/1.8.0_152"
127.0.0.1 - - [22/Mar/2018:02:24:52 +0000] "GET //localhost:31000/api/atlas/entities/3cd36453-bb94-49e0-bc91-7d87a2c4255e
HTTP/1.1" 200 1266 "-" "Java/1.8.0_152"
127.0.0.1 - - [22/Mar/2018:02:24:52 +0000] "GET //localhost:31000/api/atlas/entities/a8a3a7db-5353-43d4-b422-599cddfda2f8
HTTP/1.1" 200 1126 "-" "Java/1.8.0_152"
127.0.0.1 - - [22/Mar/2018:02:24:52 +0000] "GET //localhost:31000/api/atlas/entities?type=falcon_feed&property=qualifiedName&value=feedMSzvBinhsK@clusterIOEvuEpdcG
HTTP/1.1" 200 922 "-" "Java/1.8.0_152"
127.0.0.1 - - [22/Mar/2018:02:24:52 +0000] "GET //localhost:31000/api/atlas/entities?type=falcon_feed&property=qualifiedName&value=feedMSzvBinhsK@clusterTxlCqEcl0C
HTTP/1.1" 200 922 "-" "Java/1.8.0_152"
127.0.0.1 - - [22/Mar/2018:02:24:52 +0000] "GET //localhost:31000/api/atlas/entities?type=falcon_feed_replication&property=qualifiedName&value=feedMSzvBinhsK
HTTP/1.1" 200 1039 "-" "Java/1.8.0_152"
127.0.0.1 - - [22/Mar/2018:02:24:52 +0000] "GET //localhost:31000/api/atlas/entities?type=falcon_feed_replication&property=qualifiedName&value=feedMSzvBinhsK
HTTP/1.1" 200 1039 "-" "Java/1.8.0_152"
127.0.0.1 - - [22/Mar/2018:02:24:52 +0000] "GET //localhost:31000/api/atlas/entities/1241979f-3e24-4256-b799-e2588b50603e
HTTP/1.1" 200 1039 "-" "Java/1.8.0_152"
Tests run: 3, Failures: 2, Errors: 0, Skipped: 0, Time elapsed: 13.215 sec <<< FAILURE!
- in org.apache.atlas.falcon.hook.FalconHookIT
testCreateProcess(org.apache.atlas.falcon.hook.FalconHookIT)  Time elapsed: 3.926 sec  <<<
FAILURE!
java.lang.AssertionError: Assertions failed. Failing after waiting for timeout 2000 msecs
	at org.apache.atlas.AtlasBaseClient.callAPIWithResource(AtlasBaseClient.java:388)
	at org.apache.atlas.AtlasBaseClient.callAPIWithResource(AtlasBaseClient.java:323)
	at org.apache.atlas.AtlasBaseClient.callAPIWithRetries(AtlasBaseClient.java:472)
	at org.apache.atlas.AtlasClient.callAPIWithRetries(AtlasClient.java:931)
	at org.apache.atlas.AtlasClient.getEntity(AtlasClient.java:640)
	at org.apache.atlas.falcon.hook.FalconHookIT$1.evaluate(FalconHookIT.java:310)
	at org.apache.atlas.falcon.hook.FalconHookIT.waitFor(FalconHookIT.java:340)
	at org.apache.atlas.falcon.hook.FalconHookIT.assertEntityIsRegistered(FalconHookIT.java:307)
	at org.apache.atlas.falcon.hook.FalconHookIT.assertClusterIsRegistered(FalconHookIT.java:161)
	at org.apache.atlas.falcon.hook.FalconHookIT.testCreateProcess(FalconHookIT.java:130)

testCreateProcessWithHDFSFeed(org.apache.atlas.falcon.hook.FalconHookIT)  Time elapsed: 2.278
sec  <<< FAILURE!
java.lang.AssertionError: Assertions failed. Failing after waiting for timeout 2000 msecs
	at org.apache.atlas.AtlasBaseClient.callAPIWithResource(AtlasBaseClient.java:388)
	at org.apache.atlas.AtlasBaseClient.callAPIWithResource(AtlasBaseClient.java:323)
	at org.apache.atlas.AtlasBaseClient.callAPIWithRetries(AtlasBaseClient.java:472)
	at org.apache.atlas.AtlasClient.callAPIWithRetries(AtlasClient.java:931)
	at org.apache.atlas.AtlasClient.getEntity(AtlasClient.java:640)
	at org.apache.atlas.falcon.hook.FalconHookIT$1.evaluate(FalconHookIT.java:310)
	at org.apache.atlas.falcon.hook.FalconHookIT.waitFor(FalconHookIT.java:340)
	at org.apache.atlas.falcon.hook.FalconHookIT.assertEntityIsRegistered(FalconHookIT.java:307)
	at org.apache.atlas.falcon.hook.FalconHookIT.assertFeedIsRegistered(FalconHookIT.java:250)
	at org.apache.atlas.falcon.hook.FalconHookIT.getHDFSFeed(FalconHookIT.java:170)
	at org.apache.atlas.falcon.hook.FalconHookIT.testCreateProcessWithHDFSFeed(FalconHookIT.java:283)


Results :

Failed tests: 
  FalconHookIT.testCreateProcess:130->assertClusterIsRegistered:161->assertEntityIsRegistered:307->waitFor:344
Assertions failed. Failing after waiting for timeout 2000 msecs
  FalconHookIT.testCreateProcessWithHDFSFeed:283->getHDFSFeed:170->assertFeedIsRegistered:250->assertEntityIsRegistered:307->waitFor:344
Assertions failed. Failing after waiting for timeout 2000 msecs

Tests run: 3, Failures: 2, Errors: 0, Skipped: 0

[INFO] 
[INFO] --- jetty-maven-plugin:9.3.14.v20161028:stop (stop-jetty) @ falcon-bridge ---
[INFO] Waiting 10 seconds for jetty to stop
[INFO] Stopped ServerConnector@215bd35f{HTTP/1.1,[http/1.1]}{0.0.0.0:31000}
[INFO] Closing Spring root WebApplicationContext
[INFO] Shutting down log4j
[INFO] Stopped o.e.j.m.p.JettyWebAppContext@711be0cd{/,file://<https://builds.apache.org/job/Atlas-master-IntegrationTests/ws/webapp/target/atlas-webapp-1.0.0-SNAPSHOT/,UNAVAILABLE}{/home/jenkins/jenkins-slave/workspace/Atlas-master-IntegrationTests/webapp/target/atlas-webapp-1.0.0-SNAPSHOT.war}>
[INFO] Server reports itself as stopped
[INFO] 
[INFO] --- maven-antrun-plugin:1.7:run (default) @ falcon-bridge ---
[WARNING] Parameter tasks is deprecated, use target instead
[INFO] Executing tasks

main:
   [delete] Deleting directory <https://builds.apache.org/job/Atlas-master-IntegrationTests/ws/addons/hive-bridge/target/data>
   [delete] Deleting directory <https://builds.apache.org/job/Atlas-master-IntegrationTests/ws/addons/hive-bridge/target/logs>
[INFO] Executed tasks
[INFO] 
[INFO] --- maven-source-plugin:2.4:jar-no-fork (attach-sources) @ falcon-bridge ---
[INFO] Building jar: <https://builds.apache.org/job/Atlas-master-IntegrationTests/ws/addons/falcon-bridge/target/falcon-bridge-1.0.0-SNAPSHOT-sources.jar>
[INFO] 
[INFO] --- maven-source-plugin:2.4:test-jar-no-fork (attach-sources) @ falcon-bridge ---
log4j:WARN No appenders could be found for logger (org.apache.zookeeper.ClientCnxn).
log4j:WARN Please initialize the log4j system properly.
log4j:WARN See http://logging.apache.org/log4j/1.2/faq.html#noconfig for more info.
[INFO] Building jar: <https://builds.apache.org/job/Atlas-master-IntegrationTests/ws/addons/falcon-bridge/target/falcon-bridge-1.0.0-SNAPSHOT-test-sources.jar>
[INFO] 
[INFO] --- maven-failsafe-plugin:2.18.1:verify (verify) @ falcon-bridge ---
[INFO] Failsafe report directory: <https://builds.apache.org/job/Atlas-master-IntegrationTests/ws/addons/falcon-bridge/target/failsafe-reports>
[INFO] ------------------------------------------------------------------------
[INFO] Reactor Summary:
[INFO] 
[INFO] Apache Atlas Server Build Tools .................... SUCCESS [  0.584 s]
[INFO] apache-atlas ....................................... SUCCESS [  3.663 s]
[INFO] Apache Atlas Test Utility Tools .................... SUCCESS [  9.817 s]
[INFO] Open Connector Framework (OCF) ..................... SUCCESS [  8.716 s]
[INFO] Apache Atlas Integration ........................... SUCCESS [ 18.223 s]
[INFO] Apache Atlas Common ................................ SUCCESS [  7.585 s]
[INFO] Apache Atlas Client ................................ SUCCESS [  0.505 s]
[INFO] atlas-client-common ................................ SUCCESS [  6.745 s]
[INFO] atlas-client-v1 .................................... SUCCESS [  7.071 s]
[INFO] Apache Atlas Server API ............................ SUCCESS [  5.354 s]
[INFO] Apache Atlas Notification .......................... SUCCESS [ 11.380 s]
[INFO] atlas-client-v2 .................................... SUCCESS [  5.324 s]
[INFO] Apache Atlas Graph Database Projects ............... SUCCESS [  0.411 s]
[INFO] Apache Atlas Graph Database API .................... SUCCESS [  4.553 s]
[INFO] Graph Database Common Code ......................... SUCCESS [  4.568 s]
[INFO] Apache Atlas JanusGraph DB Impl .................... SUCCESS [ 12.885 s]
[INFO] Apache Atlas Graph Database Implementation Dependencies SUCCESS [  1.890 s]
[INFO] Shaded version of Apache hbase client .............. SUCCESS [  7.466 s]
[INFO] Apache Atlas Titan 0.5.4 Graph DB Impl ............. SUCCESS [ 35.280 s]
[INFO] Shaded version of Apache hbase server .............. SUCCESS [ 18.394 s]
[INFO] Apache Atlas Authorization ......................... SUCCESS [  6.026 s]
[INFO] Apache Atlas Repository ............................ SUCCESS [ 27.652 s]
[INFO] Apache Atlas UI .................................... SUCCESS [01:13 min]
[INFO] Apache Atlas Web Application ....................... SUCCESS [05:10 min]
[INFO] Apache Atlas Documentation ......................... SUCCESS [  6.602 s]
[INFO] Apache Atlas FileSystem Model ...................... SUCCESS [  4.423 s]
[INFO] Apache Atlas Plugin Classloader .................... SUCCESS [ 14.519 s]
[INFO] Apache Atlas Hive Bridge Shim ...................... SUCCESS [ 14.350 s]
[INFO] Apache Atlas Hive Bridge ........................... SUCCESS [09:28 min]
[INFO] Apache Atlas Falcon Bridge Shim .................... SUCCESS [ 15.129 s]
[INFO] Apache Atlas Falcon Bridge ......................... FAILURE [02:07 min]
[INFO] Apache Atlas Sqoop Bridge Shim ..................... SKIPPED
[INFO] Apache Atlas Sqoop Bridge .......................... SKIPPED
[INFO] Apache Atlas Storm Bridge Shim ..................... SKIPPED
[INFO] Apache Atlas Storm Bridge .......................... SKIPPED
[INFO] Apache Atlas Hbase Bridge Shim ..................... SKIPPED
[INFO] Apache Atlas Hbase Bridge .......................... SKIPPED
[INFO] Apache Atlas Distribution .......................... SKIPPED
[INFO] ------------------------------------------------------------------------
[INFO] BUILD FAILURE
[INFO] ------------------------------------------------------------------------
[INFO] Total time: 22:20 min
[INFO] Finished at: 2018-03-22T02:24:57Z
[INFO] Final Memory: 759M/3294M
[INFO] ------------------------------------------------------------------------
[ERROR] Failed to execute goal org.apache.maven.plugins:maven-failsafe-plugin:2.18.1:verify
(verify) on project falcon-bridge: There are test failures.
[ERROR] 
[ERROR] Please refer to <https://builds.apache.org/job/Atlas-master-IntegrationTests/ws/addons/falcon-bridge/target/failsafe-reports>
for the individual test results.
[ERROR] -> [Help 1]
[ERROR] 
[ERROR] To see the full stack trace of the errors, re-run Maven with the -e switch.
[ERROR] Re-run Maven using the -X switch to enable full debug logging.
[ERROR] 
[ERROR] For more information about the errors and possible solutions, please read the following
articles:
[ERROR] [Help 1] http://cwiki.apache.org/confluence/display/MAVEN/MojoFailureException
[ERROR] 
[ERROR] After correcting the problems, you can resume the build with the command
[ERROR]   mvn <goals> -rf :falcon-bridge
Build step 'Execute shell' marked build as failure
[CHECKSTYLE] Collecting checkstyle analysis files...
[CHECKSTYLE] Searching for all files in <https://builds.apache.org/job/Atlas-master-IntegrationTests/ws/>
that match the pattern **/target/checkstyle-result.xml
[CHECKSTYLE] Parsing 29 files in <https://builds.apache.org/job/Atlas-master-IntegrationTests/ws/>
[CHECKSTYLE] Successfully parsed file <https://builds.apache.org/job/Atlas-master-IntegrationTests/ws/addons/falcon-bridge-shim/target/checkstyle-result.xml>
with 29 unique warnings and 0 duplicates.
[CHECKSTYLE] Successfully parsed file <https://builds.apache.org/job/Atlas-master-IntegrationTests/ws/addons/hdfs-model/target/checkstyle-result.xml>
with 29 unique warnings and 0 duplicates.
[CHECKSTYLE] Successfully parsed file <https://builds.apache.org/job/Atlas-master-IntegrationTests/ws/addons/hive-bridge-shim/target/checkstyle-result.xml>
with 44 unique warnings and 0 duplicates.
[CHECKSTYLE] Successfully parsed file <https://builds.apache.org/job/Atlas-master-IntegrationTests/ws/addons/hive-bridge/target/checkstyle-result.xml>
with 2224 unique warnings and 0 duplicates.
[CHECKSTYLE] Successfully parsed file <https://builds.apache.org/job/Atlas-master-IntegrationTests/ws/authorization/target/checkstyle-result.xml>
with 2890 unique warnings and 0 duplicates.
[CHECKSTYLE] Successfully parsed file <https://builds.apache.org/job/Atlas-master-IntegrationTests/ws/client/client-v1/target/checkstyle-result.xml>
with 3774 unique warnings and 0 duplicates.
[CHECKSTYLE] Successfully parsed file <https://builds.apache.org/job/Atlas-master-IntegrationTests/ws/client/client-v2/target/checkstyle-result.xml>
with 4133 unique warnings and 0 duplicates.
[CHECKSTYLE] Successfully parsed file <https://builds.apache.org/job/Atlas-master-IntegrationTests/ws/client/common/target/checkstyle-result.xml>
with 4621 unique warnings and 0 duplicates.
[CHECKSTYLE] Successfully parsed file <https://builds.apache.org/job/Atlas-master-IntegrationTests/ws/client/target/checkstyle-result.xml>
with 4621 unique warnings and 0 duplicates.
[CHECKSTYLE] Successfully parsed file <https://builds.apache.org/job/Atlas-master-IntegrationTests/ws/common/target/checkstyle-result.xml>
with 5652 unique warnings and 0 duplicates.
[CHECKSTYLE] Successfully parsed file <https://builds.apache.org/job/Atlas-master-IntegrationTests/ws/dashboardv2/target/checkstyle-result.xml>
with 5652 unique warnings and 0 duplicates.
[CHECKSTYLE] Successfully parsed file <https://builds.apache.org/job/Atlas-master-IntegrationTests/ws/docs/target/checkstyle-result.xml>
with 5652 unique warnings and 0 duplicates.
[CHECKSTYLE] Successfully parsed file <https://builds.apache.org/job/Atlas-master-IntegrationTests/ws/graphdb/api/target/checkstyle-result.xml>
with 5944 unique warnings and 0 duplicates.
[CHECKSTYLE] Successfully parsed file <https://builds.apache.org/job/Atlas-master-IntegrationTests/ws/graphdb/common/target/checkstyle-result.xml>
with 6153 unique warnings and 0 duplicates.
[CHECKSTYLE] Successfully parsed file <https://builds.apache.org/job/Atlas-master-IntegrationTests/ws/graphdb/graphdb-impls/target/checkstyle-result.xml>
with 6153 unique warnings and 0 duplicates.
[CHECKSTYLE] Successfully parsed file <https://builds.apache.org/job/Atlas-master-IntegrationTests/ws/graphdb/janus/target/checkstyle-result.xml>
with 7199 unique warnings and 0 duplicates.
[CHECKSTYLE] Successfully parsed file <https://builds.apache.org/job/Atlas-master-IntegrationTests/ws/graphdb/target/checkstyle-result.xml>
with 7199 unique warnings and 0 duplicates.
[CHECKSTYLE] Successfully parsed file <https://builds.apache.org/job/Atlas-master-IntegrationTests/ws/graphdb/titan0/target/checkstyle-result.xml>
with 9697 unique warnings and 0 duplicates.
[CHECKSTYLE] Successfully parsed file <https://builds.apache.org/job/Atlas-master-IntegrationTests/ws/intg/target/checkstyle-result.xml>
with 20640 unique warnings and 0 duplicates.
[CHECKSTYLE] Successfully parsed file <https://builds.apache.org/job/Atlas-master-IntegrationTests/ws/notification/target/checkstyle-result.xml>
with 21876 unique warnings and 0 duplicates.
[CHECKSTYLE] Successfully parsed file <https://builds.apache.org/job/Atlas-master-IntegrationTests/ws/om-fwk-ocf/target/checkstyle-result.xml>
with 26606 unique warnings and 0 duplicates.
[CHECKSTYLE] Successfully parsed file <https://builds.apache.org/job/Atlas-master-IntegrationTests/ws/plugin-classloader/target/checkstyle-result.xml>
with 26719 unique warnings and 0 duplicates.
[CHECKSTYLE] Successfully parsed file <https://builds.apache.org/job/Atlas-master-IntegrationTests/ws/repository/target/checkstyle-result.xml>
with 46018 unique warnings and 0 duplicates.
[CHECKSTYLE] Successfully parsed file <https://builds.apache.org/job/Atlas-master-IntegrationTests/ws/server-api/target/checkstyle-result.xml>
with 46164 unique warnings and 0 duplicates.
[CHECKSTYLE] Successfully parsed file <https://builds.apache.org/job/Atlas-master-IntegrationTests/ws/shaded/hbase-client-shaded/target/checkstyle-result.xml>
with 46164 unique warnings and 0 duplicates.
[CHECKSTYLE] Successfully parsed file <https://builds.apache.org/job/Atlas-master-IntegrationTests/ws/shaded/hbase-server-shaded/target/checkstyle-result.xml>
with 46164 unique warnings and 0 duplicates.
[CHECKSTYLE] Successfully parsed file <https://builds.apache.org/job/Atlas-master-IntegrationTests/ws/target/checkstyle-result.xml>
with 46164 unique warnings and 0 duplicates.
[CHECKSTYLE] Successfully parsed file <https://builds.apache.org/job/Atlas-master-IntegrationTests/ws/test-tools/target/checkstyle-result.xml>
with 46202 unique warnings and 0 duplicates.
[CHECKSTYLE] Successfully parsed file <https://builds.apache.org/job/Atlas-master-IntegrationTests/ws/webapp/target/checkstyle-result.xml>
with 54161 unique warnings and 0 duplicates.
<Git Blamer> Using GitBlamer to create author and commit information for all warnings.
<Git Blamer> GIT_COMMIT=60c05eb753b0437679de3996e512f7378e4d78f1, workspace=<https://builds.apache.org/job/Atlas-master-IntegrationTests/ws/>
 > git rev-parse 60c05eb753b0437679de3996e512f7378e4d78f1^{commit} # timeout=10
[CHECKSTYLE] Computing warning deltas based on reference build #824
[FINDBUGS] Collecting findbugs analysis files...
[FINDBUGS] Searching for all files in <https://builds.apache.org/job/Atlas-master-IntegrationTests/ws/>
that match the pattern **/target/findbugs.xml
[FINDBUGS] Parsing 20 files in <https://builds.apache.org/job/Atlas-master-IntegrationTests/ws/>
[FINDBUGS] Successfully parsed file <https://builds.apache.org/job/Atlas-master-IntegrationTests/ws/addons/falcon-bridge-shim/target/findbugs.xml>
with 0 unique warnings and 0 duplicates.
[FINDBUGS] Successfully parsed file <https://builds.apache.org/job/Atlas-master-IntegrationTests/ws/addons/hive-bridge-shim/target/findbugs.xml>
with 0 unique warnings and 0 duplicates.
[FINDBUGS] Successfully parsed file <https://builds.apache.org/job/Atlas-master-IntegrationTests/ws/addons/hive-bridge/target/findbugs.xml>
with 0 unique warnings and 0 duplicates.
[FINDBUGS] Successfully parsed file <https://builds.apache.org/job/Atlas-master-IntegrationTests/ws/authorization/target/findbugs.xml>
with 0 unique warnings and 0 duplicates.
[FINDBUGS] Successfully parsed file <https://builds.apache.org/job/Atlas-master-IntegrationTests/ws/client/client-v1/target/findbugs.xml>
with 0 unique warnings and 0 duplicates.
[FINDBUGS] Successfully parsed file <https://builds.apache.org/job/Atlas-master-IntegrationTests/ws/client/client-v2/target/findbugs.xml>
with 0 unique warnings and 0 duplicates.
[FINDBUGS] Successfully parsed file <https://builds.apache.org/job/Atlas-master-IntegrationTests/ws/client/common/target/findbugs.xml>
with 0 unique warnings and 0 duplicates.
[FINDBUGS] Successfully parsed file <https://builds.apache.org/job/Atlas-master-IntegrationTests/ws/common/target/findbugs.xml>
with 0 unique warnings and 0 duplicates.
[FINDBUGS] Successfully parsed file <https://builds.apache.org/job/Atlas-master-IntegrationTests/ws/graphdb/api/target/findbugs.xml>
with 0 unique warnings and 0 duplicates.
[FINDBUGS] Successfully parsed file <https://builds.apache.org/job/Atlas-master-IntegrationTests/ws/graphdb/common/target/findbugs.xml>
with 0 unique warnings and 0 duplicates.
[FINDBUGS] Successfully parsed file <https://builds.apache.org/job/Atlas-master-IntegrationTests/ws/graphdb/janus/target/findbugs.xml>
with 0 unique warnings and 0 duplicates.
[FINDBUGS] Successfully parsed file <https://builds.apache.org/job/Atlas-master-IntegrationTests/ws/graphdb/titan0/target/findbugs.xml>
with 0 unique warnings and 0 duplicates.
[FINDBUGS] Successfully parsed file <https://builds.apache.org/job/Atlas-master-IntegrationTests/ws/intg/target/findbugs.xml>
with 0 unique warnings and 0 duplicates.
[FINDBUGS] Successfully parsed file <https://builds.apache.org/job/Atlas-master-IntegrationTests/ws/notification/target/findbugs.xml>
with 0 unique warnings and 0 duplicates.
[FINDBUGS] Successfully parsed file <https://builds.apache.org/job/Atlas-master-IntegrationTests/ws/om-fwk-ocf/target/findbugs.xml>
with 0 unique warnings and 0 duplicates.
[FINDBUGS] Successfully parsed file <https://builds.apache.org/job/Atlas-master-IntegrationTests/ws/plugin-classloader/target/findbugs.xml>
with 0 unique warnings and 0 duplicates.
[FINDBUGS] Successfully parsed file <https://builds.apache.org/job/Atlas-master-IntegrationTests/ws/repository/target/findbugs.xml>
with 0 unique warnings and 0 duplicates.
[FINDBUGS] Successfully parsed file <https://builds.apache.org/job/Atlas-master-IntegrationTests/ws/server-api/target/findbugs.xml>
with 0 unique warnings and 0 duplicates.
[FINDBUGS] Successfully parsed file <https://builds.apache.org/job/Atlas-master-IntegrationTests/ws/test-tools/target/findbugs.xml>
with 0 unique warnings and 0 duplicates.
[FINDBUGS] Successfully parsed file <https://builds.apache.org/job/Atlas-master-IntegrationTests/ws/webapp/target/findbugs.xml>
with 0 unique warnings and 0 duplicates.
<Git Blamer> Using GitBlamer to create author and commit information for all warnings.
<Git Blamer> GIT_COMMIT=60c05eb753b0437679de3996e512f7378e4d78f1, workspace=<https://builds.apache.org/job/Atlas-master-IntegrationTests/ws/>
[FINDBUGS] Computing warning deltas based on reference build #824
Archiving artifacts
[Fast Archiver] Compressed 138.10 MB of artifacts by 81.5% relative to #824
TestNG Reports Processing: START
Looking for TestNG results report in workspace using pattern: **/target/surefire-reports/testng-results.xml,**/target/failsafe-reports/testng-results.xml
Saving reports...
Processing '/x1/jenkins/jenkins-home/jobs/Atlas-master-IntegrationTests/builds/828/testng/testng-results-1.xml'
Processing '/x1/jenkins/jenkins-home/jobs/Atlas-master-IntegrationTests/builds/828/testng/testng-results-2.xml'
Processing '/x1/jenkins/jenkins-home/jobs/Atlas-master-IntegrationTests/builds/828/testng/testng-results.xml'
1.149425% of tests failed, which exceeded threshold of 0%. Marking build as UNSTABLE
TestNG Reports Processing: FINISH

Mime
View raw message