atlas-dev mailing list archives

Site index · List index
Message view « Date » · « Thread »
Top « Date » · « Thread »
From Apache Jenkins Server <jenk...@builds.apache.org>
Subject Build failed in Jenkins: Atlas-0.8-IntegrationTests #188
Date Wed, 21 Mar 2018 16:13:05 GMT
See <https://builds.apache.org/job/Atlas-0.8-IntegrationTests/188/display/redirect?page=changes>

Changes:

[kbhatt] ATLAS-2509 : updated frontend-maven-plugin to 1.4

------------------------------------------
[...truncated 495.00 KB...]
127.0.0.1 - - [21/Mar/2018:16:08:18 +0000] "GET /api/atlas/v2/entity/uniqueAttribute/type/hdfs_path?attr:qualifiedName=test%241test%2B%2B-%2B%26%26%2B%7C%7C%2B%21%2B%28%2B%29%2B%7B%2B%7D%2B%5B%2B%5D%2B%5E%2B%3C%2B%3E%2B%3B%2B%3A%2B%22%2B%25%2B*%2B%60%2B%7E
HTTP/1.1" 404 - "-" "Java/1.8.0_152"
127.0.0.1 - - [21/Mar/2018:16:08:18 +0000] "POST /api/atlas/v2/entity HTTP/1.1" 200 - "-"
"Java/1.8.0_152"
127.0.0.1 - - [21/Mar/2018:16:08:23 +0000] "POST /api/atlas/v2/search/basic HTTP/1.1" 200
- "-" "Java/1.8.0_152"
127.0.0.1 - - [21/Mar/2018:16:08:23 +0000] "POST /api/atlas/v2/search/basic HTTP/1.1" 200
- "-" "Java/1.8.0_152"
127.0.0.1 - - [21/Mar/2018:16:08:23 +0000] "POST /api/atlas/v2/search/basic HTTP/1.1" 200
- "-" "Java/1.8.0_152"
127.0.0.1 - - [21/Mar/2018:16:08:23 +0000] "POST /api/atlas/v2/search/basic HTTP/1.1" 200
- "-" "Java/1.8.0_152"
127.0.0.1 - - [21/Mar/2018:16:08:23 +0000] "POST /api/atlas/v2/search/basic HTTP/1.1" 200
- "-" "Java/1.8.0_152"
127.0.0.1 - - [21/Mar/2018:16:08:23 +0000] "POST /api/atlas/v2/search/basic HTTP/1.1" 200
- "-" "Java/1.8.0_152"
127.0.0.1 - - [21/Mar/2018:16:08:23 +0000] "POST /api/atlas/v2/search/basic HTTP/1.1" 200
- "-" "Java/1.8.0_152"
127.0.0.1 - - [21/Mar/2018:16:08:23 +0000] "POST /api/atlas/v2/search/basic HTTP/1.1" 200
- "-" "Java/1.8.0_152"
127.0.0.1 - - [21/Mar/2018:16:08:23 +0000] "POST /api/atlas/v2/search/basic HTTP/1.1" 200
- "-" "Java/1.8.0_152"
127.0.0.1 - - [21/Mar/2018:16:08:23 +0000] "POST /api/atlas/v2/search/basic HTTP/1.1" 200
- "-" "Java/1.8.0_152"
127.0.0.1 - - [21/Mar/2018:16:08:23 +0000] "POST /api/atlas/v2/search/basic HTTP/1.1" 200
- "-" "Java/1.8.0_152"
127.0.0.1 - - [21/Mar/2018:16:08:23 +0000] "GET /api/atlas/v2/search/fulltext?offset=0&query=dbKl2oI27oT3&limit=10
HTTP/1.1" 200 - "-" "Java/1.8.0_152"
127.0.0.1 - - [21/Mar/2018:16:08:23 +0000] "GET /api/atlas/v2/search/fulltext?query=dbKl2oI27oT3
HTTP/1.1" 200 - "-" "Java/1.8.0_152"
127.0.0.1 - - [21/Mar/2018:16:08:23 +0000] "GET /api/atlas/v2/search/fulltext?offset=0&query=dbKl2oI27oT3&limit=10
HTTP/1.1" 200 - "-" "Java/1.8.0_152"
127.0.0.1 - - [21/Mar/2018:16:08:23 +0000] "GET /api/atlas/v2/search/fulltext?offset=1&query=dbKl2oI27oT3&limit=10
HTTP/1.1" 200 - "-" "Java/1.8.0_152"
127.0.0.1 - - [21/Mar/2018:16:08:23 +0000] "GET /api/atlas/v2/search/fulltext?offset=0&query=dbKl2oI27oT3&limit=1
HTTP/1.1" 200 - "-" "Java/1.8.0_152"
127.0.0.1 - - [21/Mar/2018:16:08:23 +0000] "GET /api/atlas/v2/search/fulltext?offset=2&query=dbKl2oI27oT3&limit=1
HTTP/1.1" 200 - "-" "Java/1.8.0_152"
127.0.0.1 - - [21/Mar/2018:16:08:23 +0000] "GET /api/atlas/v2/types/typedef/name/tableType
HTTP/1.1" 200 - "-" "Java/1.8.0_152"
127.0.0.1 - - [21/Mar/2018:16:08:23 +0000] "GET /api/atlas/v2/types/typedef/name/serdeType
HTTP/1.1" 200 - "-" "Java/1.8.0_152"
127.0.0.1 - - [21/Mar/2018:16:08:23 +0000] "GET /api/atlas/v2/types/typedef/name/classification
HTTP/1.1" 200 - "-" "Java/1.8.0_152"
127.0.0.1 - - [21/Mar/2018:16:08:23 +0000] "GET /api/atlas/v2/types/typedef/name/pii_Tag HTTP/1.1"
200 - "-" "Java/1.8.0_152"
127.0.0.1 - - [21/Mar/2018:16:08:23 +0000] "GET /api/atlas/v2/types/typedef/name/phi_Tag HTTP/1.1"
200 - "-" "Java/1.8.0_152"
127.0.0.1 - - [21/Mar/2018:16:08:23 +0000] "GET /api/atlas/v2/types/typedef/name/pci_Tag HTTP/1.1"
200 - "-" "Java/1.8.0_152"
127.0.0.1 - - [21/Mar/2018:16:08:23 +0000] "GET /api/atlas/v2/types/typedef/name/sox_Tag HTTP/1.1"
200 - "-" "Java/1.8.0_152"
127.0.0.1 - - [21/Mar/2018:16:08:23 +0000] "GET /api/atlas/v2/types/typedef/name/sec_Tag HTTP/1.1"
200 - "-" "Java/1.8.0_152"
127.0.0.1 - - [21/Mar/2018:16:08:23 +0000] "GET /api/atlas/v2/types/typedef/name/finance_Tag
HTTP/1.1" 200 - "-" "Java/1.8.0_152"
127.0.0.1 - - [21/Mar/2018:16:08:23 +0000] "GET /api/atlas/v2/types/typedef/name/FactK4YQqYRJ6B
HTTP/1.1" 404 - "-" "Java/1.8.0_152"
127.0.0.1 - - [21/Mar/2018:16:08:23 +0000] "GET /api/atlas/v2/types/typedef/name/ETLfgC7s20n83
HTTP/1.1" 404 - "-" "Java/1.8.0_152"
127.0.0.1 - - [21/Mar/2018:16:08:23 +0000] "GET /api/atlas/v2/types/typedef/name/DimensionWm3yxQFuSz
HTTP/1.1" 404 - "-" "Java/1.8.0_152"
127.0.0.1 - - [21/Mar/2018:16:08:23 +0000] "GET /api/atlas/v2/types/typedef/name/MetricKToPquciLY
HTTP/1.1" 404 - "-" "Java/1.8.0_152"
127.0.0.1 - - [21/Mar/2018:16:08:23 +0000] "GET /api/atlas/v2/types/typedef/name/hive_db_v1
HTTP/1.1" 200 - "-" "Java/1.8.0_152"
127.0.0.1 - - [21/Mar/2018:16:08:23 +0000] "GET /api/atlas/v2/types/typedef/name/hive_column_v1
HTTP/1.1" 200 - "-" "Java/1.8.0_152"
127.0.0.1 - - [21/Mar/2018:16:08:23 +0000] "GET /api/atlas/v2/types/typedef/name/hive_table_v1
HTTP/1.1" 200 - "-" "Java/1.8.0_152"
127.0.0.1 - - [21/Mar/2018:16:08:23 +0000] "GET /api/atlas/v2/types/typedef/name/hive_process_v1
HTTP/1.1" 200 - "-" "Java/1.8.0_152"
127.0.0.1 - - [21/Mar/2018:16:08:23 +0000] "POST /api/atlas/types HTTP/1.1" 201 - "-" "Java/1.8.0_152"
127.0.0.1 - - [21/Mar/2018:16:08:23 +0000] "GET /api/atlas/v2/types/typedef/name/Fact_Tag
HTTP/1.1" 200 - "-" "Java/1.8.0_152"
127.0.0.1 - - [21/Mar/2018:16:08:23 +0000] "GET /api/atlas/v2/types/typedef/name/ETL_Tag HTTP/1.1"
200 - "-" "Java/1.8.0_152"
127.0.0.1 - - [21/Mar/2018:16:08:23 +0000] "GET /api/atlas/v2/types/typedef/name/Dimension_Tag
HTTP/1.1" 200 - "-" "Java/1.8.0_152"
127.0.0.1 - - [21/Mar/2018:16:08:23 +0000] "GET /api/atlas/v2/types/typedef/name/Metric_Tag
HTTP/1.1" 200 - "-" "Java/1.8.0_152"
127.0.0.1 - - [21/Mar/2018:16:08:23 +0000] "POST /api/atlas/types HTTP/1.1" 201 - "-" "Java/1.8.0_152"
127.0.0.1 - - [21/Mar/2018:16:08:23 +0000] "POST /api/atlas/entities HTTP/1.1" 201 - "-" "Java/1.8.0_152"
127.0.0.1 - - [21/Mar/2018:16:08:24 +0000] "POST /api/atlas/entities HTTP/1.1" 201 - "-" "Java/1.8.0_152"
127.0.0.1 - - [21/Mar/2018:16:08:24 +0000] "POST /api/atlas/entities HTTP/1.1" 201 - "-" "Java/1.8.0_152"
127.0.0.1 - - [21/Mar/2018:16:08:24 +0000] "POST /api/atlas/entities HTTP/1.1" 201 - "-" "Java/1.8.0_152"
127.0.0.1 - - [21/Mar/2018:16:08:24 +0000] "POST /api/atlas/entities HTTP/1.1" 201 - "-" "Java/1.8.0_152"
127.0.0.1 - - [21/Mar/2018:16:08:24 +0000] "POST /api/atlas/entities HTTP/1.1" 201 - "-" "Java/1.8.0_152"
127.0.0.1 - - [21/Mar/2018:16:08:24 +0000] "POST /api/atlas/entities HTTP/1.1" 201 - "-" "Java/1.8.0_152"
127.0.0.1 - - [21/Mar/2018:16:08:24 +0000] "POST /api/atlas/entities HTTP/1.1" 201 - "-" "Java/1.8.0_152"
127.0.0.1 - - [21/Mar/2018:16:08:24 +0000] "GET /api/atlas/lineage/hive/table/sales_fact_monthly_mvNgM0TQJ66t/inputs/graph
HTTP/1.1" 200 - "-" "Java/1.8.0_152"
127.0.0.1 - - [21/Mar/2018:16:08:26 +0000] "GET /api/atlas/entities?type=hive_table_v1&property=qualifiedName&value=sales_fact_monthly_mvNgM0TQJ66t
HTTP/1.1" 200 - "-" "Java/1.8.0_152"
127.0.0.1 - - [21/Mar/2018:16:08:26 +0000] "GET /api/atlas/lineage/05aae0c5-edf3-4f09-a0a0-81c003b9dd56/inputs/graph
HTTP/1.1" 200 - "-" "Java/1.8.0_152"
127.0.0.1 - - [21/Mar/2018:16:08:26 +0000] "GET /api/atlas/lineage/hive/table/sales_factvqoy4I0pmd/outputs/graph
HTTP/1.1" 200 - "-" "Java/1.8.0_152"
127.0.0.1 - - [21/Mar/2018:16:08:28 +0000] "GET /api/atlas/entities?type=hive_table_v1&property=qualifiedName&value=sales_factvqoy4I0pmd
HTTP/1.1" 200 - "-" "Java/1.8.0_152"
127.0.0.1 - - [21/Mar/2018:16:08:28 +0000] "GET /api/atlas/lineage/9aa43173-7228-4acc-bd55-5cc619894a83/outputs/graph
HTTP/1.1" 200 - "-" "Java/1.8.0_152"
127.0.0.1 - - [21/Mar/2018:16:08:29 +0000] "GET /api/atlas/lineage/hive/table/sales_factvqoy4I0pmd/schema
HTTP/1.1" 200 - "-" "Java/1.8.0_152"
127.0.0.1 - - [21/Mar/2018:16:08:30 +0000] "GET /api/atlas/lineage/hive/table/SaleszDoWILrIRq/schema
HTTP/1.1" 404 - "-" "Java/1.8.0_152"
127.0.0.1 - - [21/Mar/2018:16:08:30 +0000] "GET /api/atlas/entities?type=hive_table_v1&property=qualifiedName&value=sales_factvqoy4I0pmd
HTTP/1.1" 200 - "-" "Java/1.8.0_152"
127.0.0.1 - - [21/Mar/2018:16:08:30 +0000] "GET /api/atlas/lineage/9aa43173-7228-4acc-bd55-5cc619894a83/schema
HTTP/1.1" 200 - "-" "Java/1.8.0_152"
127.0.0.1 - - [21/Mar/2018:16:08:30 +0000] "GET /api/atlas/lineage/hive/table/blah/schema
HTTP/1.1" 404 - "-" "Java/1.8.0_152"
Tests run: 143, Failures: 3, Errors: 0, Skipped: 31, Time elapsed: 64.745 sec <<<
FAILURE! - in TestSuite
setUp(org.apache.atlas.notification.NotificationHookConsumerIT)  Time elapsed: 0.406 sec 
<<< FAILURE!
org.apache.atlas.AtlasException: Failed to start embedded kafka
	at sun.nio.ch.Net.bind0(Native Method)
	at sun.nio.ch.Net.bind(Net.java:433)
	at sun.nio.ch.Net.bind(Net.java:425)
	at sun.nio.ch.ServerSocketChannelImpl.bind(ServerSocketChannelImpl.java:223)
	at sun.nio.ch.ServerSocketAdaptor.bind(ServerSocketAdaptor.java:74)
	at sun.nio.ch.ServerSocketAdaptor.bind(ServerSocketAdaptor.java:67)
	at org.apache.zookeeper.server.NIOServerCnxnFactory.configure(NIOServerCnxnFactory.java:95)
	at org.apache.zookeeper.server.ServerCnxnFactory.createFactory(ServerCnxnFactory.java:126)
	at org.apache.atlas.kafka.EmbeddedKafkaServer.startZk(EmbeddedKafkaServer.java:113)
	at org.apache.atlas.kafka.EmbeddedKafkaServer.start(EmbeddedKafkaServer.java:77)
	at org.apache.atlas.web.integration.BaseResourceIT.initNotificationService(BaseResourceIT.java:699)
	at org.apache.atlas.notification.NotificationHookConsumerIT.setUp(NotificationHookConsumerIT.java:53)

testSubmit(org.apache.atlas.web.integration.TypesJerseyResourceIT)  Time elapsed: 0.149 sec
 <<< FAILURE!
org.apache.atlas.AtlasServiceException: Metadata service API org.apache.atlas.AtlasClient$API_V1@4814089f
failed with status 400 (Bad Request) Response Body ({"error":"table.database: invalid inverseRef
constraint. Inverse attribute database.database does not exist"})
	at org.apache.atlas.AtlasBaseClient.callAPIWithResource(AtlasBaseClient.java:387)
	at org.apache.atlas.AtlasBaseClient.callAPIWithResource(AtlasBaseClient.java:320)
	at org.apache.atlas.AtlasBaseClient.callAPI(AtlasBaseClient.java:208)
	at org.apache.atlas.AtlasClient.callAPIWithBody(AtlasClient.java:942)
	at org.apache.atlas.web.integration.TypesJerseyResourceIT.testSubmit(TypesJerseyResourceIT.java:84)

testDiscoveryWithSearchParameters(org.apache.atlas.web.integration.BasicSearchIT)  Time elapsed:
0.242 sec  <<< FAILURE!
java.lang.AssertionError: expected [3] but found [21]
	at org.testng.Assert.fail(Assert.java:94)
	at org.testng.Assert.failNotEquals(Assert.java:496)
	at org.testng.Assert.assertEquals(Assert.java:125)
	at org.testng.Assert.assertEquals(Assert.java:372)
	at org.testng.Assert.assertEquals(Assert.java:382)
	at org.apache.atlas.web.integration.BasicSearchIT.testDiscoveryWithSearchParameters(BasicSearchIT.java:127)


Results :

Failed tests: 
  NotificationHookConsumerIT.setUp:53->BaseResourceIT.initNotificationService:699 »
Atlas
org.apache.atlas.web.integration.BasicSearchIT.testDiscoveryWithSearchParameters(org.apache.atlas.web.integration.BasicSearchIT)
  Run 1: BasicSearchIT.testDiscoveryWithSearchParameters:127 expected [3] but found [21]
  Run 2: PASS
  Run 3: PASS

  TypesJerseyResourceIT.testSubmit:84 » AtlasService Metadata service API org.ap...

Tests run: 141, Failures: 3, Errors: 0, Skipped: 31

[INFO] 
[INFO] --- jetty-maven-plugin:9.2.12.v20150709:stop (stop-jetty) @ atlas-webapp ---
[INFO] Waiting 10 seconds for jetty to stop
[INFO] Stopped ServerConnector@2ed558e0{HTTP/1.1}{0.0.0.0:31000}
[INFO] Closing Spring root WebApplicationContext
[INFO] Shutting down log4j
[INFO] Not cleaning cached beans: no such field javax.el.BeanELResolver.properties
[INFO] Stopped o.e.j.m.p.JettyWebAppContext@c7f6507{/,<https://builds.apache.org/job/Atlas-0.8-IntegrationTests/ws/webapp/target/atlas-webapp-0.8.3-SNAPSHOT/,UNAVAILABLE}{/home/jenkins/jenkins-slave/workspace/Atlas-0.8-IntegrationTests/webapp/target/atlas-webapp-0.8.3-SNAPSHOT.war}>
[INFO] Server reports itself as stopped
[INFO] 
[INFO] --- maven-source-plugin:2.4:jar-no-fork (attach-sources) @ atlas-webapp ---
[INFO] Building jar: <https://builds.apache.org/job/Atlas-0.8-IntegrationTests/ws/webapp/target/atlas-webapp-0.8.3-SNAPSHOT-sources.jar>
log4j:WARN No appenders could be found for logger (org.apache.zookeeper.ClientCnxn).
log4j:WARN Please initialize the log4j system properly.
log4j:WARN See http://logging.apache.org/log4j/1.2/faq.html#noconfig for more info.
[INFO] 
[INFO] --- maven-source-plugin:2.4:test-jar-no-fork (attach-sources) @ atlas-webapp ---
[INFO] Building jar: <https://builds.apache.org/job/Atlas-0.8-IntegrationTests/ws/webapp/target/atlas-webapp-0.8.3-SNAPSHOT-test-sources.jar>
[INFO] 
[INFO] --- maven-failsafe-plugin:2.18.1:verify (verify) @ atlas-webapp ---
[INFO] Failsafe report directory: <https://builds.apache.org/job/Atlas-0.8-IntegrationTests/ws/webapp/target/failsafe-reports>
[INFO] ------------------------------------------------------------------------
[INFO] Reactor Summary:
[INFO] 
[INFO] Apache Atlas Server Build Tools .................... SUCCESS [  0.594 s]
[INFO] apache-atlas ....................................... SUCCESS [  3.863 s]
[INFO] Apache Atlas Integration ........................... SUCCESS [ 17.243 s]
[INFO] Apache Atlas Common ................................ SUCCESS [  7.325 s]
[INFO] Apache Atlas Typesystem ............................ SUCCESS [ 40.565 s]
[INFO] Apache Atlas Client ................................ SUCCESS [  0.664 s]
[INFO] atlas-client-common ................................ SUCCESS [  6.542 s]
[INFO] atlas-client-v1 .................................... SUCCESS [  6.634 s]
[INFO] Apache Atlas Server API ............................ SUCCESS [  5.723 s]
[INFO] Apache Atlas Notification .......................... SUCCESS [  9.224 s]
[INFO] atlas-client-v2 .................................... SUCCESS [  5.266 s]
[INFO] Apache Atlas Graph Database Projects ............... SUCCESS [  0.422 s]
[INFO] Apache Atlas Graph Database API .................... SUCCESS [  4.461 s]
[INFO] Graph Database Common Code ......................... SUCCESS [  4.769 s]
[INFO] Apache Atlas Titan 1.0.0 GraphDB Impl .............. SUCCESS [ 33.031 s]
[INFO] Shaded version of Apache hbase client .............. SUCCESS [  7.305 s]
[INFO] Apache Atlas Titan 0.5.4 Graph DB Impl ............. SUCCESS [ 33.382 s]
[INFO] Apache Atlas Graph Database Implementation Dependencies SUCCESS [  0.634 s]
[INFO] Shaded version of Apache hbase server .............. SUCCESS [ 20.557 s]
[INFO] Apache Atlas Repository ............................ SUCCESS [01:11 min]
[INFO] Apache Atlas Authorization ......................... SUCCESS [  6.565 s]
[INFO] Apache Atlas Business Catalog ...................... SUCCESS [  9.370 s]
[INFO] Apache Atlas UI .................................... SUCCESS [01:07 min]
[INFO] Apache Atlas Web Application ....................... FAILURE [02:24 min]
[INFO] Apache Atlas Documentation ......................... SKIPPED
[INFO] Apache Atlas FileSystem Model ...................... SKIPPED
[INFO] Apache Atlas Plugin Classloader .................... SKIPPED
[INFO] Apache Atlas Hive Bridge Shim ...................... SKIPPED
[INFO] Apache Atlas Hive Bridge ........................... SKIPPED
[INFO] Apache Atlas Falcon Bridge Shim .................... SKIPPED
[INFO] Apache Atlas Falcon Bridge ......................... SKIPPED
[INFO] Apache Atlas Sqoop Bridge Shim ..................... SKIPPED
[INFO] Apache Atlas Sqoop Bridge .......................... SKIPPED
[INFO] Apache Atlas Storm Bridge Shim ..................... SKIPPED
[INFO] Apache Atlas Storm Bridge .......................... SKIPPED
[INFO] Apache Atlas Hbase Bridge Shim ..................... SKIPPED
[INFO] Apache Atlas Hbase Bridge .......................... SKIPPED
[INFO] Apache Atlas Migration Exporter .................... SKIPPED
[INFO] Apache Atlas Distribution .......................... SKIPPED
[INFO] ------------------------------------------------------------------------
[INFO] BUILD FAILURE
[INFO] ------------------------------------------------------------------------
[INFO] Total time: 08:29 min
[INFO] Finished at: 2018-03-21T16:08:35Z
[INFO] Final Memory: 363M/3349M
[INFO] ------------------------------------------------------------------------
[ERROR] Failed to execute goal org.apache.maven.plugins:maven-failsafe-plugin:2.18.1:verify
(verify) on project atlas-webapp: There are test failures.
[ERROR] 
[ERROR] Please refer to <https://builds.apache.org/job/Atlas-0.8-IntegrationTests/ws/webapp/target/failsafe-reports>
for the individual test results.
[ERROR] -> [Help 1]
[ERROR] 
[ERROR] To see the full stack trace of the errors, re-run Maven with the -e switch.
[ERROR] Re-run Maven using the -X switch to enable full debug logging.
[ERROR] 
[ERROR] For more information about the errors and possible solutions, please read the following
articles:
[ERROR] [Help 1] http://cwiki.apache.org/confluence/display/MAVEN/MojoFailureException
[ERROR] 
[ERROR] After correcting the problems, you can resume the build with the command
[ERROR]   mvn <goals> -rf :atlas-webapp
Build step 'Execute shell' marked build as failure
[CHECKSTYLE] Collecting checkstyle analysis files...
[CHECKSTYLE] Searching for all files in <https://builds.apache.org/job/Atlas-0.8-IntegrationTests/ws/>
that match the pattern **/target/checkstyle-result.xml
[CHECKSTYLE] Parsing 22 files in <https://builds.apache.org/job/Atlas-0.8-IntegrationTests/ws/>
[CHECKSTYLE] Successfully parsed file <https://builds.apache.org/job/Atlas-0.8-IntegrationTests/ws/authorization/target/checkstyle-result.xml>
with 471 unique warnings and 0 duplicates.
[CHECKSTYLE] Successfully parsed file <https://builds.apache.org/job/Atlas-0.8-IntegrationTests/ws/catalog/target/checkstyle-result.xml>
with 2608 unique warnings and 0 duplicates.
[CHECKSTYLE] Successfully parsed file <https://builds.apache.org/job/Atlas-0.8-IntegrationTests/ws/client/client-v1/target/checkstyle-result.xml>
with 3484 unique warnings and 0 duplicates.
[CHECKSTYLE] Successfully parsed file <https://builds.apache.org/job/Atlas-0.8-IntegrationTests/ws/client/client-v2/target/checkstyle-result.xml>
with 3814 unique warnings and 0 duplicates.
[CHECKSTYLE] Successfully parsed file <https://builds.apache.org/job/Atlas-0.8-IntegrationTests/ws/client/common/target/checkstyle-result.xml>
with 4304 unique warnings and 0 duplicates.
[CHECKSTYLE] Successfully parsed file <https://builds.apache.org/job/Atlas-0.8-IntegrationTests/ws/client/target/checkstyle-result.xml>
with 4304 unique warnings and 0 duplicates.
[CHECKSTYLE] Successfully parsed file <https://builds.apache.org/job/Atlas-0.8-IntegrationTests/ws/common/target/checkstyle-result.xml>
with 5263 unique warnings and 0 duplicates.
[CHECKSTYLE] Successfully parsed file <https://builds.apache.org/job/Atlas-0.8-IntegrationTests/ws/dashboardv2/target/checkstyle-result.xml>
with 5263 unique warnings and 0 duplicates.
[CHECKSTYLE] Successfully parsed file <https://builds.apache.org/job/Atlas-0.8-IntegrationTests/ws/graphdb/api/target/checkstyle-result.xml>
with 5536 unique warnings and 0 duplicates.
[CHECKSTYLE] Successfully parsed file <https://builds.apache.org/job/Atlas-0.8-IntegrationTests/ws/graphdb/common/target/checkstyle-result.xml>
with 5723 unique warnings and 0 duplicates.
[CHECKSTYLE] Successfully parsed file <https://builds.apache.org/job/Atlas-0.8-IntegrationTests/ws/graphdb/graphdb-impls/target/checkstyle-result.xml>
with 5723 unique warnings and 0 duplicates.
[CHECKSTYLE] Successfully parsed file <https://builds.apache.org/job/Atlas-0.8-IntegrationTests/ws/graphdb/target/checkstyle-result.xml>
with 5723 unique warnings and 0 duplicates.
[CHECKSTYLE] Successfully parsed file <https://builds.apache.org/job/Atlas-0.8-IntegrationTests/ws/graphdb/titan0/target/checkstyle-result.xml>
with 8178 unique warnings and 0 duplicates.
[CHECKSTYLE] Successfully parsed file <https://builds.apache.org/job/Atlas-0.8-IntegrationTests/ws/graphdb/titan1/target/checkstyle-result.xml>
with 9145 unique warnings and 0 duplicates.
[CHECKSTYLE] Successfully parsed file <https://builds.apache.org/job/Atlas-0.8-IntegrationTests/ws/intg/target/checkstyle-result.xml>
with 16065 unique warnings and 0 duplicates.
[CHECKSTYLE] Successfully parsed file <https://builds.apache.org/job/Atlas-0.8-IntegrationTests/ws/notification/target/checkstyle-result.xml>
with 17822 unique warnings and 0 duplicates.
[CHECKSTYLE] Successfully parsed file <https://builds.apache.org/job/Atlas-0.8-IntegrationTests/ws/repository/target/checkstyle-result.xml>
with 36819 unique warnings and 0 duplicates.
[CHECKSTYLE] Successfully parsed file <https://builds.apache.org/job/Atlas-0.8-IntegrationTests/ws/server-api/target/checkstyle-result.xml>
with 37209 unique warnings and 0 duplicates.
[CHECKSTYLE] Successfully parsed file <https://builds.apache.org/job/Atlas-0.8-IntegrationTests/ws/shaded/hbase-client-shaded/target/checkstyle-result.xml>
with 37209 unique warnings and 0 duplicates.
[CHECKSTYLE] Successfully parsed file <https://builds.apache.org/job/Atlas-0.8-IntegrationTests/ws/shaded/hbase-server-shaded/target/checkstyle-result.xml>
with 37209 unique warnings and 0 duplicates.
[CHECKSTYLE] Successfully parsed file <https://builds.apache.org/job/Atlas-0.8-IntegrationTests/ws/target/checkstyle-result.xml>
with 37209 unique warnings and 0 duplicates.
[CHECKSTYLE] Successfully parsed file <https://builds.apache.org/job/Atlas-0.8-IntegrationTests/ws/typesystem/target/checkstyle-result.xml>
with 41450 unique warnings and 0 duplicates.
<Git Blamer> Using GitBlamer to create author and commit information for all warnings.
<Git Blamer> GIT_COMMIT=93d7b359fac3ba315664819eb85dd9fbfb567ef0, workspace=<https://builds.apache.org/job/Atlas-0.8-IntegrationTests/ws/>
 > git rev-parse 93d7b359fac3ba315664819eb85dd9fbfb567ef0^{commit} # timeout=10
<Git Blamer> Skipping file <https://builds.apache.org/job/Atlas-0.8-IntegrationTests/ws/typesystem/src/main/java/org/apache/atlas/typesystem/IStruct.java,>
no result found.
[FINDBUGS] Collecting findbugs analysis files...
[FINDBUGS] Searching for all files in <https://builds.apache.org/job/Atlas-0.8-IntegrationTests/ws/>
that match the pattern **/target/findbugs.xml
[FINDBUGS] Parsing 15 files in <https://builds.apache.org/job/Atlas-0.8-IntegrationTests/ws/>
[FINDBUGS] Successfully parsed file <https://builds.apache.org/job/Atlas-0.8-IntegrationTests/ws/authorization/target/findbugs.xml>
with 0 unique warnings and 0 duplicates.
[FINDBUGS] Successfully parsed file <https://builds.apache.org/job/Atlas-0.8-IntegrationTests/ws/catalog/target/findbugs.xml>
with 0 unique warnings and 0 duplicates.
[FINDBUGS] Successfully parsed file <https://builds.apache.org/job/Atlas-0.8-IntegrationTests/ws/client/client-v1/target/findbugs.xml>
with 0 unique warnings and 0 duplicates.
[FINDBUGS] Successfully parsed file <https://builds.apache.org/job/Atlas-0.8-IntegrationTests/ws/client/client-v2/target/findbugs.xml>
with 0 unique warnings and 0 duplicates.
[FINDBUGS] Successfully parsed file <https://builds.apache.org/job/Atlas-0.8-IntegrationTests/ws/client/common/target/findbugs.xml>
with 0 unique warnings and 0 duplicates.
[FINDBUGS] Successfully parsed file <https://builds.apache.org/job/Atlas-0.8-IntegrationTests/ws/common/target/findbugs.xml>
with 0 unique warnings and 0 duplicates.
[FINDBUGS] Successfully parsed file <https://builds.apache.org/job/Atlas-0.8-IntegrationTests/ws/graphdb/api/target/findbugs.xml>
with 0 unique warnings and 0 duplicates.
[FINDBUGS] Successfully parsed file <https://builds.apache.org/job/Atlas-0.8-IntegrationTests/ws/graphdb/common/target/findbugs.xml>
with 0 unique warnings and 0 duplicates.
[FINDBUGS] Successfully parsed file <https://builds.apache.org/job/Atlas-0.8-IntegrationTests/ws/graphdb/titan0/target/findbugs.xml>
with 0 unique warnings and 0 duplicates.
[FINDBUGS] Successfully parsed file <https://builds.apache.org/job/Atlas-0.8-IntegrationTests/ws/graphdb/titan1/target/findbugs.xml>
with 0 unique warnings and 0 duplicates.
[FINDBUGS] Successfully parsed file <https://builds.apache.org/job/Atlas-0.8-IntegrationTests/ws/intg/target/findbugs.xml>
with 0 unique warnings and 0 duplicates.
[FINDBUGS] Successfully parsed file <https://builds.apache.org/job/Atlas-0.8-IntegrationTests/ws/notification/target/findbugs.xml>
with 0 unique warnings and 0 duplicates.
[FINDBUGS] Successfully parsed file <https://builds.apache.org/job/Atlas-0.8-IntegrationTests/ws/repository/target/findbugs.xml>
with 0 unique warnings and 0 duplicates.
[FINDBUGS] Successfully parsed file <https://builds.apache.org/job/Atlas-0.8-IntegrationTests/ws/server-api/target/findbugs.xml>
with 0 unique warnings and 0 duplicates.
[FINDBUGS] Successfully parsed file <https://builds.apache.org/job/Atlas-0.8-IntegrationTests/ws/typesystem/target/findbugs.xml>
with 0 unique warnings and 0 duplicates.
<Git Blamer> Using GitBlamer to create author and commit information for all warnings.
<Git Blamer> GIT_COMMIT=93d7b359fac3ba315664819eb85dd9fbfb567ef0, workspace=<https://builds.apache.org/job/Atlas-0.8-IntegrationTests/ws/>
Archiving artifacts
[Fast Archiver] No prior successful build to compare, so performing full copy of artifacts
TestNG Reports Processing: START
Looking for TestNG results report in workspace using pattern: **/target/surefire-reports/testng-results.xml,**/target/failsafe-reports/testng-results.xml
Saving reports...
Processing '/x1/jenkins/jenkins-home/jobs/Atlas-0.8-IntegrationTests/builds/188/testng/testng-results.xml'
1.470588% of tests failed, which exceeded threshold of 0%. Marking build as UNSTABLE
TestNG Reports Processing: FINISH

Mime
View raw message