atlas-dev mailing list archives

Site index · List index
Message view « Date » · « Thread »
Top « Date » · « Thread »
From Apache Jenkins Server <jenk...@builds.apache.org>
Subject Build failed in Jenkins: Atlas-master-IntegrationTests #830
Date Thu, 22 Mar 2018 08:35:07 GMT
See <https://builds.apache.org/job/Atlas-master-IntegrationTests/830/display/redirect>

------------------------------------------
[...truncated 655.73 KB...]
[INFO] Started o.e.j.m.p.JettyWebAppContext@789f8c42{/,file://<https://builds.apache.org/job/Atlas-master-IntegrationTests/ws/webapp/target/atlas-webapp-1.0.0-SNAPSHOT/,AVAILABLE}{/home/jenkins/jenkins-slave/workspace/Atlas-master-IntegrationTests/webapp/target/atlas-webapp-1.0.0-SNAPSHOT.war}>
[INFO] Started ServerConnector@67d893{HTTP/1.1,[http/1.1]}{0.0.0.0:31000}
[INFO] Started @1348696ms
[INFO] Started Jetty Server
[INFO] 
[INFO] --- maven-failsafe-plugin:2.18.1:integration-test (integration-test) @ falcon-bridge
---
[WARNING] useSystemClassloader setting has no effect when not forking
[INFO] Failsafe report directory: <https://builds.apache.org/job/Atlas-master-IntegrationTests/ws/addons/falcon-bridge/target/failsafe-reports>
Running org.apache.atlas.falcon.hook.FalconHookIT
127.0.0.1 - - [22/Mar/2018:08:26:02 +0000] "GET //localhost:31000/api/atlas/entities?type=falcon_cluster&property=qualifiedName&value=clustereAQ9MIyNP0
HTTP/1.1" 404 106 "-" "Java/1.8.0_152"
127.0.0.1 - - [22/Mar/2018:08:26:03 +0000] "GET //localhost:31000/api/atlas/entities?type=falcon_cluster&property=qualifiedName&value=clustereAQ9MIyNP0
HTTP/1.1" 404 106 "-" "Java/1.8.0_152"
127.0.0.1 - - [22/Mar/2018:08:26:03 +0000] "GET //localhost:31000/api/atlas/entities?type=falcon_cluster&property=qualifiedName&value=clustereAQ9MIyNP0
HTTP/1.1" 404 106 "-" "Java/1.8.0_152"
127.0.0.1 - - [22/Mar/2018:08:26:03 +0000] "GET //localhost:31000/api/atlas/entities?type=falcon_cluster&property=qualifiedName&value=clustereAQ9MIyNP0
HTTP/1.1" 404 106 "-" "Java/1.8.0_152"
127.0.0.1 - - [22/Mar/2018:08:26:04 +0000] "GET //localhost:31000/api/atlas/entities?type=falcon_cluster&property=qualifiedName&value=clustereAQ9MIyNP0
HTTP/1.1" 404 106 "-" "Java/1.8.0_152"
127.0.0.1 - - [22/Mar/2018:08:26:04 +0000] "GET //localhost:31000/api/atlas/entities?type=falcon_feed&property=qualifiedName&value=feedTXW8xSS18D@clusterMZz44HCZhS
HTTP/1.1" 404 118 "-" "Java/1.8.0_152"
127.0.0.1 - - [22/Mar/2018:08:26:05 +0000] "GET //localhost:31000/api/atlas/entities?type=falcon_feed&property=qualifiedName&value=feedTXW8xSS18D@clusterMZz44HCZhS
HTTP/1.1" 404 118 "-" "Java/1.8.0_152"
127.0.0.1 - - [22/Mar/2018:08:26:05 +0000] "GET //localhost:31000/api/atlas/entities?type=falcon_feed&property=qualifiedName&value=feedTXW8xSS18D@clusterMZz44HCZhS
HTTP/1.1" 404 118 "-" "Java/1.8.0_152"
127.0.0.1 - - [22/Mar/2018:08:26:05 +0000] "GET //localhost:31000/api/atlas/entities?type=falcon_feed&property=qualifiedName&value=feedTXW8xSS18D@clusterMZz44HCZhS
HTTP/1.1" 200 923 "-" "Java/1.8.0_152"
127.0.0.1 - - [22/Mar/2018:08:26:06 +0000] "GET //localhost:31000/api/atlas/entities?type=falcon_feed&property=qualifiedName&value=feedTXW8xSS18D@clusterMZz44HCZhS
HTTP/1.1" 200 923 "-" "Java/1.8.0_152"
127.0.0.1 - - [22/Mar/2018:08:26:06 +0000] "GET //localhost:31000/api/atlas/entities/3f161def-c2be-4940-bb40-8a6b9a0f8324
HTTP/1.1" 200 923 "-" "Java/1.8.0_152"
127.0.0.1 - - [22/Mar/2018:08:26:06 +0000] "GET //localhost:31000/api/atlas/entities?type=falcon_feed_creation&property=qualifiedName&value=feedTXW8xSS18D@clusterMZz44HCZhS
HTTP/1.1" 200 1266 "-" "Java/1.8.0_152"
127.0.0.1 - - [22/Mar/2018:08:26:06 +0000] "GET //localhost:31000/api/atlas/entities?type=falcon_feed_creation&property=qualifiedName&value=feedTXW8xSS18D@clusterMZz44HCZhS
HTTP/1.1" 200 1266 "-" "Java/1.8.0_152"
127.0.0.1 - - [22/Mar/2018:08:26:06 +0000] "GET //localhost:31000/api/atlas/entities/6e2dd33d-6691-47fa-907e-55888ec7b4bc
HTTP/1.1" 200 1266 "-" "Java/1.8.0_152"
127.0.0.1 - - [22/Mar/2018:08:26:06 +0000] "GET //localhost:31000/api/atlas/entities/d168b1ec-1223-4a77-9366-172403600bd0
HTTP/1.1" 200 1018 "-" "Java/1.8.0_152"
127.0.0.1 - - [22/Mar/2018:08:26:06 +0000] "GET //localhost:31000/api/atlas/entities?type=falcon_feed&property=qualifiedName&value=feedQyrAmsOXRE@clusterMZz44HCZhS
HTTP/1.1" 404 118 "-" "Java/1.8.0_152"
127.0.0.1 - - [22/Mar/2018:08:26:06 +0000] "GET //localhost:31000/api/atlas/entities?type=falcon_feed&property=qualifiedName&value=feedQyrAmsOXRE@clusterMZz44HCZhS
HTTP/1.1" 200 923 "-" "Java/1.8.0_152"
127.0.0.1 - - [22/Mar/2018:08:26:06 +0000] "GET //localhost:31000/api/atlas/entities?type=falcon_feed&property=qualifiedName&value=feedQyrAmsOXRE@clusterMZz44HCZhS
HTTP/1.1" 200 923 "-" "Java/1.8.0_152"
127.0.0.1 - - [22/Mar/2018:08:26:06 +0000] "GET //localhost:31000/api/atlas/entities/547aba9f-981b-4490-bf05-6e5de2e17ecb
HTTP/1.1" 200 923 "-" "Java/1.8.0_152"
127.0.0.1 - - [22/Mar/2018:08:26:06 +0000] "GET //localhost:31000/api/atlas/entities?type=falcon_feed_creation&property=qualifiedName&value=feedQyrAmsOXRE@clusterMZz44HCZhS
HTTP/1.1" 200 1267 "-" "Java/1.8.0_152"
127.0.0.1 - - [22/Mar/2018:08:26:06 +0000] "GET //localhost:31000/api/atlas/entities?type=falcon_feed_creation&property=qualifiedName&value=feedQyrAmsOXRE@clusterMZz44HCZhS
HTTP/1.1" 200 1267 "-" "Java/1.8.0_152"
127.0.0.1 - - [22/Mar/2018:08:26:06 +0000] "GET //localhost:31000/api/atlas/entities/c414fd9a-e633-4a1b-9758-a8be655ec66b
HTTP/1.1" 200 1267 "-" "Java/1.8.0_152"
127.0.0.1 - - [22/Mar/2018:08:26:06 +0000] "GET //localhost:31000/api/atlas/entities/8f507995-f096-4331-acc6-df4d16600751
HTTP/1.1" 200 1127 "-" "Java/1.8.0_152"
127.0.0.1 - - [22/Mar/2018:08:26:07 +0000] "GET //localhost:31000/api/atlas/entities?type=falcon_feed&property=qualifiedName&value=feedQyrAmsOXRE@clusterMZz44HCZhS
HTTP/1.1" 200 923 "-" "Java/1.8.0_152"
127.0.0.1 - - [22/Mar/2018:08:26:07 +0000] "GET //localhost:31000/api/atlas/entities?type=falcon_process&property=qualifiedName&value=processuxBr4ZOOps@clusterMZz44HCZhS
HTTP/1.1" 404 124 "-" "Java/1.8.0_152"
127.0.0.1 - - [22/Mar/2018:08:26:07 +0000] "GET //localhost:31000/api/atlas/entities?type=falcon_process&property=qualifiedName&value=processuxBr4ZOOps@clusterMZz44HCZhS
HTTP/1.1" 200 1492 "-" "Java/1.8.0_152"
127.0.0.1 - - [22/Mar/2018:08:26:07 +0000] "GET //localhost:31000/api/atlas/entities?type=falcon_process&property=qualifiedName&value=processuxBr4ZOOps@clusterMZz44HCZhS
HTTP/1.1" 200 1492 "-" "Java/1.8.0_152"
127.0.0.1 - - [22/Mar/2018:08:26:07 +0000] "GET //localhost:31000/api/atlas/entities/f0948c1f-f9a1-49cf-9c10-95caa9407da7
HTTP/1.1" 200 1492 "-" "Java/1.8.0_152"
127.0.0.1 - - [22/Mar/2018:08:26:07 +0000] "GET //localhost:31000/api/atlas/entities?type=falcon_cluster&property=qualifiedName&value=clusterFymvh4w5Uv
HTTP/1.1" 404 106 "-" "Java/1.8.0_152"
127.0.0.1 - - [22/Mar/2018:08:26:08 +0000] "GET //localhost:31000/api/atlas/entities?type=falcon_cluster&property=qualifiedName&value=clusterFymvh4w5Uv
HTTP/1.1" 200 704 "-" "Java/1.8.0_152"
127.0.0.1 - - [22/Mar/2018:08:26:08 +0000] "GET //localhost:31000/api/atlas/entities?type=falcon_cluster&property=qualifiedName&value=clusterFymvh4w5Uv
HTTP/1.1" 200 704 "-" "Java/1.8.0_152"
127.0.0.1 - - [22/Mar/2018:08:26:08 +0000] "GET //localhost:31000/api/atlas/entities?type=falcon_cluster&property=qualifiedName&value=cluster22ETMulY9G
HTTP/1.1" 404 106 "-" "Java/1.8.0_152"
127.0.0.1 - - [22/Mar/2018:08:26:08 +0000] "GET //localhost:31000/api/atlas/entities?type=falcon_cluster&property=qualifiedName&value=cluster22ETMulY9G
HTTP/1.1" 200 704 "-" "Java/1.8.0_152"
127.0.0.1 - - [22/Mar/2018:08:26:08 +0000] "GET //localhost:31000/api/atlas/entities?type=falcon_cluster&property=qualifiedName&value=cluster22ETMulY9G
HTTP/1.1" 200 704 "-" "Java/1.8.0_152"
127.0.0.1 - - [22/Mar/2018:08:26:08 +0000] "GET //localhost:31000/api/atlas/entities?type=falcon_feed&property=qualifiedName&value=feed8yNcpoeebq@clusterFymvh4w5Uv
HTTP/1.1" 404 118 "-" "Java/1.8.0_152"
127.0.0.1 - - [22/Mar/2018:08:26:09 +0000] "GET //localhost:31000/api/atlas/entities?type=falcon_feed&property=qualifiedName&value=feed8yNcpoeebq@clusterFymvh4w5Uv
HTTP/1.1" 404 118 "-" "Java/1.8.0_152"
127.0.0.1 - - [22/Mar/2018:08:26:09 +0000] "GET //localhost:31000/api/atlas/entities?type=falcon_feed&property=qualifiedName&value=feed8yNcpoeebq@clusterFymvh4w5Uv
HTTP/1.1" 200 923 "-" "Java/1.8.0_152"
127.0.0.1 - - [22/Mar/2018:08:26:09 +0000] "GET //localhost:31000/api/atlas/entities?type=falcon_feed&property=qualifiedName&value=feed8yNcpoeebq@clusterFymvh4w5Uv
HTTP/1.1" 200 923 "-" "Java/1.8.0_152"
127.0.0.1 - - [22/Mar/2018:08:26:09 +0000] "GET //localhost:31000/api/atlas/entities/78f6e04d-706b-49be-86f2-a913e4707ff7
HTTP/1.1" 200 923 "-" "Java/1.8.0_152"
127.0.0.1 - - [22/Mar/2018:08:26:09 +0000] "GET //localhost:31000/api/atlas/entities?type=falcon_feed_creation&property=qualifiedName&value=feed8yNcpoeebq@clusterFymvh4w5Uv
HTTP/1.1" 200 1267 "-" "Java/1.8.0_152"
127.0.0.1 - - [22/Mar/2018:08:26:09 +0000] "GET //localhost:31000/api/atlas/entities?type=falcon_feed_creation&property=qualifiedName&value=feed8yNcpoeebq@clusterFymvh4w5Uv
HTTP/1.1" 200 1267 "-" "Java/1.8.0_152"
127.0.0.1 - - [22/Mar/2018:08:26:09 +0000] "GET //localhost:31000/api/atlas/entities/a0f0455d-2430-46ad-84d2-98f6bdb56451
HTTP/1.1" 200 1267 "-" "Java/1.8.0_152"
127.0.0.1 - - [22/Mar/2018:08:26:09 +0000] "GET //localhost:31000/api/atlas/entities/f4620671-4047-4aad-8fe7-232533530aed
HTTP/1.1" 200 1127 "-" "Java/1.8.0_152"
127.0.0.1 - - [22/Mar/2018:08:26:09 +0000] "GET //localhost:31000/api/atlas/entities?type=falcon_feed&property=qualifiedName&value=feed8yNcpoeebq@cluster22ETMulY9G
HTTP/1.1" 200 923 "-" "Java/1.8.0_152"
127.0.0.1 - - [22/Mar/2018:08:26:09 +0000] "GET //localhost:31000/api/atlas/entities?type=falcon_feed&property=qualifiedName&value=feed8yNcpoeebq@cluster22ETMulY9G
HTTP/1.1" 200 923 "-" "Java/1.8.0_152"
127.0.0.1 - - [22/Mar/2018:08:26:09 +0000] "GET //localhost:31000/api/atlas/entities/84072014-ccb9-4697-8905-54d222797071
HTTP/1.1" 200 923 "-" "Java/1.8.0_152"
127.0.0.1 - - [22/Mar/2018:08:26:09 +0000] "GET //localhost:31000/api/atlas/entities?type=falcon_feed_creation&property=qualifiedName&value=feed8yNcpoeebq@cluster22ETMulY9G
HTTP/1.1" 200 1267 "-" "Java/1.8.0_152"
127.0.0.1 - - [22/Mar/2018:08:26:10 +0000] "GET //localhost:31000/api/atlas/entities?type=falcon_feed_creation&property=qualifiedName&value=feed8yNcpoeebq@cluster22ETMulY9G
HTTP/1.1" 200 1267 "-" "Java/1.8.0_152"
127.0.0.1 - - [22/Mar/2018:08:26:10 +0000] "GET //localhost:31000/api/atlas/entities/fcf78064-03e3-4f96-b3ac-35cda4645e0d
HTTP/1.1" 200 1267 "-" "Java/1.8.0_152"
127.0.0.1 - - [22/Mar/2018:08:26:10 +0000] "GET //localhost:31000/api/atlas/entities/32d383d7-1a9d-48bb-8eca-e04ab8e6d827
HTTP/1.1" 200 1127 "-" "Java/1.8.0_152"
127.0.0.1 - - [22/Mar/2018:08:26:10 +0000] "GET //localhost:31000/api/atlas/entities?type=falcon_feed&property=qualifiedName&value=feed8yNcpoeebq@clusterFymvh4w5Uv
HTTP/1.1" 200 923 "-" "Java/1.8.0_152"
127.0.0.1 - - [22/Mar/2018:08:26:10 +0000] "GET //localhost:31000/api/atlas/entities?type=falcon_feed&property=qualifiedName&value=feed8yNcpoeebq@cluster22ETMulY9G
HTTP/1.1" 200 923 "-" "Java/1.8.0_152"
127.0.0.1 - - [22/Mar/2018:08:26:10 +0000] "GET //localhost:31000/api/atlas/entities?type=falcon_feed_replication&property=qualifiedName&value=feed8yNcpoeebq
HTTP/1.1" 200 1040 "-" "Java/1.8.0_152"
127.0.0.1 - - [22/Mar/2018:08:26:10 +0000] "GET //localhost:31000/api/atlas/entities?type=falcon_feed_replication&property=qualifiedName&value=feed8yNcpoeebq
HTTP/1.1" 200 1040 "-" "Java/1.8.0_152"
127.0.0.1 - - [22/Mar/2018:08:26:10 +0000] "GET //localhost:31000/api/atlas/entities/2c90ee4d-08f3-4e0d-b43b-4655a9779a72
HTTP/1.1" 200 1040 "-" "Java/1.8.0_152"
Tests run: 3, Failures: 1, Errors: 0, Skipped: 0, Time elapsed: 10.459 sec <<< FAILURE!
- in org.apache.atlas.falcon.hook.FalconHookIT
testCreateProcess(org.apache.atlas.falcon.hook.FalconHookIT)  Time elapsed: 2.869 sec  <<<
FAILURE!
java.lang.AssertionError: Assertions failed. Failing after waiting for timeout 2000 msecs
	at org.apache.atlas.AtlasBaseClient.callAPIWithResource(AtlasBaseClient.java:388)
	at org.apache.atlas.AtlasBaseClient.callAPIWithResource(AtlasBaseClient.java:323)
	at org.apache.atlas.AtlasBaseClient.callAPIWithRetries(AtlasBaseClient.java:472)
	at org.apache.atlas.AtlasClient.callAPIWithRetries(AtlasClient.java:931)
	at org.apache.atlas.AtlasClient.getEntity(AtlasClient.java:640)
	at org.apache.atlas.falcon.hook.FalconHookIT$1.evaluate(FalconHookIT.java:310)
	at org.apache.atlas.falcon.hook.FalconHookIT.waitFor(FalconHookIT.java:340)
	at org.apache.atlas.falcon.hook.FalconHookIT.assertEntityIsRegistered(FalconHookIT.java:307)
	at org.apache.atlas.falcon.hook.FalconHookIT.assertClusterIsRegistered(FalconHookIT.java:161)
	at org.apache.atlas.falcon.hook.FalconHookIT.testCreateProcess(FalconHookIT.java:130)


Results :

Failed tests: 
  FalconHookIT.testCreateProcess:130->assertClusterIsRegistered:161->assertEntityIsRegistered:307->waitFor:344
Assertions failed. Failing after waiting for timeout 2000 msecs

Tests run: 3, Failures: 1, Errors: 0, Skipped: 0

[INFO] 
[INFO] --- jetty-maven-plugin:9.3.14.v20161028:stop (stop-jetty) @ falcon-bridge ---
[INFO] Waiting 10 seconds for jetty to stop
[INFO] Stopped ServerConnector@67d893{HTTP/1.1,[http/1.1]}{0.0.0.0:31000}
[INFO] Closing Spring root WebApplicationContext
[INFO] Shutting down log4j
[INFO] Stopped o.e.j.m.p.JettyWebAppContext@789f8c42{/,file://<https://builds.apache.org/job/Atlas-master-IntegrationTests/ws/webapp/target/atlas-webapp-1.0.0-SNAPSHOT/,UNAVAILABLE}{/home/jenkins/jenkins-slave/workspace/Atlas-master-IntegrationTests/webapp/target/atlas-webapp-1.0.0-SNAPSHOT.war}>
[INFO] Server reports itself as stopped
[INFO] 
[INFO] --- maven-antrun-plugin:1.7:run (default) @ falcon-bridge ---
[WARNING] Parameter tasks is deprecated, use target instead
[INFO] Executing tasks

main:
   [delete] Deleting directory <https://builds.apache.org/job/Atlas-master-IntegrationTests/ws/addons/hive-bridge/target/data>
   [delete] Deleting directory <https://builds.apache.org/job/Atlas-master-IntegrationTests/ws/addons/hive-bridge/target/logs>
[INFO] Executed tasks
[INFO] 
[INFO] --- maven-source-plugin:2.4:jar-no-fork (attach-sources) @ falcon-bridge ---
[INFO] Building jar: <https://builds.apache.org/job/Atlas-master-IntegrationTests/ws/addons/falcon-bridge/target/falcon-bridge-1.0.0-SNAPSHOT-sources.jar>
log4j:WARN No appenders could be found for logger (org.apache.zookeeper.ClientCnxn).
log4j:WARN Please initialize the log4j system properly.
log4j:WARN See http://logging.apache.org/log4j/1.2/faq.html#noconfig for more info.
[INFO] 
[INFO] --- maven-source-plugin:2.4:test-jar-no-fork (attach-sources) @ falcon-bridge ---
[INFO] Building jar: <https://builds.apache.org/job/Atlas-master-IntegrationTests/ws/addons/falcon-bridge/target/falcon-bridge-1.0.0-SNAPSHOT-test-sources.jar>
[INFO] 
[INFO] --- maven-failsafe-plugin:2.18.1:verify (verify) @ falcon-bridge ---
[INFO] Failsafe report directory: <https://builds.apache.org/job/Atlas-master-IntegrationTests/ws/addons/falcon-bridge/target/failsafe-reports>
[INFO] ------------------------------------------------------------------------
[INFO] Reactor Summary:
[INFO] 
[INFO] Apache Atlas Server Build Tools .................... SUCCESS [  0.764 s]
[INFO] apache-atlas ....................................... SUCCESS [  8.287 s]
[INFO] Apache Atlas Test Utility Tools .................... SUCCESS [ 17.094 s]
[INFO] Open Connector Framework (OCF) ..................... SUCCESS [ 14.182 s]
[INFO] Apache Atlas Integration ........................... SUCCESS [ 31.043 s]
[INFO] Apache Atlas Common ................................ SUCCESS [ 17.003 s]
[INFO] Apache Atlas Client ................................ SUCCESS [  0.924 s]
[INFO] atlas-client-common ................................ SUCCESS [ 10.282 s]
[INFO] atlas-client-v1 .................................... SUCCESS [ 11.169 s]
[INFO] Apache Atlas Server API ............................ SUCCESS [  9.470 s]
[INFO] Apache Atlas Notification .......................... SUCCESS [ 14.686 s]
[INFO] atlas-client-v2 .................................... SUCCESS [  7.732 s]
[INFO] Apache Atlas Graph Database Projects ............... SUCCESS [  0.745 s]
[INFO] Apache Atlas Graph Database API .................... SUCCESS [  7.441 s]
[INFO] Graph Database Common Code ......................... SUCCESS [  7.061 s]
[INFO] Apache Atlas JanusGraph DB Impl .................... SUCCESS [ 14.742 s]
[INFO] Apache Atlas Graph Database Implementation Dependencies SUCCESS [  2.709 s]
[INFO] Shaded version of Apache hbase client .............. SUCCESS [ 13.709 s]
[INFO] Apache Atlas Titan 0.5.4 Graph DB Impl ............. SUCCESS [ 58.636 s]
[INFO] Shaded version of Apache hbase server .............. SUCCESS [ 27.372 s]
[INFO] Apache Atlas Authorization ......................... SUCCESS [  8.121 s]
[INFO] Apache Atlas Repository ............................ SUCCESS [ 40.649 s]
[INFO] Apache Atlas UI .................................... SUCCESS [01:40 min]
[INFO] Apache Atlas Web Application ....................... SUCCESS [05:18 min]
[INFO] Apache Atlas Documentation ......................... SUCCESS [  4.314 s]
[INFO] Apache Atlas FileSystem Model ...................... SUCCESS [  2.909 s]
[INFO] Apache Atlas Plugin Classloader .................... SUCCESS [  8.126 s]
[INFO] Apache Atlas Hive Bridge Shim ...................... SUCCESS [  5.842 s]
[INFO] Apache Atlas Hive Bridge ........................... SUCCESS [08:39 min]
[INFO] Apache Atlas Falcon Bridge Shim .................... SUCCESS [  7.544 s]
[INFO] Apache Atlas Falcon Bridge ......................... FAILURE [01:07 min]
[INFO] Apache Atlas Sqoop Bridge Shim ..................... SKIPPED
[INFO] Apache Atlas Sqoop Bridge .......................... SKIPPED
[INFO] Apache Atlas Storm Bridge Shim ..................... SKIPPED
[INFO] Apache Atlas Storm Bridge .......................... SKIPPED
[INFO] Apache Atlas Hbase Bridge Shim ..................... SKIPPED
[INFO] Apache Atlas Hbase Bridge .......................... SKIPPED
[INFO] Apache Atlas Distribution .......................... SKIPPED
[INFO] ------------------------------------------------------------------------
[INFO] BUILD FAILURE
[INFO] ------------------------------------------------------------------------
[INFO] Total time: 22:40 min
[INFO] Finished at: 2018-03-22T08:26:13Z
[INFO] Final Memory: 753M/2468M
[INFO] ------------------------------------------------------------------------
[ERROR] Failed to execute goal org.apache.maven.plugins:maven-failsafe-plugin:2.18.1:verify
(verify) on project falcon-bridge: There are test failures.
[ERROR] 
[ERROR] Please refer to <https://builds.apache.org/job/Atlas-master-IntegrationTests/ws/addons/falcon-bridge/target/failsafe-reports>
for the individual test results.
[ERROR] -> [Help 1]
[ERROR] 
[ERROR] To see the full stack trace of the errors, re-run Maven with the -e switch.
[ERROR] Re-run Maven using the -X switch to enable full debug logging.
[ERROR] 
[ERROR] For more information about the errors and possible solutions, please read the following
articles:
[ERROR] [Help 1] http://cwiki.apache.org/confluence/display/MAVEN/MojoFailureException
[ERROR] 
[ERROR] After correcting the problems, you can resume the build with the command
[ERROR]   mvn <goals> -rf :falcon-bridge
Build step 'Execute shell' marked build as failure
[CHECKSTYLE] Collecting checkstyle analysis files...
[CHECKSTYLE] Searching for all files in <https://builds.apache.org/job/Atlas-master-IntegrationTests/ws/>
that match the pattern **/target/checkstyle-result.xml
[CHECKSTYLE] Parsing 29 files in <https://builds.apache.org/job/Atlas-master-IntegrationTests/ws/>
[CHECKSTYLE] Successfully parsed file <https://builds.apache.org/job/Atlas-master-IntegrationTests/ws/addons/falcon-bridge-shim/target/checkstyle-result.xml>
with 29 unique warnings and 0 duplicates.
[CHECKSTYLE] Successfully parsed file <https://builds.apache.org/job/Atlas-master-IntegrationTests/ws/addons/hdfs-model/target/checkstyle-result.xml>
with 29 unique warnings and 0 duplicates.
[CHECKSTYLE] Successfully parsed file <https://builds.apache.org/job/Atlas-master-IntegrationTests/ws/addons/hive-bridge-shim/target/checkstyle-result.xml>
with 44 unique warnings and 0 duplicates.
[CHECKSTYLE] Successfully parsed file <https://builds.apache.org/job/Atlas-master-IntegrationTests/ws/addons/hive-bridge/target/checkstyle-result.xml>
with 2224 unique warnings and 0 duplicates.
[CHECKSTYLE] Successfully parsed file <https://builds.apache.org/job/Atlas-master-IntegrationTests/ws/authorization/target/checkstyle-result.xml>
with 2890 unique warnings and 0 duplicates.
[CHECKSTYLE] Successfully parsed file <https://builds.apache.org/job/Atlas-master-IntegrationTests/ws/client/client-v1/target/checkstyle-result.xml>
with 3774 unique warnings and 0 duplicates.
[CHECKSTYLE] Successfully parsed file <https://builds.apache.org/job/Atlas-master-IntegrationTests/ws/client/client-v2/target/checkstyle-result.xml>
with 4133 unique warnings and 0 duplicates.
[CHECKSTYLE] Successfully parsed file <https://builds.apache.org/job/Atlas-master-IntegrationTests/ws/client/common/target/checkstyle-result.xml>
with 4621 unique warnings and 0 duplicates.
[CHECKSTYLE] Successfully parsed file <https://builds.apache.org/job/Atlas-master-IntegrationTests/ws/client/target/checkstyle-result.xml>
with 4621 unique warnings and 0 duplicates.
[CHECKSTYLE] Successfully parsed file <https://builds.apache.org/job/Atlas-master-IntegrationTests/ws/common/target/checkstyle-result.xml>
with 5652 unique warnings and 0 duplicates.
[CHECKSTYLE] Successfully parsed file <https://builds.apache.org/job/Atlas-master-IntegrationTests/ws/dashboardv2/target/checkstyle-result.xml>
with 5652 unique warnings and 0 duplicates.
[CHECKSTYLE] Successfully parsed file <https://builds.apache.org/job/Atlas-master-IntegrationTests/ws/docs/target/checkstyle-result.xml>
with 5652 unique warnings and 0 duplicates.
[CHECKSTYLE] Successfully parsed file <https://builds.apache.org/job/Atlas-master-IntegrationTests/ws/graphdb/api/target/checkstyle-result.xml>
with 5944 unique warnings and 0 duplicates.
[CHECKSTYLE] Successfully parsed file <https://builds.apache.org/job/Atlas-master-IntegrationTests/ws/graphdb/common/target/checkstyle-result.xml>
with 6153 unique warnings and 0 duplicates.
[CHECKSTYLE] Successfully parsed file <https://builds.apache.org/job/Atlas-master-IntegrationTests/ws/graphdb/graphdb-impls/target/checkstyle-result.xml>
with 6153 unique warnings and 0 duplicates.
[CHECKSTYLE] Successfully parsed file <https://builds.apache.org/job/Atlas-master-IntegrationTests/ws/graphdb/janus/target/checkstyle-result.xml>
with 7199 unique warnings and 0 duplicates.
[CHECKSTYLE] Successfully parsed file <https://builds.apache.org/job/Atlas-master-IntegrationTests/ws/graphdb/target/checkstyle-result.xml>
with 7199 unique warnings and 0 duplicates.
[CHECKSTYLE] Successfully parsed file <https://builds.apache.org/job/Atlas-master-IntegrationTests/ws/graphdb/titan0/target/checkstyle-result.xml>
with 9697 unique warnings and 0 duplicates.
[CHECKSTYLE] Successfully parsed file <https://builds.apache.org/job/Atlas-master-IntegrationTests/ws/intg/target/checkstyle-result.xml>
with 20640 unique warnings and 0 duplicates.
[CHECKSTYLE] Successfully parsed file <https://builds.apache.org/job/Atlas-master-IntegrationTests/ws/notification/target/checkstyle-result.xml>
with 21876 unique warnings and 0 duplicates.
[CHECKSTYLE] Successfully parsed file <https://builds.apache.org/job/Atlas-master-IntegrationTests/ws/om-fwk-ocf/target/checkstyle-result.xml>
with 26606 unique warnings and 0 duplicates.
[CHECKSTYLE] Successfully parsed file <https://builds.apache.org/job/Atlas-master-IntegrationTests/ws/plugin-classloader/target/checkstyle-result.xml>
with 26719 unique warnings and 0 duplicates.
[CHECKSTYLE] Successfully parsed file <https://builds.apache.org/job/Atlas-master-IntegrationTests/ws/repository/target/checkstyle-result.xml>
with 46018 unique warnings and 0 duplicates.
[CHECKSTYLE] Successfully parsed file <https://builds.apache.org/job/Atlas-master-IntegrationTests/ws/server-api/target/checkstyle-result.xml>
with 46164 unique warnings and 0 duplicates.
[CHECKSTYLE] Successfully parsed file <https://builds.apache.org/job/Atlas-master-IntegrationTests/ws/shaded/hbase-client-shaded/target/checkstyle-result.xml>
with 46164 unique warnings and 0 duplicates.
[CHECKSTYLE] Successfully parsed file <https://builds.apache.org/job/Atlas-master-IntegrationTests/ws/shaded/hbase-server-shaded/target/checkstyle-result.xml>
with 46164 unique warnings and 0 duplicates.
[CHECKSTYLE] Successfully parsed file <https://builds.apache.org/job/Atlas-master-IntegrationTests/ws/target/checkstyle-result.xml>
with 46164 unique warnings and 0 duplicates.
[CHECKSTYLE] Successfully parsed file <https://builds.apache.org/job/Atlas-master-IntegrationTests/ws/test-tools/target/checkstyle-result.xml>
with 46202 unique warnings and 0 duplicates.
[CHECKSTYLE] Successfully parsed file <https://builds.apache.org/job/Atlas-master-IntegrationTests/ws/webapp/target/checkstyle-result.xml>
with 54161 unique warnings and 0 duplicates.
<Git Blamer> Using GitBlamer to create author and commit information for all warnings.
<Git Blamer> GIT_COMMIT=60c05eb753b0437679de3996e512f7378e4d78f1, workspace=<https://builds.apache.org/job/Atlas-master-IntegrationTests/ws/>
 > git rev-parse 60c05eb753b0437679de3996e512f7378e4d78f1^{commit} # timeout=10
[CHECKSTYLE] Computing warning deltas based on reference build #829
[FINDBUGS] Collecting findbugs analysis files...
[FINDBUGS] Searching for all files in <https://builds.apache.org/job/Atlas-master-IntegrationTests/ws/>
that match the pattern **/target/findbugs.xml
[FINDBUGS] Parsing 20 files in <https://builds.apache.org/job/Atlas-master-IntegrationTests/ws/>
[FINDBUGS] Successfully parsed file <https://builds.apache.org/job/Atlas-master-IntegrationTests/ws/addons/falcon-bridge-shim/target/findbugs.xml>
with 0 unique warnings and 0 duplicates.
[FINDBUGS] Successfully parsed file <https://builds.apache.org/job/Atlas-master-IntegrationTests/ws/addons/hive-bridge-shim/target/findbugs.xml>
with 0 unique warnings and 0 duplicates.
[FINDBUGS] Successfully parsed file <https://builds.apache.org/job/Atlas-master-IntegrationTests/ws/addons/hive-bridge/target/findbugs.xml>
with 0 unique warnings and 0 duplicates.
[FINDBUGS] Successfully parsed file <https://builds.apache.org/job/Atlas-master-IntegrationTests/ws/authorization/target/findbugs.xml>
with 0 unique warnings and 0 duplicates.
[FINDBUGS] Successfully parsed file <https://builds.apache.org/job/Atlas-master-IntegrationTests/ws/client/client-v1/target/findbugs.xml>
with 0 unique warnings and 0 duplicates.
[FINDBUGS] Successfully parsed file <https://builds.apache.org/job/Atlas-master-IntegrationTests/ws/client/client-v2/target/findbugs.xml>
with 0 unique warnings and 0 duplicates.
[FINDBUGS] Successfully parsed file <https://builds.apache.org/job/Atlas-master-IntegrationTests/ws/client/common/target/findbugs.xml>
with 0 unique warnings and 0 duplicates.
[FINDBUGS] Successfully parsed file <https://builds.apache.org/job/Atlas-master-IntegrationTests/ws/common/target/findbugs.xml>
with 0 unique warnings and 0 duplicates.
[FINDBUGS] Successfully parsed file <https://builds.apache.org/job/Atlas-master-IntegrationTests/ws/graphdb/api/target/findbugs.xml>
with 0 unique warnings and 0 duplicates.
[FINDBUGS] Successfully parsed file <https://builds.apache.org/job/Atlas-master-IntegrationTests/ws/graphdb/common/target/findbugs.xml>
with 0 unique warnings and 0 duplicates.
[FINDBUGS] Successfully parsed file <https://builds.apache.org/job/Atlas-master-IntegrationTests/ws/graphdb/janus/target/findbugs.xml>
with 0 unique warnings and 0 duplicates.
[FINDBUGS] Successfully parsed file <https://builds.apache.org/job/Atlas-master-IntegrationTests/ws/graphdb/titan0/target/findbugs.xml>
with 0 unique warnings and 0 duplicates.
[FINDBUGS] Successfully parsed file <https://builds.apache.org/job/Atlas-master-IntegrationTests/ws/intg/target/findbugs.xml>
with 0 unique warnings and 0 duplicates.
[FINDBUGS] Successfully parsed file <https://builds.apache.org/job/Atlas-master-IntegrationTests/ws/notification/target/findbugs.xml>
with 0 unique warnings and 0 duplicates.
[FINDBUGS] Successfully parsed file <https://builds.apache.org/job/Atlas-master-IntegrationTests/ws/om-fwk-ocf/target/findbugs.xml>
with 0 unique warnings and 0 duplicates.
[FINDBUGS] Successfully parsed file <https://builds.apache.org/job/Atlas-master-IntegrationTests/ws/plugin-classloader/target/findbugs.xml>
with 0 unique warnings and 0 duplicates.
[FINDBUGS] Successfully parsed file <https://builds.apache.org/job/Atlas-master-IntegrationTests/ws/repository/target/findbugs.xml>
with 0 unique warnings and 0 duplicates.
[FINDBUGS] Successfully parsed file <https://builds.apache.org/job/Atlas-master-IntegrationTests/ws/server-api/target/findbugs.xml>
with 0 unique warnings and 0 duplicates.
[FINDBUGS] Successfully parsed file <https://builds.apache.org/job/Atlas-master-IntegrationTests/ws/test-tools/target/findbugs.xml>
with 0 unique warnings and 0 duplicates.
[FINDBUGS] Successfully parsed file <https://builds.apache.org/job/Atlas-master-IntegrationTests/ws/webapp/target/findbugs.xml>
with 0 unique warnings and 0 duplicates.
<Git Blamer> Using GitBlamer to create author and commit information for all warnings.
<Git Blamer> GIT_COMMIT=60c05eb753b0437679de3996e512f7378e4d78f1, workspace=<https://builds.apache.org/job/Atlas-master-IntegrationTests/ws/>
[FINDBUGS] Computing warning deltas based on reference build #829
Archiving artifacts
[Fast Archiver] Compressed 138.01 MB of artifacts by 81.5% relative to #829
TestNG Reports Processing: START
Looking for TestNG results report in workspace using pattern: **/target/surefire-reports/testng-results.xml,**/target/failsafe-reports/testng-results.xml
Saving reports...
Processing '/x1/jenkins/jenkins-home/jobs/Atlas-master-IntegrationTests/builds/830/testng/testng-results-1.xml'
Processing '/x1/jenkins/jenkins-home/jobs/Atlas-master-IntegrationTests/builds/830/testng/testng-results-2.xml'
Processing '/x1/jenkins/jenkins-home/jobs/Atlas-master-IntegrationTests/builds/830/testng/testng-results.xml'
0.574713% of tests failed, which exceeded threshold of 0%. Marking build as UNSTABLE
TestNG Reports Processing: FINISH

Mime
View raw message