atlas-dev mailing list archives

Site index · List index
Message view « Date » · « Thread »
Top « Date » · « Thread »
From Apache Jenkins Server <jenk...@builds.apache.org>
Subject Build failed in Jenkins: Atlas-master-UnitTests #870
Date Tue, 27 Mar 2018 06:39:13 GMT
See <https://builds.apache.org/job/Atlas-master-UnitTests/870/display/redirect>

------------------------------------------
[...truncated 172.73 KB...]
[INFO] Exclude: **/data/**
[INFO] Exclude: **/maven-eclipse.xml
[INFO] Exclude: **/.externalToolBuilders/**
[INFO] Exclude: **/build.log
[INFO] Exclude: **/.bowerrc
[INFO] Exclude: *.json
[INFO] Exclude: **/overlays/**
[INFO] Exclude: dev-support/**
[INFO] Exclude: **/users-credentials.properties
[INFO] Exclude: **/public/css/animate.min.css
[INFO] Exclude: **/public/css/bootstrap-sidebar.css
[INFO] Exclude: **/public/js/external_lib/**
[INFO] Exclude: **/node_modules/**
[INFO] Exclude: **/public/js/libs/**
[INFO] Exclude: **/atlas.data/**
[INFO] Exclude: **/${sys:atlas.data}/**
[INFO] Exclude: **/policy-store.txt
[INFO] Exclude: **/*rebel*.xml
[INFO] Exclude: **/*rebel*.xml.bak
[INFO] Exclude: **/test/resources/**
[INFO] 148 resources included (use -debug for more details)
[INFO] Rat check: Summary over all files. Unapproved: 0, unknown: 0, generated: 0, approved:
148 licenses.
[INFO] 
[INFO] --- maven-resources-plugin:2.7:copy-resources (copy-resources) @ atlas-repository ---
[INFO] Using 'UTF-8' encoding to copy filtered resources.
[INFO] Copying 9 resources
[INFO] 
[INFO] --- maven-remote-resources-plugin:1.5:process (default) @ atlas-repository ---
[INFO] 
[INFO] --- maven-resources-plugin:2.7:resources (default-resources) @ atlas-repository ---
[INFO] Using 'UTF-8' encoding to copy filtered resources.
[INFO] skip non existing resourceDirectory <https://builds.apache.org/job/Atlas-master-UnitTests/ws/repository/src/main/resources>
[INFO] Copying 2 resources to META-INF
[INFO] Copying 3 resources
[INFO] 
[INFO] --- maven-compiler-plugin:3.7.0:compile (default-compile) @ atlas-repository ---
[INFO] Changes detected - recompiling the module!
[INFO] Compiling 118 source files to <https://builds.apache.org/job/Atlas-master-UnitTests/ws/repository/target/classes>
[INFO] <https://builds.apache.org/job/Atlas-master-UnitTests/ws/repository/src/main/java/org/apache/atlas/repository/converters/AtlasInstanceConverter.java>:
Some input files use or override a deprecated API.
[INFO] <https://builds.apache.org/job/Atlas-master-UnitTests/ws/repository/src/main/java/org/apache/atlas/repository/converters/AtlasInstanceConverter.java>:
Recompile with -Xlint:deprecation for details.
[INFO] <https://builds.apache.org/job/Atlas-master-UnitTests/ws/repository/src/main/java/org/apache/atlas/repository/graph/GraphHelper.java>:
Some input files use unchecked or unsafe operations.
[INFO] <https://builds.apache.org/job/Atlas-master-UnitTests/ws/repository/src/main/java/org/apache/atlas/repository/graph/GraphHelper.java>:
Recompile with -Xlint:unchecked for details.
[INFO] 
[INFO] --- maven-resources-plugin:2.7:testResources (default-testResources) @ atlas-repository
---
[INFO] Using 'UTF-8' encoding to copy filtered resources.
[INFO] Copying 22 resources
[INFO] Copying 3 resources
[INFO] 
[INFO] --- maven-compiler-plugin:3.7.0:testCompile (default-testCompile) @ atlas-repository
---
[INFO] Changes detected - recompiling the module!
[INFO] Compiling 33 source files to <https://builds.apache.org/job/Atlas-master-UnitTests/ws/repository/target/test-classes>
[INFO] <https://builds.apache.org/job/Atlas-master-UnitTests/ws/repository/src/test/java/org/apache/atlas/query/BasicTestSetup.java>:
<https://builds.apache.org/job/Atlas-master-UnitTests/ws/repository/src/test/java/org/apache/atlas/query/BasicTestSetup.java>
uses or overrides a deprecated API.
[INFO] <https://builds.apache.org/job/Atlas-master-UnitTests/ws/repository/src/test/java/org/apache/atlas/query/BasicTestSetup.java>:
Recompile with -Xlint:deprecation for details.
[INFO] <https://builds.apache.org/job/Atlas-master-UnitTests/ws/repository/src/test/java/org/apache/atlas/repository/store/graph/v1/InverseReferenceUpdateV1Test.java>:
Some input files use unchecked or unsafe operations.
[INFO] <https://builds.apache.org/job/Atlas-master-UnitTests/ws/repository/src/test/java/org/apache/atlas/repository/store/graph/v1/InverseReferenceUpdateV1Test.java>:
Recompile with -Xlint:unchecked for details.
[INFO] 
[INFO] --- maven-surefire-plugin:2.18.1:test (default-test) @ atlas-repository ---
[INFO] Surefire report directory: <https://builds.apache.org/job/Atlas-master-UnitTests/ws/repository/target/surefire-reports>
[INFO] Using configured provider org.apache.maven.surefire.testng.TestNGProvider

-------------------------------------------------------
 T E S T S
-------------------------------------------------------
Running org.apache.atlas.query.DSLParsingTest
Running org.apache.atlas.query.DSLQueriesTest
Running org.apache.atlas.repository.store.graph.v1.AtlasRelationshipStoreHardDeleteV1Test
Running org.apache.atlas.repository.impexp.TypeAttributeDifferenceTest
Running org.apache.atlas.repository.store.graph.v1.AtlasEntityDefStoreV1Test
Running org.apache.atlas.repository.impexp.ZipSinkTest
Running org.apache.atlas.services.MetricsServiceTest
Running org.apache.atlas.repository.impexp.ExportServiceTest
Running org.apache.atlas.repository.impexp.ImportTransformerTest
Running org.apache.atlas.repository.impexp.ImportTransformsTest
Running org.apache.atlas.repository.store.graph.v1.AtlasRelationshipStoreV1Test
Running org.apache.atlas.repository.store.graph.v1.InverseReferenceUpdateV1Test
Running org.apache.atlas.repository.store.graph.v1.AtlasRelationshipDefStoreV1Test
Running org.apache.atlas.repository.impexp.UniqueListTest
Running org.apache.atlas.repository.store.graph.v1.InverseReferenceUpdateHardDeleteV1Test
Running org.apache.atlas.query.GremlinQueryComposerTest
Running org.apache.atlas.repository.impexp.ImportTransformerJSONTest
Running org.apache.atlas.repository.impexp.ZipSourceTest
Running org.apache.atlas.repository.store.graph.v1.InverseReferenceUpdateSoftDeleteV1Test
Running org.apache.atlas.repository.impexp.AtlasImportRequestTest
Running org.apache.atlas.TestModules
Running org.apache.atlas.repository.impexp.ImportServiceTest
Running org.apache.atlas.repository.store.graph.v1.AtlasRelationshipStoreSoftDeleteV1Test
Running org.apache.atlas.repository.store.graph.v1.AtlasEntityStoreV1Test
Running org.apache.atlas.utils.TestResourceFileUtils
Running org.apache.atlas.repository.store.graph.v1.AtlasEntityStoreV1BulkImportPercentTest
Running org.apache.atlas.utils.ObjectUpdateSynchronizerTest
Running org.apache.atlas.repository.store.graph.AtlasTypeDefGraphStoreTest
Running org.apache.atlas.repository.userprofile.UserProfileServiceTest
Running org.apache.atlas.repository.audit.InMemoryAuditRepositoryTest
Tests run: 0, Failures: 0, Errors: 0, Skipped: 0, Time elapsed: 1.978 sec - in org.apache.atlas.repository.store.graph.v1.InverseReferenceUpdateV1Test
Tests run: 0, Failures: 0, Errors: 0, Skipped: 0, Time elapsed: 2.012 sec - in org.apache.atlas.repository.store.graph.v1.AtlasRelationshipStoreV1Test
Tests run: 0, Failures: 0, Errors: 0, Skipped: 0, Time elapsed: 2.165 sec - in org.apache.atlas.TestModules
Tests run: 0, Failures: 0, Errors: 0, Skipped: 0, Time elapsed: 2.063 sec - in org.apache.atlas.utils.TestResourceFileUtils
Tests run: 8, Failures: 0, Errors: 0, Skipped: 0, Time elapsed: 2.369 sec - in org.apache.atlas.repository.impexp.ImportTransformerTest
Tests run: 4, Failures: 0, Errors: 0, Skipped: 0, Time elapsed: 2.438 sec - in org.apache.atlas.repository.impexp.UniqueListTest
Tests run: 3, Failures: 0, Errors: 0, Skipped: 0, Time elapsed: 1.973 sec - in org.apache.atlas.repository.audit.InMemoryAuditRepositoryTest
Tests run: 6, Failures: 0, Errors: 0, Skipped: 0, Time elapsed: 3.256 sec - in org.apache.atlas.repository.impexp.TypeAttributeDifferenceTest
Tests run: 1, Failures: 0, Errors: 0, Skipped: 0, Time elapsed: 3.427 sec - in org.apache.atlas.repository.impexp.ImportTransformerJSONTest
Tests run: 6, Failures: 0, Errors: 0, Skipped: 0, Time elapsed: 3.611 sec - in org.apache.atlas.repository.impexp.AtlasImportRequestTest
Tests run: 8, Failures: 0, Errors: 0, Skipped: 0, Time elapsed: 3.844 sec - in org.apache.atlas.query.DSLParsingTest
Tests run: 9, Failures: 0, Errors: 0, Skipped: 0, Time elapsed: 3.352 sec - in org.apache.atlas.repository.store.graph.v1.AtlasEntityStoreV1BulkImportPercentTest
Tests run: 3, Failures: 0, Errors: 0, Skipped: 0, Time elapsed: 3.806 sec - in org.apache.atlas.repository.impexp.ImportTransformsTest
Tests run: 8, Failures: 0, Errors: 0, Skipped: 0, Time elapsed: 3.892 sec - in org.apache.atlas.repository.impexp.ZipSinkTest
Tests run: 9, Failures: 0, Errors: 0, Skipped: 0, Time elapsed: 3.477 sec - in org.apache.atlas.utils.ObjectUpdateSynchronizerTest
Tests run: 6, Failures: 0, Errors: 0, Skipped: 0, Time elapsed: 4.319 sec - in org.apache.atlas.repository.impexp.ZipSourceTest
Tests run: 39, Failures: 0, Errors: 0, Skipped: 0, Time elapsed: 6.385 sec - in org.apache.atlas.query.GremlinQueryComposerTest
Tests run: 1, Failures: 0, Errors: 0, Skipped: 0, Time elapsed: 24.797 sec - in org.apache.atlas.repository.store.graph.v1.AtlasEntityDefStoreV1Test
Tests run: 10, Failures: 0, Errors: 0, Skipped: 0, Time elapsed: 29.035 sec - in org.apache.atlas.repository.store.graph.v1.AtlasRelationshipDefStoreV1Test
Tests run: 1, Failures: 0, Errors: 0, Skipped: 0, Time elapsed: 32.53 sec - in org.apache.atlas.services.MetricsServiceTest
Tests run: 5, Failures: 0, Errors: 0, Skipped: 0, Time elapsed: 37.778 sec - in org.apache.atlas.repository.store.graph.v1.InverseReferenceUpdateHardDeleteV1Test
Tests run: 4, Failures: 0, Errors: 0, Skipped: 0, Time elapsed: 37.994 sec - in org.apache.atlas.repository.store.graph.v1.AtlasRelationshipStoreSoftDeleteV1Test
Tests run: 5, Failures: 0, Errors: 0, Skipped: 0, Time elapsed: 39.444 sec - in org.apache.atlas.repository.store.graph.v1.InverseReferenceUpdateSoftDeleteV1Test
Tests run: 4, Failures: 0, Errors: 0, Skipped: 0, Time elapsed: 40.275 sec - in org.apache.atlas.repository.store.graph.v1.AtlasRelationshipStoreHardDeleteV1Test
Tests run: 10, Failures: 0, Errors: 0, Skipped: 0, Time elapsed: 41.932 sec - in org.apache.atlas.repository.impexp.ExportServiceTest
Tests run: 12, Failures: 0, Errors: 0, Skipped: 0, Time elapsed: 41.854 sec - in org.apache.atlas.repository.userprofile.UserProfileServiceTest
Tests run: 14, Failures: 0, Errors: 0, Skipped: 0, Time elapsed: 46.08 sec - in org.apache.atlas.repository.store.graph.v1.AtlasEntityStoreV1Test
Tests run: 18, Failures: 0, Errors: 0, Skipped: 0, Time elapsed: 47.445 sec - in org.apache.atlas.repository.store.graph.AtlasTypeDefGraphStoreTest
Tests run: 10, Failures: 2, Errors: 0, Skipped: 3, Time elapsed: 48.79 sec <<< FAILURE!
- in org.apache.atlas.repository.impexp.ImportServiceTest
importCTAS(org.apache.atlas.repository.impexp.ImportServiceTest)  Time elapsed: 14.063 sec
 <<< FAILURE!
org.apache.atlas.exception.AtlasBaseException: Invalid classification parameters passed for
delete operation for entity: 73cb606c-6846-4718-a859-40c9c17e0b32
	at org.apache.atlas.repository.store.graph.v1.EntityGraphMapper.deleteClassifications(EntityGraphMapper.java:1406)
	at org.apache.atlas.repository.store.graph.v1.EntityGraphMapper.deleteClassifications(EntityGraphMapper.java:1750)
	at org.apache.atlas.repository.store.graph.v1.EntityGraphMapper.mapAttributesAndClassifications(EntityGraphMapper.java:215)
	at org.apache.atlas.repository.store.graph.v1.AtlasEntityStoreV1.createOrUpdate(AtlasEntityStoreV1.java:621)
	at org.apache.atlas.repository.store.graph.v1.AtlasEntityStoreV1.createOrUpdateForImport(AtlasEntityStoreV1.java:171)
	at org.apache.atlas.GraphTransactionInterceptor.invoke(GraphTransactionInterceptor.java:60)
	at org.apache.atlas.repository.store.graph.v1.BulkImporterImpl.bulkImport(BulkImporterImpl.java:83)
	at org.apache.atlas.repository.impexp.ImportService.processEntities(ImportService.java:161)
	at org.apache.atlas.repository.impexp.ImportService.run(ImportService.java:82)
	at org.apache.atlas.repository.impexp.ImportService.run(ImportService.java:61)
	at org.apache.atlas.repository.impexp.ZipFileResourceTestUtils.runImportWithNoParameters(ZipFileResourceTestUtils.java:201)
	at org.apache.atlas.repository.impexp.ImportServiceTest.importCTAS(ImportServiceTest.java:180)

importDB1(org.apache.atlas.repository.impexp.ImportServiceTest)  Time elapsed: 4.987 sec 
<<< FAILURE!
org.apache.atlas.exception.AtlasBaseException: Invalid classification parameters passed for
delete operation for entity: 42f82e22-ebb9-4f2e-b93a-6d436b239fad
	at org.apache.atlas.repository.store.graph.v1.EntityGraphMapper.deleteClassifications(EntityGraphMapper.java:1406)
	at org.apache.atlas.repository.store.graph.v1.EntityGraphMapper.deleteClassifications(EntityGraphMapper.java:1750)
	at org.apache.atlas.repository.store.graph.v1.EntityGraphMapper.mapAttributesAndClassifications(EntityGraphMapper.java:215)
	at org.apache.atlas.repository.store.graph.v1.AtlasEntityStoreV1.createOrUpdate(AtlasEntityStoreV1.java:621)
	at org.apache.atlas.repository.store.graph.v1.AtlasEntityStoreV1.createOrUpdateForImport(AtlasEntityStoreV1.java:171)
	at org.apache.atlas.GraphTransactionInterceptor.invoke(GraphTransactionInterceptor.java:60)
	at org.apache.atlas.repository.store.graph.v1.BulkImporterImpl.bulkImport(BulkImporterImpl.java:83)
	at org.apache.atlas.repository.impexp.ImportService.processEntities(ImportService.java:161)
	at org.apache.atlas.repository.impexp.ImportService.run(ImportService.java:82)
	at org.apache.atlas.repository.impexp.ZipFileResourceTestUtils.runImportWithParameters(ZipFileResourceTestUtils.java:191)
	at org.apache.atlas.repository.impexp.ZipFileResourceTestUtils.runAndVerifyQuickStart_v1_Import(ZipFileResourceTestUtils.java:214)
	at org.apache.atlas.repository.impexp.ImportServiceTest.importDB1(ImportServiceTest.java:93)

Tests run: 246, Failures: 0, Errors: 0, Skipped: 0, Time elapsed: 110.571 sec - in org.apache.atlas.query.DSLQueriesTest

Results :

Failed tests: 
  ImportServiceTest.importCTAS:180 » AtlasBase Invalid classification parameters...
  ImportServiceTest.importDB1:93 » AtlasBase Invalid classification parameters p...

Tests run: 450, Failures: 2, Errors: 0, Skipped: 3

[INFO] ------------------------------------------------------------------------
[INFO] Reactor Summary:
[INFO] 
[INFO] Apache Atlas Server Build Tools .................... SUCCESS [  0.602 s]
[INFO] apache-atlas ....................................... SUCCESS [  2.088 s]
[INFO] Apache Atlas Test Utility Tools .................... SUCCESS [  4.078 s]
[INFO] Open Connector Framework (OCF) ..................... SUCCESS [  1.331 s]
[INFO] Apache Atlas Integration ........................... SUCCESS [ 33.394 s]
[INFO] Apache Atlas Common ................................ SUCCESS [  2.141 s]
[INFO] Apache Atlas Client ................................ SUCCESS [  0.113 s]
[INFO] atlas-client-common ................................ SUCCESS [  0.629 s]
[INFO] atlas-client-v1 .................................... SUCCESS [  2.625 s]
[INFO] Apache Atlas Server API ............................ SUCCESS [  0.663 s]
[INFO] Apache Atlas Notification .......................... SUCCESS [ 14.862 s]
[INFO] atlas-client-v2 .................................... SUCCESS [  0.648 s]
[INFO] Apache Atlas Graph Database Projects ............... SUCCESS [  0.081 s]
[INFO] Apache Atlas Graph Database API .................... SUCCESS [  0.635 s]
[INFO] Graph Database Common Code ......................... SUCCESS [  0.616 s]
[INFO] Apache Atlas JanusGraph DB Impl .................... SUCCESS [02:04 min]
[INFO] Apache Atlas Graph Database Implementation Dependencies SUCCESS [  1.760 s]
[INFO] Shaded version of Apache hbase client .............. SUCCESS [  7.253 s]
[INFO] Apache Atlas Titan 0.5.4 Graph DB Impl ............. SUCCESS [ 25.873 s]
[INFO] Shaded version of Apache hbase server .............. SUCCESS [ 18.953 s]
[INFO] Apache Atlas Authorization ......................... SUCCESS [  2.200 s]
[INFO] Apache Atlas Repository ............................ FAILURE [01:58 min]
[INFO] Apache Atlas UI .................................... SKIPPED
[INFO] Apache Atlas Web Application ....................... SKIPPED
[INFO] Apache Atlas Documentation ......................... SKIPPED
[INFO] Apache Atlas FileSystem Model ...................... SKIPPED
[INFO] Apache Atlas Plugin Classloader .................... SKIPPED
[INFO] Apache Atlas Hive Bridge Shim ...................... SKIPPED
[INFO] Apache Atlas Hive Bridge ........................... SKIPPED
[INFO] Apache Atlas Falcon Bridge Shim .................... SKIPPED
[INFO] Apache Atlas Falcon Bridge ......................... SKIPPED
[INFO] Apache Atlas Sqoop Bridge Shim ..................... SKIPPED
[INFO] Apache Atlas Sqoop Bridge .......................... SKIPPED
[INFO] Apache Atlas Storm Bridge Shim ..................... SKIPPED
[INFO] Apache Atlas Storm Bridge .......................... SKIPPED
[INFO] Apache Atlas Hbase Bridge Shim ..................... SKIPPED
[INFO] Apache Atlas Hbase Bridge .......................... SKIPPED
[INFO] Apache Atlas Migration Exporter .................... SKIPPED
[INFO] Apache Atlas Distribution .......................... SKIPPED
[INFO] ------------------------------------------------------------------------
[INFO] BUILD FAILURE
[INFO] ------------------------------------------------------------------------
[INFO] Total time: 06:04 min
[INFO] Finished at: 2018-03-27T06:39:05Z
[INFO] Final Memory: 128M/1982M
[INFO] ------------------------------------------------------------------------
[ERROR] Failed to execute goal org.apache.maven.plugins:maven-surefire-plugin:2.18.1:test
(default-test) on project atlas-repository: There are test failures.
[ERROR] 
[ERROR] Please refer to <https://builds.apache.org/job/Atlas-master-UnitTests/ws/repository/target/surefire-reports>
for the individual test results.
[ERROR] -> [Help 1]
[ERROR] 
[ERROR] To see the full stack trace of the errors, re-run Maven with the -e switch.
[ERROR] Re-run Maven using the -X switch to enable full debug logging.
[ERROR] 
[ERROR] For more information about the errors and possible solutions, please read the following
articles:
[ERROR] [Help 1] http://cwiki.apache.org/confluence/display/MAVEN/MojoFailureException
[ERROR] 
[ERROR] After correcting the problems, you can resume the build with the command
[ERROR]   mvn <goals> -rf :atlas-repository
Build step 'Execute shell' marked build as failure
[CHECKSTYLE] Collecting checkstyle analysis files...
[CHECKSTYLE] Searching for all files in <https://builds.apache.org/job/Atlas-master-UnitTests/ws/>
that match the pattern **/target/checkstyle-result.xml
[CHECKSTYLE] No files found. Configuration error?
<Git Blamer> Using GitBlamer to create author and commit information for all warnings.
<Git Blamer> GIT_COMMIT=0f689faaa5ef6433ecb39d9f0ee8c4cf8a48b8eb, workspace=<https://builds.apache.org/job/Atlas-master-UnitTests/ws/>
[CHECKSTYLE] Computing warning deltas based on reference build #868
[FINDBUGS] Collecting findbugs analysis files...
[FINDBUGS] Searching for all files in <https://builds.apache.org/job/Atlas-master-UnitTests/ws/>
that match the pattern **/target/findbugs.xml
[FINDBUGS] No files found. Configuration error?
<Git Blamer> Using GitBlamer to create author and commit information for all warnings.
<Git Blamer> GIT_COMMIT=0f689faaa5ef6433ecb39d9f0ee8c4cf8a48b8eb, workspace=<https://builds.apache.org/job/Atlas-master-UnitTests/ws/>
[FINDBUGS] Computing warning deltas based on reference build #868
Archiving artifacts
TestNG Reports Processing: START
Looking for TestNG results report in workspace using pattern: **/target/surefire-reports/testng-results.xml,**/target/failsafe-reports/testng-results.xml
Saving reports...
Processing '/x1/jenkins/jenkins-home/jobs/Atlas-master-UnitTests/builds/870/testng/testng-results-1.xml'
Processing '/x1/jenkins/jenkins-home/jobs/Atlas-master-UnitTests/builds/870/testng/testng-results-2.xml'
Processing '/x1/jenkins/jenkins-home/jobs/Atlas-master-UnitTests/builds/870/testng/testng-results-3.xml'
Processing '/x1/jenkins/jenkins-home/jobs/Atlas-master-UnitTests/builds/870/testng/testng-results-4.xml'
Processing '/x1/jenkins/jenkins-home/jobs/Atlas-master-UnitTests/builds/870/testng/testng-results-5.xml'
Processing '/x1/jenkins/jenkins-home/jobs/Atlas-master-UnitTests/builds/870/testng/testng-results-6.xml'
Processing '/x1/jenkins/jenkins-home/jobs/Atlas-master-UnitTests/builds/870/testng/testng-results.xml'
TestNG Reports Processing: FINISH

Mime
View raw message