atlas-dev mailing list archives

Site index · List index
Message view « Date » · « Thread »
Top « Date » · « Thread »
From Apache Jenkins Server <jenk...@builds.apache.org>
Subject Build failed in Jenkins: PreCommit-ATLAS-Build-Test #132-master-Use-vertex-centric-indexes-to-retrieve-classificatio.2.patch
Date Fri, 02 Mar 2018 07:20:54 GMT
See <https://builds.apache.org/job/PreCommit-ATLAS-Build-Test/132/display/redirect>

------------------------------------------
[...truncated 243.18 KB...]
	at org.testng.Assert.assertNotNull(Assert.java:406)
	at org.testng.Assert.assertNotNull(Assert.java:391)
	at org.apache.atlas.query.DSLQueriesTest.assertSearchResult(DSLQueriesTest.java:656)
	at org.apache.atlas.query.DSLQueriesTest.queryAssert(DSLQueriesTest.java:256)
	at org.apache.atlas.query.DSLQueriesTest.syntax(DSLQueriesTest.java:368)

syntax(org.apache.atlas.query.DSLQueriesTest)  Time elapsed: 0.106 sec  <<< FAILURE!
java.lang.AssertionError: expected object to not be null
	at org.testng.Assert.fail(Assert.java:94)
	at org.testng.Assert.assertNotNull(Assert.java:406)
	at org.testng.Assert.assertNotNull(Assert.java:391)
	at org.apache.atlas.query.DSLQueriesTest.assertSearchResult(DSLQueriesTest.java:656)
	at org.apache.atlas.query.DSLQueriesTest.queryAssert(DSLQueriesTest.java:256)
	at org.apache.atlas.query.DSLQueriesTest.syntax(DSLQueriesTest.java:368)

syntax(org.apache.atlas.query.DSLQueriesTest)  Time elapsed: 0.109 sec  <<< FAILURE!
java.lang.AssertionError: expected object to not be null
	at org.testng.Assert.fail(Assert.java:94)
	at org.testng.Assert.assertNotNull(Assert.java:406)
	at org.testng.Assert.assertNotNull(Assert.java:391)
	at org.apache.atlas.query.DSLQueriesTest.assertSearchResult(DSLQueriesTest.java:656)
	at org.apache.atlas.query.DSLQueriesTest.queryAssert(DSLQueriesTest.java:256)
	at org.apache.atlas.query.DSLQueriesTest.syntax(DSLQueriesTest.java:368)

syntax(org.apache.atlas.query.DSLQueriesTest)  Time elapsed: 0.13 sec  <<< FAILURE!
java.lang.AssertionError: expected object to not be null
	at org.testng.Assert.fail(Assert.java:94)
	at org.testng.Assert.assertNotNull(Assert.java:406)
	at org.testng.Assert.assertNotNull(Assert.java:391)
	at org.apache.atlas.query.DSLQueriesTest.assertSearchResult(DSLQueriesTest.java:656)
	at org.apache.atlas.query.DSLQueriesTest.queryAssert(DSLQueriesTest.java:256)
	at org.apache.atlas.query.DSLQueriesTest.syntax(DSLQueriesTest.java:368)


Results :

Failed tests: 
org.apache.atlas.query.DSLQueriesTest.basic(org.apache.atlas.query.DSLQueriesTest)
  Run 1: PASS
  Run 2: PASS
  Run 3: PASS
  Run 4: PASS
  Run 5: PASS
  Run 6: PASS
  Run 7: PASS
  Run 8: PASS
  Run 9: DSLQueriesTest.basic:234->queryAssert:256->assertSearchResult:656 expected
object to not be null
  Run 10: DSLQueriesTest.basic:234->queryAssert:256->assertSearchResult:656 expected
object to not be null
  Run 11: DSLQueriesTest.basic:234->queryAssert:256->assertSearchResult:658 hive_column
where hive_column isa PII select hive_column.qualifiedName expected [4] but found [0]
  Run 12: PASS
  Run 13: PASS
  Run 14: PASS
  Run 15: PASS
  Run 16: PASS
  Run 17: PASS
  Run 18: PASS
  Run 19: PASS
  Run 20: PASS
  Run 21: PASS
  Run 22: PASS
  Run 23: PASS
  Run 24: DSLQueriesTest.basic:234->queryAssert:256->assertSearchResult:656 expected
object to not be null
  Run 25: DSLQueriesTest.basic:234->queryAssert:256->assertSearchResult:656 expected
object to not be null
  Run 26: DSLQueriesTest.basic:234->queryAssert:256->assertSearchResult:656 expected
object to not be null
  Run 27: DSLQueriesTest.basic:234->queryAssert:256->assertSearchResult:656 expected
object to not be null
  Run 28: DSLQueriesTest.basic:234->queryAssert:256->assertSearchResult:656 expected
object to not be null
  Run 29: DSLQueriesTest.basic:234->queryAssert:256->assertSearchResult:656 expected
object to not be null
  Run 30: PASS
  Run 31: PASS

org.apache.atlas.query.DSLQueriesTest.syntax(org.apache.atlas.query.DSLQueriesTest)
  Run 1: PASS
  Run 2: PASS
  Run 3: PASS
  Run 4: PASS
  Run 5: PASS
  Run 6: PASS
  Run 7: PASS
  Run 8: PASS
  Run 9: PASS
  Run 10: PASS
  Run 11: PASS
  Run 12: PASS
  Run 13: PASS
  Run 14: PASS
  Run 15: PASS
  Run 16: PASS
  Run 17: PASS
  Run 18: PASS
  Run 19: PASS
  Run 20: PASS
  Run 21: PASS
  Run 22: PASS
  Run 23: PASS
  Run 24: PASS
  Run 25: PASS
  Run 26: DSLQueriesTest.syntax:368->queryAssert:256->assertSearchResult:656 expected
object to not be null
  Run 27: DSLQueriesTest.syntax:368->queryAssert:256->assertSearchResult:656 expected
object to not be null
  Run 28: DSLQueriesTest.syntax:368->queryAssert:256->assertSearchResult:656 expected
object to not be null
  Run 29: DSLQueriesTest.syntax:368->queryAssert:256->assertSearchResult:656 expected
object to not be null
  Run 30: DSLQueriesTest.syntax:368->queryAssert:256->assertSearchResult:656 expected
object to not be null
  Run 31: PASS
  Run 32: DSLQueriesTest.syntax:368->queryAssert:256->assertSearchResult:656 expected
object to not be null
  Run 33: DSLQueriesTest.syntax:368->queryAssert:256->assertSearchResult:656 expected
object to not be null
  Run 34: DSLQueriesTest.syntax:368->queryAssert:256->assertSearchResult:656 expected
object to not be null
  Run 35: PASS
  Run 36: PASS
  Run 37: PASS
  Run 38: PASS
  Run 39: PASS
  Run 40: PASS
  Run 41: PASS
  Run 42: PASS
  Run 43: PASS
  Run 44: PASS
  Run 45: PASS
  Run 46: PASS
  Run 47: PASS
  Run 48: PASS
  Run 49: PASS
  Run 50: PASS
  Run 51: PASS
  Run 52: PASS
  Run 53: PASS
  Run 54: PASS
  Run 55: PASS
  Run 56: PASS
  Run 57: PASS
  Run 58: PASS
  Run 59: PASS
  Run 60: PASS
  Run 61: PASS
  Run 62: PASS
  Run 63: PASS
  Run 64: PASS
  Run 65: PASS
  Run 66: PASS
  Run 67: PASS
  Run 68: PASS
  Run 69: PASS
  Run 70: PASS


Tests run: 351, Failures: 2, Errors: 0, Skipped: 0

[INFO] ------------------------------------------------------------------------
[INFO] Reactor Summary:
[INFO] 
[INFO] Apache Atlas Server Build Tools .................... SUCCESS [  0.907 s]
[INFO] apache-atlas ....................................... SUCCESS [  3.849 s]
[INFO] Apache Atlas Test Utility Tools .................... SUCCESS [  4.901 s]
[INFO] Open Connector Framework (OCF) ..................... SUCCESS [  1.740 s]
[INFO] Apache Atlas Integration ........................... SUCCESS [ 45.019 s]
[INFO] Apache Atlas Common ................................ SUCCESS [  2.576 s]
[INFO] Apache Atlas Client ................................ SUCCESS [  0.204 s]
[INFO] atlas-client-common ................................ SUCCESS [  0.951 s]
[INFO] atlas-client-v1 .................................... SUCCESS [  3.287 s]
[INFO] Apache Atlas Server API ............................ SUCCESS [  0.939 s]
[INFO] Apache Atlas Notification .......................... SUCCESS [ 12.739 s]
[INFO] atlas-client-v2 .................................... SUCCESS [  0.693 s]
[INFO] Apache Atlas Graph Database Projects ............... SUCCESS [  0.107 s]
[INFO] Apache Atlas Graph Database API .................... SUCCESS [  0.757 s]
[INFO] Graph Database Common Code ......................... SUCCESS [  0.783 s]
[INFO] Apache Atlas JanusGraph DB Impl .................... SUCCESS [01:43 min]
[INFO] Apache Atlas Graph Database Implementation Dependencies SUCCESS [  1.689 s]
[INFO] Shaded version of Apache hbase client .............. SUCCESS [  8.506 s]
[INFO] Apache Atlas Titan 0.5.4 Graph DB Impl ............. SUCCESS [ 28.519 s]
[INFO] Shaded version of Apache hbase server .............. SUCCESS [ 21.771 s]
[INFO] Apache Atlas Authorization ......................... SUCCESS [  2.644 s]
[INFO] Apache Atlas Repository ............................ FAILURE [02:31 min]
[INFO] Apache Atlas UI .................................... SKIPPED
[INFO] Apache Atlas Web Application ....................... SKIPPED
[INFO] Apache Atlas Documentation ......................... SKIPPED
[INFO] Apache Atlas FileSystem Model ...................... SKIPPED
[INFO] Apache Atlas Plugin Classloader .................... SKIPPED
[INFO] Apache Atlas Hive Bridge Shim ...................... SKIPPED
[INFO] Apache Atlas Hive Bridge ........................... SKIPPED
[INFO] Apache Atlas Falcon Bridge Shim .................... SKIPPED
[INFO] Apache Atlas Falcon Bridge ......................... SKIPPED
[INFO] Apache Atlas Sqoop Bridge Shim ..................... SKIPPED
[INFO] Apache Atlas Sqoop Bridge .......................... SKIPPED
[INFO] Apache Atlas Storm Bridge Shim ..................... SKIPPED
[INFO] Apache Atlas Storm Bridge .......................... SKIPPED
[INFO] Apache Atlas Hbase Bridge Shim ..................... SKIPPED
[INFO] Apache Atlas Hbase Bridge .......................... SKIPPED
[INFO] Apache Atlas Distribution .......................... SKIPPED
[INFO] ------------------------------------------------------------------------
[INFO] BUILD FAILURE
[INFO] ------------------------------------------------------------------------
[INFO] Total time: 06:38 min
[INFO] Finished at: 2018-03-02T07:20:52Z
[INFO] Final Memory: 139M/1949M
[INFO] ------------------------------------------------------------------------
[ERROR] Failed to execute goal org.apache.maven.plugins:maven-surefire-plugin:2.18.1:test
(default-test) on project atlas-repository: There are test failures.
[ERROR] 
[ERROR] Please refer to <https://builds.apache.org/job/PreCommit-ATLAS-Build-Test/ws/repository/target/surefire-reports>
for the individual test results.
[ERROR] -> [Help 1]
[ERROR] 
[ERROR] To see the full stack trace of the errors, re-run Maven with the -e switch.
[ERROR] Re-run Maven using the -X switch to enable full debug logging.
[ERROR] 
[ERROR] For more information about the errors and possible solutions, please read the following
articles:
[ERROR] [Help 1] http://cwiki.apache.org/confluence/display/MAVEN/MojoFailureException
[ERROR] 
[ERROR] After correcting the problems, you can resume the build with the command
[ERROR]   mvn <goals> -rf :atlas-repository




{color:green}+1 overall{color}.  

    {color:green}+1 @author{color}.  The patch does not contain any @author tags.

Test results: https://builds.apache.org/job/PreCommit-ATLAS-Build-Test/132//testReport/
Console output: https://builds.apache.org/job/PreCommit-ATLAS-Build-Test/132//console

This message is automatically generated.


======================================================================
======================================================================
    Adding comment to Jira.
======================================================================
======================================================================




======================================================================
======================================================================
    Finished build.
======================================================================
======================================================================


+ EXIT_CODE=0
+ '[' -d <https://builds.apache.org/job/PreCommit-ATLAS-Build-Test/ws/../atlas_patchprocess_15370>
']'
+ '[' -d <https://builds.apache.org/job/PreCommit-ATLAS-Build-Test/ws/atlas_patchprocess_15370>
']'
+ mv <https://builds.apache.org/job/PreCommit-ATLAS-Build-Test/ws/atlas_patchprocess_15370>
<https://builds.apache.org/job/PreCommit-ATLAS-Build-Test/ws/patchprocess>
+ rm -f <https://builds.apache.org/job/PreCommit-ATLAS-Build-Test/ws/../atlas_patchprocess_15370>
+ exit 0
[description-setter] Description set: Use-vertex-centric-indexes-to-retrieve-classificatio.2.patch
Set build name.
New build name is '#132-master-Use-vertex-centric-indexes-to-retrieve-classificatio.2.patch'
Archiving artifacts
ERROR: No artifacts found that match the file pattern "distro/target/*.tar.gz, webapp/target/*.war".
Configuration error?
ERROR: ?distro/target/*.tar.gz? doesn?t match anything: ?distro? exists but not ?distro/target/*.tar.gz?
Build step 'Archive the artifacts' changed build result to FAILURE

Mime
View raw message