atlas-dev mailing list archives

Site index · List index
Message view « Date » · « Thread »
Top « Date » · « Thread »
From Apache Jenkins Server <jenk...@builds.apache.org>
Subject Build failed in Jenkins: Atlas-master-UnitTests #670
Date Sun, 04 Mar 2018 03:27:44 GMT
See <https://builds.apache.org/job/Atlas-master-UnitTests/670/display/redirect>

------------------------------------------
[...truncated 2.47 KB...]
+ mvn -version
Java HotSpot(TM) 64-Bit Server VM warning: ignoring option MaxPermSize=1024m; support was
removed in 8.0
Apache Maven 3.5.0 (ff8f5e7444045639af65f6095c62210b5713f426; 2017-04-03T19:39:06Z)
Maven home: /home/jenkins/tools/maven/latest
Java version: 1.8.0_144, vendor: Oracle Corporation
Java home: /usr/local/asfpackages/java/jdk1.8.0_144/jre
Default locale: en_US, platform encoding: UTF-8
OS name: "linux", version: "4.4.0-89-generic", arch: "amd64", family: "unix"
+ java -version
java version "1.8.0_144"
Java(TM) SE Runtime Environment (build 1.8.0_144-b01)
Java HotSpot(TM) 64-Bit Server VM (build 25.144-b01, mixed mode)
+ env
BUILD_URL=https://builds.apache.org/job/Atlas-master-UnitTests/670/
XDG_SESSION_ID=242
ROOT_BUILD_CAUSE_TIMERTRIGGER=true
HUDSON_SERVER_COOKIE=f4ebd1e6b0d976e8
SHELL=/bin/bash
SSH_CLIENT=62.210.60.235 59584 22
BUILD_TAG=jenkins-Atlas-master-UnitTests-670
GIT_PREVIOUS_COMMIT=45e38e8526eafe08e4450c4dc07e5be732123670
ROOT_BUILD_CAUSE=TIMERTRIGGER
WORKSPACE=<https://builds.apache.org/job/Atlas-master-UnitTests/ws/>
JOB_URL=https://builds.apache.org/job/Atlas-master-UnitTests/
RUN_CHANGES_DISPLAY_URL=https://builds.apache.org/job/Atlas-master-UnitTests/670/display/redirect?page=changes
USER=jenkins
GIT_AUTHOR_NAME=jenkins
GIT_COMMITTER_NAME=jenkins
MAVEN_OPTS=-Xmx4096m -XX:MaxPermSize=1024m -Dfile.encoding=UTF-8 -noverify
NLSPATH=/usr/dt/lib/nls/msg/%L/%N.cat
GIT_COMMIT=45e38e8526eafe08e4450c4dc07e5be732123670
JENKINS_HOME=/x1/jenkins/jenkins-home
MAIL=/var/mail/jenkins
PATH=/home/jenkins/tools/java/latest1.8/bin:/home/jenkins/tools/maven/latest/bin:/home/jenkins/tools/java/latest1.8/bin:/usr/local/sbin:/usr/local/bin:/usr/sbin:/usr/bin:/sbin:/bin:/usr/games:/usr/local/games
RUN_DISPLAY_URL=https://builds.apache.org/job/Atlas-master-UnitTests/670/display/redirect
GIT_COMMITTER_EMAIL=builds@apache.org
PWD=<https://builds.apache.org/job/Atlas-master-UnitTests/ws/>
JAVA_HOME=/home/jenkins/tools/java/latest1.8
HUDSON_URL=https://builds.apache.org/
LANG=en_US
JOB_NAME=Atlas-master-UnitTests
XFILESEARCHPATH=/usr/dt/app-defaults/%L/Dt
BUILD_DISPLAY_NAME=#670
BUILD_CAUSE=TIMERTRIGGER
BUILD_ID=670
JENKINS_URL=https://builds.apache.org/
WIN_LABEL=Windows
JOB_BASE_NAME=Atlas-master-UnitTests
GIT_PREVIOUS_SUCCESSFUL_COMMIT=45e38e8526eafe08e4450c4dc07e5be732123670
HOME=/home/jenkins
SHLVL=2
GIT_BRANCH=origin/master
EXECUTOR_NUMBER=0
JENKINS_SERVER_COOKIE=f4ebd1e6b0d976e8
GIT_URL=https://github.com/apache/atlas.git
NODE_LABELS=H18 Hadoop xenial
LOGNAME=jenkins
SSH_CONNECTION=62.210.60.235 59584 67.195.81.138 22
HUDSON_HOME=/x1/jenkins/jenkins-home
NODE_NAME=H18
BUILD_CAUSE_TIMERTRIGGER=true
NIX_LABEL=ubuntu
BUILD_NUMBER=670
JOB_DISPLAY_URL=https://builds.apache.org/job/Atlas-master-UnitTests/display/redirect
XDG_RUNTIME_DIR=/run/user/910
HUDSON_COOKIE=25ebc7f2-02fe-47df-ac6c-c796d712f9b3
GIT_AUTHOR_EMAIL=builds@apache.org
_=/usr/bin/env
+ mvn clean package -DskipITs
Java HotSpot(TM) 64-Bit Server VM warning: ignoring option MaxPermSize=1024m; support was
removed in 8.0
[INFO] Scanning for projects...
[WARNING] 
[WARNING] Some problems were encountered while building the effective model for org.apache.atlas:atlas-graphdb-titan0:jar:1.0.0-SNAPSHOT
[WARNING] 'dependencies.dependency.(groupId:artifactId:type:classifier)' must be unique: org.apache.solr:solr-solrj:jar
-> version (?) vs ${solr.version} @ org.apache.atlas:atlas-graphdb-titan0:[unknown-version],
<https://builds.apache.org/job/Atlas-master-UnitTests/ws/graphdb/titan0/pom.xml,> line
194, column 21
[WARNING] 'dependencies.dependency.(groupId:artifactId:type:classifier)' must be unique: org.apache.solr:solr-core:jar
-> version (?) vs ${solr.version} @ org.apache.atlas:atlas-graphdb-titan0:[unknown-version],
<https://builds.apache.org/job/Atlas-master-UnitTests/ws/graphdb/titan0/pom.xml,> line
200, column 21
[WARNING] 
[WARNING] Some problems were encountered while building the effective model for org.apache.atlas:hive-bridge:jar:1.0.0-SNAPSHOT
[WARNING] 'build.plugins.plugin.(groupId:artifactId)' must be unique but found duplicate declaration
of plugin org.apache.maven.plugins:maven-resources-plugin @ org.apache.atlas:hive-bridge:[unknown-version],
<https://builds.apache.org/job/Atlas-master-UnitTests/ws/addons/hive-bridge/pom.xml,>
line 478, column 21
[WARNING] 
[WARNING] Some problems were encountered while building the effective model for org.apache.atlas:falcon-bridge:jar:1.0.0-SNAPSHOT
[WARNING] 'build.plugins.plugin.(groupId:artifactId)' must be unique but found duplicate declaration
of plugin org.apache.maven.plugins:maven-resources-plugin @ org.apache.atlas:falcon-bridge:[unknown-version],
<https://builds.apache.org/job/Atlas-master-UnitTests/ws/addons/falcon-bridge/pom.xml,>
line 370, column 21
[WARNING] 
[WARNING] Some problems were encountered while building the effective model for org.apache.atlas:sqoop-bridge:jar:1.0.0-SNAPSHOT
[WARNING] 'build.plugins.plugin.(groupId:artifactId)' must be unique but found duplicate declaration
of plugin org.apache.maven.plugins:maven-resources-plugin @ org.apache.atlas:sqoop-bridge:[unknown-version],
<https://builds.apache.org/job/Atlas-master-UnitTests/ws/addons/sqoop-bridge/pom.xml,>
line 433, column 21
[WARNING] 
[WARNING] Some problems were encountered while building the effective model for org.apache.atlas:storm-bridge:jar:1.0.0-SNAPSHOT
[WARNING] 'build.plugins.plugin.(groupId:artifactId)' must be unique but found duplicate declaration
of plugin org.apache.maven.plugins:maven-resources-plugin @ org.apache.atlas:storm-bridge:[unknown-version],
<https://builds.apache.org/job/Atlas-master-UnitTests/ws/addons/storm-bridge/pom.xml,>
line 462, column 21
[WARNING] 
[WARNING] Some problems were encountered while building the effective model for org.apache.atlas:hbase-bridge:jar:1.0.0-SNAPSHOT
[WARNING] 'build.plugins.plugin.(groupId:artifactId)' must be unique but found duplicate declaration
of plugin org.apache.maven.plugins:maven-resources-plugin @ org.apache.atlas:hbase-bridge:[unknown-version],
<https://builds.apache.org/job/Atlas-master-UnitTests/ws/addons/hbase-bridge/pom.xml,>
line 508, column 21
[WARNING] 
[WARNING] It is highly recommended to fix these problems because they threaten the stability
of your build.
[WARNING] 
[WARNING] For this reason, future Maven versions might no longer support building such malformed
projects.
[WARNING] 
[WARNING] The project org.apache.atlas:apache-atlas:pom:1.0.0-SNAPSHOT uses prerequisites
which is only intended for maven-plugin projects but not for non maven-plugin projects. For
such purposes you should use the maven-enforcer-plugin. See https://maven.apache.org/enforcer/enforcer-rules/requireMavenVersion.html
[INFO] ------------------------------------------------------------------------
[INFO] Reactor Build Order:
[INFO] 
[INFO] Apache Atlas Server Build Tools
[INFO] apache-atlas
[INFO] Apache Atlas Test Utility Tools
[INFO] Open Connector Framework (OCF)
[INFO] Apache Atlas Integration
[INFO] Apache Atlas Common
[INFO] Apache Atlas Client
[INFO] atlas-client-common
[INFO] atlas-client-v1
[INFO] Apache Atlas Server API
[INFO] Apache Atlas Notification
[INFO] atlas-client-v2
[INFO] Apache Atlas Graph Database Projects
[INFO] Apache Atlas Graph Database API
[INFO] Graph Database Common Code
[INFO] Apache Atlas JanusGraph DB Impl
[INFO] Apache Atlas Graph Database Implementation Dependencies
[INFO] Shaded version of Apache hbase client
[INFO] Apache Atlas Titan 0.5.4 Graph DB Impl
[INFO] Shaded version of Apache hbase server
[INFO] Apache Atlas Authorization
[INFO] Apache Atlas Repository
[INFO] Apache Atlas UI
[INFO] Apache Atlas Web Application
[INFO] Apache Atlas Documentation
[INFO] Apache Atlas FileSystem Model
[INFO] Apache Atlas Plugin Classloader
[INFO] Apache Atlas Hive Bridge Shim
[INFO] Apache Atlas Hive Bridge
[INFO] Apache Atlas Falcon Bridge Shim
[INFO] Apache Atlas Falcon Bridge
[INFO] Apache Atlas Sqoop Bridge Shim
[INFO] Apache Atlas Sqoop Bridge
[INFO] Apache Atlas Storm Bridge Shim
[INFO] Apache Atlas Storm Bridge
[INFO] Apache Atlas Hbase Bridge Shim
[INFO] Apache Atlas Hbase Bridge
[INFO] Apache Atlas Distribution
[INFO] 
[INFO] ------------------------------------------------------------------------
[INFO] Building Apache Atlas Server Build Tools 1.0
[INFO] ------------------------------------------------------------------------
[INFO] 
[INFO] --- maven-clean-plugin:2.5:clean (default-clean) @ atlas-buildtools ---
[INFO] 
[INFO] --- maven-resources-plugin:2.6:resources (default-resources) @ atlas-buildtools ---
[WARNING] Using platform encoding (UTF-8 actually) to copy filtered resources, i.e. build
is platform dependent!
[INFO] Copying 6 resources
[INFO] 
[INFO] --- maven-compiler-plugin:3.1:compile (default-compile) @ atlas-buildtools ---
[INFO] No sources to compile
[INFO] 
[INFO] --- maven-resources-plugin:2.6:testResources (default-testResources) @ atlas-buildtools
---
[WARNING] Using platform encoding (UTF-8 actually) to copy filtered resources, i.e. build
is platform dependent!
[INFO] skip non existing resourceDirectory <https://builds.apache.org/job/Atlas-master-UnitTests/ws/build-tools/src/test/resources>
[INFO] 
[INFO] --- maven-compiler-plugin:3.1:testCompile (default-testCompile) @ atlas-buildtools
---
[INFO] No sources to compile
[INFO] 
[INFO] --- maven-surefire-plugin:2.12.4:test (default-test) @ atlas-buildtools ---
[INFO] No tests to run.
[INFO] 
[INFO] --- maven-jar-plugin:2.4:jar (default-jar) @ atlas-buildtools ---
[INFO] Building jar: <https://builds.apache.org/job/Atlas-master-UnitTests/ws/build-tools/target/atlas-buildtools-1.0.jar>
[INFO] 
[INFO] ------------------------------------------------------------------------
[INFO] Building apache-atlas 1.0.0-SNAPSHOT
[INFO] ------------------------------------------------------------------------
[INFO] 
[INFO] --- maven-clean-plugin:2.5:clean (default-clean) @ apache-atlas ---
[INFO] Deleting <https://builds.apache.org/job/Atlas-master-UnitTests/ws/> (includes
= [**/*.pyc], excludes = [])
[INFO] 
[INFO] --- maven-enforcer-plugin:3.0.0-M1:enforce (enforce-versions) @ apache-atlas ---
[WARNING] Rule 1: org.apache.maven.plugins.enforcer.RequireJavaVersion failed with message:
** JAVA VERSION ERROR ** Java 8 (Update 151) or above is required.
[INFO] ------------------------------------------------------------------------
[INFO] Reactor Summary:
[INFO] 
[INFO] Apache Atlas Server Build Tools .................... SUCCESS [  0.467 s]
[INFO] apache-atlas ....................................... FAILURE [  0.325 s]
[INFO] Apache Atlas Test Utility Tools .................... SKIPPED
[INFO] Open Connector Framework (OCF) ..................... SKIPPED
[INFO] Apache Atlas Integration ........................... SKIPPED
[INFO] Apache Atlas Common ................................ SKIPPED
[INFO] Apache Atlas Client ................................ SKIPPED
[INFO] atlas-client-common ................................ SKIPPED
[INFO] atlas-client-v1 .................................... SKIPPED
[INFO] Apache Atlas Server API ............................ SKIPPED
[INFO] Apache Atlas Notification .......................... SKIPPED
[INFO] atlas-client-v2 .................................... SKIPPED
[INFO] Apache Atlas Graph Database Projects ............... SKIPPED
[INFO] Apache Atlas Graph Database API .................... SKIPPED
[INFO] Graph Database Common Code ......................... SKIPPED
[INFO] Apache Atlas JanusGraph DB Impl .................... SKIPPED
[INFO] Apache Atlas Graph Database Implementation Dependencies SKIPPED
[INFO] Shaded version of Apache hbase client .............. SKIPPED
[INFO] Apache Atlas Titan 0.5.4 Graph DB Impl ............. SKIPPED
[INFO] Shaded version of Apache hbase server .............. SKIPPED
[INFO] Apache Atlas Authorization ......................... SKIPPED
[INFO] Apache Atlas Repository ............................ SKIPPED
[INFO] Apache Atlas UI .................................... SKIPPED
[INFO] Apache Atlas Web Application ....................... SKIPPED
[INFO] Apache Atlas Documentation ......................... SKIPPED
[INFO] Apache Atlas FileSystem Model ...................... SKIPPED
[INFO] Apache Atlas Plugin Classloader .................... SKIPPED
[INFO] Apache Atlas Hive Bridge Shim ...................... SKIPPED
[INFO] Apache Atlas Hive Bridge ........................... SKIPPED
[INFO] Apache Atlas Falcon Bridge Shim .................... SKIPPED
[INFO] Apache Atlas Falcon Bridge ......................... SKIPPED
[INFO] Apache Atlas Sqoop Bridge Shim ..................... SKIPPED
[INFO] Apache Atlas Sqoop Bridge .......................... SKIPPED
[INFO] Apache Atlas Storm Bridge Shim ..................... SKIPPED
[INFO] Apache Atlas Storm Bridge .......................... SKIPPED
[INFO] Apache Atlas Hbase Bridge Shim ..................... SKIPPED
[INFO] Apache Atlas Hbase Bridge .......................... SKIPPED
[INFO] Apache Atlas Distribution .......................... SKIPPED
[INFO] ------------------------------------------------------------------------
[INFO] BUILD FAILURE
[INFO] ------------------------------------------------------------------------
[INFO] Total time: 2.061 s
[INFO] Finished at: 2018-03-04T03:27:30Z
[INFO] Final Memory: 44M/1447M
[INFO] ------------------------------------------------------------------------
[ERROR] Failed to execute goal org.apache.maven.plugins:maven-enforcer-plugin:3.0.0-M1:enforce
(enforce-versions) on project apache-atlas: Some Enforcer rules have failed. Look above for
specific messages explaining why the rule failed. -> [Help 1]
[ERROR] 
[ERROR] To see the full stack trace of the errors, re-run Maven with the -e switch.
[ERROR] Re-run Maven using the -X switch to enable full debug logging.
[ERROR] 
[ERROR] For more information about the errors and possible solutions, please read the following
articles:
[ERROR] [Help 1] http://cwiki.apache.org/confluence/display/MAVEN/MojoExecutionException
[ERROR] 
[ERROR] After correcting the problems, you can resume the build with the command
[ERROR]   mvn <goals> -rf :apache-atlas
Build step 'Execute shell' marked build as failure
[CHECKSTYLE] Collecting checkstyle analysis files...
[CHECKSTYLE] Searching for all files in <https://builds.apache.org/job/Atlas-master-UnitTests/ws/>
that match the pattern **/target/checkstyle-result.xml
[CHECKSTYLE] No files found. Configuration error?
<Git Blamer> Using GitBlamer to create author and commit information for all warnings.
<Git Blamer> GIT_COMMIT=45e38e8526eafe08e4450c4dc07e5be732123670, workspace=<https://builds.apache.org/job/Atlas-master-UnitTests/ws/>
[CHECKSTYLE] Computing warning deltas based on reference build #669
[FINDBUGS] Collecting findbugs analysis files...
[FINDBUGS] Searching for all files in <https://builds.apache.org/job/Atlas-master-UnitTests/ws/>
that match the pattern **/target/findbugs.xml
[FINDBUGS] No files found. Configuration error?
<Git Blamer> Using GitBlamer to create author and commit information for all warnings.
<Git Blamer> GIT_COMMIT=45e38e8526eafe08e4450c4dc07e5be732123670, workspace=<https://builds.apache.org/job/Atlas-master-UnitTests/ws/>
[FINDBUGS] Computing warning deltas based on reference build #669
Archiving artifacts
TestNG Reports Processing: START
Looking for TestNG results report in workspace using pattern: **/target/surefire-reports/testng-results.xml,**/target/failsafe-reports/testng-results.xml
Did not find any matching files.

Mime
View raw message