atlas-dev mailing list archives

Site index · List index
Message view « Date » · « Thread »
Top « Date » · « Thread »
From Apache Jenkins Server <jenk...@builds.apache.org>
Subject Build failed in Jenkins: Atlas-master-IntegrationTests #825
Date Wed, 21 Mar 2018 16:15:37 GMT
See <https://builds.apache.org/job/Atlas-master-IntegrationTests/825/display/redirect?page=changes>

Changes:

[nixon] ATLAS-2504 : UI , Tag propagation : When an entity has the same tag

[nixon] ATLAS-2506 : Attributes of filters in the inner filter group are not

[kbhatt] ATLAS-2509 : updated frontend-maven-plugin to 1.4

------------------------------------------
[...truncated 657.13 KB...]
[INFO] Started Jetty Server
[INFO] 
[INFO] --- maven-failsafe-plugin:2.18.1:integration-test (integration-test) @ falcon-bridge
---
[WARNING] useSystemClassloader setting has no effect when not forking
[INFO] Failsafe report directory: <https://builds.apache.org/job/Atlas-master-IntegrationTests/ws/addons/falcon-bridge/target/failsafe-reports>
Running org.apache.atlas.falcon.hook.FalconHookIT
127.0.0.1 - - [21/Mar/2018:16:06:57 +0000] "GET //localhost:31000/api/atlas/entities?type=falcon_cluster&property=qualifiedName&value=clustery1iE7EQixX
HTTP/1.1" 404 106 "-" "Java/1.8.0_152"
127.0.0.1 - - [21/Mar/2018:16:06:57 +0000] "GET //localhost:31000/api/atlas/entities?type=falcon_cluster&property=qualifiedName&value=clustery1iE7EQixX
HTTP/1.1" 404 106 "-" "Java/1.8.0_152"
127.0.0.1 - - [21/Mar/2018:16:06:58 +0000] "GET //localhost:31000/api/atlas/entities?type=falcon_cluster&property=qualifiedName&value=clustery1iE7EQixX
HTTP/1.1" 404 106 "-" "Java/1.8.0_152"
127.0.0.1 - - [21/Mar/2018:16:06:58 +0000] "GET //localhost:31000/api/atlas/entities?type=falcon_cluster&property=qualifiedName&value=clustery1iE7EQixX
HTTP/1.1" 404 106 "-" "Java/1.8.0_152"
127.0.0.1 - - [21/Mar/2018:16:06:58 +0000] "GET //localhost:31000/api/atlas/entities?type=falcon_cluster&property=qualifiedName&value=clustery1iE7EQixX
HTTP/1.1" 404 106 "-" "Java/1.8.0_152"
127.0.0.1 - - [21/Mar/2018:16:06:59 +0000] "GET //localhost:31000/api/atlas/entities?type=falcon_cluster&property=qualifiedName&value=clustery1iE7EQixX
HTTP/1.1" 404 106 "-" "Java/1.8.0_152"
127.0.0.1 - - [21/Mar/2018:16:06:59 +0000] "GET //localhost:31000/api/atlas/entities?type=falcon_feed&property=qualifiedName&value=feedeIhWbszGBM@clusterR4b8MgCZt6
HTTP/1.1" 404 118 "-" "Java/1.8.0_152"
127.0.0.1 - - [21/Mar/2018:16:06:59 +0000] "GET //localhost:31000/api/atlas/entities?type=falcon_feed&property=qualifiedName&value=feedeIhWbszGBM@clusterR4b8MgCZt6
HTTP/1.1" 404 118 "-" "Java/1.8.0_152"
127.0.0.1 - - [21/Mar/2018:16:07:00 +0000] "GET //localhost:31000/api/atlas/entities?type=falcon_feed&property=qualifiedName&value=feedeIhWbszGBM@clusterR4b8MgCZt6
HTTP/1.1" 404 118 "-" "Java/1.8.0_152"
127.0.0.1 - - [21/Mar/2018:16:07:00 +0000] "GET //localhost:31000/api/atlas/entities?type=falcon_feed&property=qualifiedName&value=feedeIhWbszGBM@clusterR4b8MgCZt6
HTTP/1.1" 404 118 "-" "Java/1.8.0_152"
127.0.0.1 - - [21/Mar/2018:16:07:01 +0000] "GET //localhost:31000/api/atlas/entities?type=falcon_feed&property=qualifiedName&value=feedeIhWbszGBM@clusterR4b8MgCZt6
HTTP/1.1" 200 922 "-" "Java/1.8.0_152"
127.0.0.1 - - [21/Mar/2018:16:07:01 +0000] "GET //localhost:31000/api/atlas/entities?type=falcon_feed&property=qualifiedName&value=feedeIhWbszGBM@clusterR4b8MgCZt6
HTTP/1.1" 200 922 "-" "Java/1.8.0_152"
127.0.0.1 - - [21/Mar/2018:16:07:01 +0000] "GET //localhost:31000/api/atlas/entities/dcf82ea0-ccd7-4848-a7ab-28716d453454
HTTP/1.1" 200 922 "-" "Java/1.8.0_152"
127.0.0.1 - - [21/Mar/2018:16:07:01 +0000] "GET //localhost:31000/api/atlas/entities?type=falcon_feed_creation&property=qualifiedName&value=feedeIhWbszGBM@clusterR4b8MgCZt6
HTTP/1.1" 200 1265 "-" "Java/1.8.0_152"
127.0.0.1 - - [21/Mar/2018:16:07:01 +0000] "GET //localhost:31000/api/atlas/entities?type=falcon_feed_creation&property=qualifiedName&value=feedeIhWbszGBM@clusterR4b8MgCZt6
HTTP/1.1" 200 1265 "-" "Java/1.8.0_152"
127.0.0.1 - - [21/Mar/2018:16:07:01 +0000] "GET //localhost:31000/api/atlas/entities/303f411e-c79e-4705-bf23-a78284ce1783
HTTP/1.1" 200 1265 "-" "Java/1.8.0_152"
127.0.0.1 - - [21/Mar/2018:16:07:01 +0000] "GET //localhost:31000/api/atlas/entities/e895d669-cffd-446c-9dca-53a43a14f99e
HTTP/1.1" 200 1017 "-" "Java/1.8.0_152"
127.0.0.1 - - [21/Mar/2018:16:07:01 +0000] "GET //localhost:31000/api/atlas/entities?type=falcon_feed&property=qualifiedName&value=feedMgng1AG7QH@clusterR4b8MgCZt6
HTTP/1.1" 404 118 "-" "Java/1.8.0_152"
127.0.0.1 - - [21/Mar/2018:16:07:01 +0000] "GET //localhost:31000/api/atlas/entities?type=falcon_feed&property=qualifiedName&value=feedMgng1AG7QH@clusterR4b8MgCZt6
HTTP/1.1" 404 118 "-" "Java/1.8.0_152"
127.0.0.1 - - [21/Mar/2018:16:07:02 +0000] "GET //localhost:31000/api/atlas/entities?type=falcon_feed&property=qualifiedName&value=feedMgng1AG7QH@clusterR4b8MgCZt6
HTTP/1.1" 200 922 "-" "Java/1.8.0_152"
127.0.0.1 - - [21/Mar/2018:16:07:02 +0000] "GET //localhost:31000/api/atlas/entities?type=falcon_feed&property=qualifiedName&value=feedMgng1AG7QH@clusterR4b8MgCZt6
HTTP/1.1" 200 922 "-" "Java/1.8.0_152"
127.0.0.1 - - [21/Mar/2018:16:07:02 +0000] "GET //localhost:31000/api/atlas/entities/c0f402e6-5a3a-4188-a86b-6ee409b4a9a1
HTTP/1.1" 200 922 "-" "Java/1.8.0_152"
127.0.0.1 - - [21/Mar/2018:16:07:02 +0000] "GET //localhost:31000/api/atlas/entities?type=falcon_feed_creation&property=qualifiedName&value=feedMgng1AG7QH@clusterR4b8MgCZt6
HTTP/1.1" 200 1266 "-" "Java/1.8.0_152"
127.0.0.1 - - [21/Mar/2018:16:07:02 +0000] "GET //localhost:31000/api/atlas/entities?type=falcon_feed_creation&property=qualifiedName&value=feedMgng1AG7QH@clusterR4b8MgCZt6
HTTP/1.1" 200 1266 "-" "Java/1.8.0_152"
127.0.0.1 - - [21/Mar/2018:16:07:02 +0000] "GET //localhost:31000/api/atlas/entities/16e604d9-60f4-4a8b-b74e-900dbffc5a1f
HTTP/1.1" 200 1266 "-" "Java/1.8.0_152"
127.0.0.1 - - [21/Mar/2018:16:07:02 +0000] "GET //localhost:31000/api/atlas/entities/37020d4d-9459-4dd0-a2e1-83212a08c238
HTTP/1.1" 200 1126 "-" "Java/1.8.0_152"
127.0.0.1 - - [21/Mar/2018:16:07:02 +0000] "GET //localhost:31000/api/atlas/entities?type=falcon_feed&property=qualifiedName&value=feedMgng1AG7QH@clusterR4b8MgCZt6
HTTP/1.1" 200 922 "-" "Java/1.8.0_152"
127.0.0.1 - - [21/Mar/2018:16:07:02 +0000] "GET //localhost:31000/api/atlas/entities?type=falcon_process&property=qualifiedName&value=process3SXLzsTZZ9@clusterR4b8MgCZt6
HTTP/1.1" 404 124 "-" "Java/1.8.0_152"
127.0.0.1 - - [21/Mar/2018:16:07:02 +0000] "GET //localhost:31000/api/atlas/entities?type=falcon_process&property=qualifiedName&value=process3SXLzsTZZ9@clusterR4b8MgCZt6
HTTP/1.1" 200 1491 "-" "Java/1.8.0_152"
127.0.0.1 - - [21/Mar/2018:16:07:03 +0000] "GET //localhost:31000/api/atlas/entities?type=falcon_process&property=qualifiedName&value=process3SXLzsTZZ9@clusterR4b8MgCZt6
HTTP/1.1" 200 1491 "-" "Java/1.8.0_152"
127.0.0.1 - - [21/Mar/2018:16:07:03 +0000] "GET //localhost:31000/api/atlas/entities/c553c838-6188-43fb-9103-33122f9e0a9e
HTTP/1.1" 200 1491 "-" "Java/1.8.0_152"
127.0.0.1 - - [21/Mar/2018:16:07:03 +0000] "GET //localhost:31000/api/atlas/entities?type=falcon_cluster&property=qualifiedName&value=clusterKZPvDV6fON
HTTP/1.1" 404 106 "-" "Java/1.8.0_152"
127.0.0.1 - - [21/Mar/2018:16:07:03 +0000] "GET //localhost:31000/api/atlas/entities?type=falcon_cluster&property=qualifiedName&value=clusterKZPvDV6fON
HTTP/1.1" 200 703 "-" "Java/1.8.0_152"
127.0.0.1 - - [21/Mar/2018:16:07:03 +0000] "GET //localhost:31000/api/atlas/entities?type=falcon_cluster&property=qualifiedName&value=clusterKZPvDV6fON
HTTP/1.1" 200 703 "-" "Java/1.8.0_152"
127.0.0.1 - - [21/Mar/2018:16:07:03 +0000] "GET //localhost:31000/api/atlas/entities?type=falcon_cluster&property=qualifiedName&value=clusterWCVCbRU6TR
HTTP/1.1" 404 106 "-" "Java/1.8.0_152"
127.0.0.1 - - [21/Mar/2018:16:07:04 +0000] "GET //localhost:31000/api/atlas/entities?type=falcon_cluster&property=qualifiedName&value=clusterWCVCbRU6TR
HTTP/1.1" 200 703 "-" "Java/1.8.0_152"
127.0.0.1 - - [21/Mar/2018:16:07:04 +0000] "GET //localhost:31000/api/atlas/entities?type=falcon_cluster&property=qualifiedName&value=clusterWCVCbRU6TR
HTTP/1.1" 200 703 "-" "Java/1.8.0_152"
127.0.0.1 - - [21/Mar/2018:16:07:04 +0000] "GET //localhost:31000/api/atlas/entities?type=falcon_feed&property=qualifiedName&value=feedCwUDQ0uont@clusterKZPvDV6fON
HTTP/1.1" 404 118 "-" "Java/1.8.0_152"
127.0.0.1 - - [21/Mar/2018:16:07:04 +0000] "GET //localhost:31000/api/atlas/entities?type=falcon_feed&property=qualifiedName&value=feedCwUDQ0uont@clusterKZPvDV6fON
HTTP/1.1" 404 118 "-" "Java/1.8.0_152"
127.0.0.1 - - [21/Mar/2018:16:07:05 +0000] "GET //localhost:31000/api/atlas/entities?type=falcon_feed&property=qualifiedName&value=feedCwUDQ0uont@clusterKZPvDV6fON
HTTP/1.1" 200 922 "-" "Java/1.8.0_152"
127.0.0.1 - - [21/Mar/2018:16:07:05 +0000] "GET //localhost:31000/api/atlas/entities?type=falcon_feed&property=qualifiedName&value=feedCwUDQ0uont@clusterKZPvDV6fON
HTTP/1.1" 200 922 "-" "Java/1.8.0_152"
127.0.0.1 - - [21/Mar/2018:16:07:05 +0000] "GET //localhost:31000/api/atlas/entities/e5561264-da94-484c-8611-389cd8240399
HTTP/1.1" 200 922 "-" "Java/1.8.0_152"
127.0.0.1 - - [21/Mar/2018:16:07:05 +0000] "GET //localhost:31000/api/atlas/entities?type=falcon_feed_creation&property=qualifiedName&value=feedCwUDQ0uont@clusterKZPvDV6fON
HTTP/1.1" 200 1266 "-" "Java/1.8.0_152"
127.0.0.1 - - [21/Mar/2018:16:07:05 +0000] "GET //localhost:31000/api/atlas/entities?type=falcon_feed_creation&property=qualifiedName&value=feedCwUDQ0uont@clusterKZPvDV6fON
HTTP/1.1" 200 1266 "-" "Java/1.8.0_152"
127.0.0.1 - - [21/Mar/2018:16:07:05 +0000] "GET //localhost:31000/api/atlas/entities/d76b8186-d404-43f2-be5a-9333ece5a57b
HTTP/1.1" 200 1266 "-" "Java/1.8.0_152"
127.0.0.1 - - [21/Mar/2018:16:07:05 +0000] "GET //localhost:31000/api/atlas/entities/0d6350a4-831d-41cb-a1c5-f1f5b03f4c37
HTTP/1.1" 200 1126 "-" "Java/1.8.0_152"
127.0.0.1 - - [21/Mar/2018:16:07:05 +0000] "GET //localhost:31000/api/atlas/entities?type=falcon_feed&property=qualifiedName&value=feedCwUDQ0uont@clusterWCVCbRU6TR
HTTP/1.1" 200 922 "-" "Java/1.8.0_152"
127.0.0.1 - - [21/Mar/2018:16:07:05 +0000] "GET //localhost:31000/api/atlas/entities?type=falcon_feed&property=qualifiedName&value=feedCwUDQ0uont@clusterWCVCbRU6TR
HTTP/1.1" 200 922 "-" "Java/1.8.0_152"
127.0.0.1 - - [21/Mar/2018:16:07:05 +0000] "GET //localhost:31000/api/atlas/entities/20214980-d860-4c43-8b8b-3e3a0a162be2
HTTP/1.1" 200 922 "-" "Java/1.8.0_152"
127.0.0.1 - - [21/Mar/2018:16:07:05 +0000] "GET //localhost:31000/api/atlas/entities?type=falcon_feed_creation&property=qualifiedName&value=feedCwUDQ0uont@clusterWCVCbRU6TR
HTTP/1.1" 200 1266 "-" "Java/1.8.0_152"
127.0.0.1 - - [21/Mar/2018:16:07:05 +0000] "GET //localhost:31000/api/atlas/entities?type=falcon_feed_creation&property=qualifiedName&value=feedCwUDQ0uont@clusterWCVCbRU6TR
HTTP/1.1" 200 1266 "-" "Java/1.8.0_152"
127.0.0.1 - - [21/Mar/2018:16:07:05 +0000] "GET //localhost:31000/api/atlas/entities/7f1dc98a-9648-4540-8844-640f9a09791e
HTTP/1.1" 200 1266 "-" "Java/1.8.0_152"
127.0.0.1 - - [21/Mar/2018:16:07:05 +0000] "GET //localhost:31000/api/atlas/entities/ff8bd48a-1bbd-4803-b7ce-9dbb9ef67370
HTTP/1.1" 200 1126 "-" "Java/1.8.0_152"
127.0.0.1 - - [21/Mar/2018:16:07:05 +0000] "GET //localhost:31000/api/atlas/entities?type=falcon_feed&property=qualifiedName&value=feedCwUDQ0uont@clusterKZPvDV6fON
HTTP/1.1" 200 922 "-" "Java/1.8.0_152"
127.0.0.1 - - [21/Mar/2018:16:07:05 +0000] "GET //localhost:31000/api/atlas/entities?type=falcon_feed&property=qualifiedName&value=feedCwUDQ0uont@clusterWCVCbRU6TR
HTTP/1.1" 200 922 "-" "Java/1.8.0_152"
127.0.0.1 - - [21/Mar/2018:16:07:05 +0000] "GET //localhost:31000/api/atlas/entities?type=falcon_feed_replication&property=qualifiedName&value=feedCwUDQ0uont
HTTP/1.1" 200 1039 "-" "Java/1.8.0_152"
127.0.0.1 - - [21/Mar/2018:16:07:05 +0000] "GET //localhost:31000/api/atlas/entities?type=falcon_feed_replication&property=qualifiedName&value=feedCwUDQ0uont
HTTP/1.1" 200 1039 "-" "Java/1.8.0_152"
127.0.0.1 - - [21/Mar/2018:16:07:05 +0000] "GET //localhost:31000/api/atlas/entities/29a49cae-a4bf-4e75-aca5-9f13d7284b29
HTTP/1.1" 200 1039 "-" "Java/1.8.0_152"
Tests run: 3, Failures: 1, Errors: 0, Skipped: 0, Time elapsed: 10.589 sec <<< FAILURE!
- in org.apache.atlas.falcon.hook.FalconHookIT
testCreateProcess(org.apache.atlas.falcon.hook.FalconHookIT)  Time elapsed: 2.96 sec  <<<
FAILURE!
java.lang.AssertionError: Assertions failed. Failing after waiting for timeout 2000 msecs
	at org.apache.atlas.AtlasBaseClient.callAPIWithResource(AtlasBaseClient.java:388)
	at org.apache.atlas.AtlasBaseClient.callAPIWithResource(AtlasBaseClient.java:323)
	at org.apache.atlas.AtlasBaseClient.callAPIWithRetries(AtlasBaseClient.java:472)
	at org.apache.atlas.AtlasClient.callAPIWithRetries(AtlasClient.java:931)
	at org.apache.atlas.AtlasClient.getEntity(AtlasClient.java:640)
	at org.apache.atlas.falcon.hook.FalconHookIT$1.evaluate(FalconHookIT.java:310)
	at org.apache.atlas.falcon.hook.FalconHookIT.waitFor(FalconHookIT.java:340)
	at org.apache.atlas.falcon.hook.FalconHookIT.assertEntityIsRegistered(FalconHookIT.java:307)
	at org.apache.atlas.falcon.hook.FalconHookIT.assertClusterIsRegistered(FalconHookIT.java:161)
	at org.apache.atlas.falcon.hook.FalconHookIT.testCreateProcess(FalconHookIT.java:130)


Results :

Failed tests: 
  FalconHookIT.testCreateProcess:130->assertClusterIsRegistered:161->assertEntityIsRegistered:307->waitFor:344
Assertions failed. Failing after waiting for timeout 2000 msecs

Tests run: 3, Failures: 1, Errors: 0, Skipped: 0

[INFO] 
[INFO] --- jetty-maven-plugin:9.3.14.v20161028:stop (stop-jetty) @ falcon-bridge ---
[INFO] Waiting 10 seconds for jetty to stop
[INFO] Stopped ServerConnector@8810ce6{HTTP/1.1,[http/1.1]}{0.0.0.0:31000}
[INFO] Closing Spring root WebApplicationContext
[INFO] Shutting down log4j
[INFO] Stopped o.e.j.m.p.JettyWebAppContext@42b38631{/,file://<https://builds.apache.org/job/Atlas-master-IntegrationTests/ws/webapp/target/atlas-webapp-1.0.0-SNAPSHOT/,UNAVAILABLE}{/home/jenkins/jenkins-slave/workspace/Atlas-master-IntegrationTests/webapp/target/atlas-webapp-1.0.0-SNAPSHOT.war}>
[INFO] Server reports itself as stopped
[INFO] 
[INFO] --- maven-antrun-plugin:1.7:run (default) @ falcon-bridge ---
[WARNING] Parameter tasks is deprecated, use target instead
[INFO] Executing tasks

main:
   [delete] Deleting directory <https://builds.apache.org/job/Atlas-master-IntegrationTests/ws/addons/hive-bridge/target/data>
   [delete] Deleting directory <https://builds.apache.org/job/Atlas-master-IntegrationTests/ws/addons/hive-bridge/target/logs>
[INFO] Executed tasks
[INFO] 
[INFO] --- maven-source-plugin:2.4:jar-no-fork (attach-sources) @ falcon-bridge ---
[INFO] Building jar: <https://builds.apache.org/job/Atlas-master-IntegrationTests/ws/addons/falcon-bridge/target/falcon-bridge-1.0.0-SNAPSHOT-sources.jar>
[INFO] 
[INFO] --- maven-source-plugin:2.4:test-jar-no-fork (attach-sources) @ falcon-bridge ---
[INFO] Building jar: <https://builds.apache.org/job/Atlas-master-IntegrationTests/ws/addons/falcon-bridge/target/falcon-bridge-1.0.0-SNAPSHOT-test-sources.jar>
[INFO] 
[INFO] --- maven-failsafe-plugin:2.18.1:verify (verify) @ falcon-bridge ---
[INFO] Failsafe report directory: <https://builds.apache.org/job/Atlas-master-IntegrationTests/ws/addons/falcon-bridge/target/failsafe-reports>
[INFO] ------------------------------------------------------------------------
[INFO] Reactor Summary:
[INFO] 
[INFO] Apache Atlas Server Build Tools .................... SUCCESS [  0.567 s]
[INFO] apache-atlas ....................................... SUCCESS [  4.058 s]
[INFO] Apache Atlas Test Utility Tools .................... SUCCESS [ 10.416 s]
[INFO] Open Connector Framework (OCF) ..................... SUCCESS [ 10.725 s]
[INFO] Apache Atlas Integration ........................... SUCCESS [ 18.223 s]
[INFO] Apache Atlas Common ................................ SUCCESS [  7.686 s]
[INFO] Apache Atlas Client ................................ SUCCESS [  1.012 s]
[INFO] atlas-client-common ................................ SUCCESS [  6.010 s]
[INFO] atlas-client-v1 .................................... SUCCESS [  6.480 s]
[INFO] Apache Atlas Server API ............................ SUCCESS [  5.489 s]
[INFO] Apache Atlas Notification .......................... SUCCESS [  7.937 s]
[INFO] atlas-client-v2 .................................... SUCCESS [  5.288 s]
[INFO] Apache Atlas Graph Database Projects ............... SUCCESS [  0.414 s]
[INFO] Apache Atlas Graph Database API .................... SUCCESS [  5.249 s]
[INFO] Graph Database Common Code ......................... SUCCESS [  4.875 s]
[INFO] Apache Atlas JanusGraph DB Impl .................... SUCCESS [ 11.439 s]
[INFO] Apache Atlas Graph Database Implementation Dependencies SUCCESS [  1.992 s]
[INFO] Shaded version of Apache hbase client .............. SUCCESS [  7.534 s]
[INFO] Apache Atlas Titan 0.5.4 Graph DB Impl ............. SUCCESS [ 38.277 s]
[INFO] Shaded version of Apache hbase server .............. SUCCESS [ 20.972 s]
[INFO] Apache Atlas Authorization ......................... SUCCESS [  6.108 s]
[INFO] Apache Atlas Repository ............................ SUCCESS [ 26.199 s]
[INFO] Apache Atlas UI .................................... SUCCESS [01:09 min]
[INFO] Apache Atlas Web Application ....................... SUCCESS [04:01 min]
[INFO] Apache Atlas Documentation ......................... SUCCESS [  3.088 s]
[INFO] Apache Atlas FileSystem Model ...................... SUCCESS [  2.049 s]
[INFO] Apache Atlas Plugin Classloader .................... SUCCESS [  5.587 s]
[INFO] Apache Atlas Hive Bridge Shim ...................... SUCCESS [  4.891 s]
[INFO] Apache Atlas Hive Bridge ........................... SUCCESS [08:01 min]
[INFO] Apache Atlas Falcon Bridge Shim .................... SUCCESS [  5.374 s]
[INFO] Apache Atlas Falcon Bridge ......................... FAILURE [ 59.436 s]
[INFO] Apache Atlas Sqoop Bridge Shim ..................... SKIPPED
[INFO] Apache Atlas Sqoop Bridge .......................... SKIPPED
[INFO] Apache Atlas Storm Bridge Shim ..................... SKIPPED
[INFO] Apache Atlas Storm Bridge .......................... SKIPPED
[INFO] Apache Atlas Hbase Bridge Shim ..................... SKIPPED
[INFO] Apache Atlas Hbase Bridge .......................... SKIPPED
[INFO] Apache Atlas Distribution .......................... SKIPPED
[INFO] ------------------------------------------------------------------------
[INFO] BUILD FAILURE
[INFO] ------------------------------------------------------------------------
[INFO] Total time: 18:00 min
[INFO] Finished at: 2018-03-21T16:07:08Z
[INFO] Final Memory: 757M/3274M
[INFO] ------------------------------------------------------------------------
log4j:WARN No appenders could be found for logger (org.apache.zookeeper.server.NIOServerCnxnFactory).
log4j:WARN Please initialize the log4j system properly.
log4j:WARN See http://logging.apache.org/log4j/1.2/faq.html#noconfig for more info.
[ERROR] Failed to execute goal org.apache.maven.plugins:maven-failsafe-plugin:2.18.1:verify
(verify) on project falcon-bridge: There are test failures.
[ERROR] 
[ERROR] Please refer to <https://builds.apache.org/job/Atlas-master-IntegrationTests/ws/addons/falcon-bridge/target/failsafe-reports>
for the individual test results.
[ERROR] -> [Help 1]
[ERROR] 
[ERROR] To see the full stack trace of the errors, re-run Maven with the -e switch.
[ERROR] Re-run Maven using the -X switch to enable full debug logging.
[ERROR] 
[ERROR] For more information about the errors and possible solutions, please read the following
articles:
[ERROR] [Help 1] http://cwiki.apache.org/confluence/display/MAVEN/MojoFailureException
[ERROR] 
[ERROR] After correcting the problems, you can resume the build with the command
[ERROR]   mvn <goals> -rf :falcon-bridge
Build step 'Execute shell' marked build as failure
[CHECKSTYLE] Collecting checkstyle analysis files...
[CHECKSTYLE] Searching for all files in <https://builds.apache.org/job/Atlas-master-IntegrationTests/ws/>
that match the pattern **/target/checkstyle-result.xml
[CHECKSTYLE] Parsing 29 files in <https://builds.apache.org/job/Atlas-master-IntegrationTests/ws/>
[CHECKSTYLE] Successfully parsed file <https://builds.apache.org/job/Atlas-master-IntegrationTests/ws/addons/falcon-bridge-shim/target/checkstyle-result.xml>
with 29 unique warnings and 0 duplicates.
[CHECKSTYLE] Successfully parsed file <https://builds.apache.org/job/Atlas-master-IntegrationTests/ws/addons/hdfs-model/target/checkstyle-result.xml>
with 29 unique warnings and 0 duplicates.
[CHECKSTYLE] Successfully parsed file <https://builds.apache.org/job/Atlas-master-IntegrationTests/ws/addons/hive-bridge-shim/target/checkstyle-result.xml>
with 44 unique warnings and 0 duplicates.
[CHECKSTYLE] Successfully parsed file <https://builds.apache.org/job/Atlas-master-IntegrationTests/ws/addons/hive-bridge/target/checkstyle-result.xml>
with 2224 unique warnings and 0 duplicates.
[CHECKSTYLE] Successfully parsed file <https://builds.apache.org/job/Atlas-master-IntegrationTests/ws/authorization/target/checkstyle-result.xml>
with 2890 unique warnings and 0 duplicates.
[CHECKSTYLE] Successfully parsed file <https://builds.apache.org/job/Atlas-master-IntegrationTests/ws/client/client-v1/target/checkstyle-result.xml>
with 3774 unique warnings and 0 duplicates.
[CHECKSTYLE] Successfully parsed file <https://builds.apache.org/job/Atlas-master-IntegrationTests/ws/client/client-v2/target/checkstyle-result.xml>
with 4133 unique warnings and 0 duplicates.
[CHECKSTYLE] Successfully parsed file <https://builds.apache.org/job/Atlas-master-IntegrationTests/ws/client/common/target/checkstyle-result.xml>
with 4621 unique warnings and 0 duplicates.
[CHECKSTYLE] Successfully parsed file <https://builds.apache.org/job/Atlas-master-IntegrationTests/ws/client/target/checkstyle-result.xml>
with 4621 unique warnings and 0 duplicates.
[CHECKSTYLE] Successfully parsed file <https://builds.apache.org/job/Atlas-master-IntegrationTests/ws/common/target/checkstyle-result.xml>
with 5652 unique warnings and 0 duplicates.
[CHECKSTYLE] Successfully parsed file <https://builds.apache.org/job/Atlas-master-IntegrationTests/ws/dashboardv2/target/checkstyle-result.xml>
with 5652 unique warnings and 0 duplicates.
[CHECKSTYLE] Successfully parsed file <https://builds.apache.org/job/Atlas-master-IntegrationTests/ws/docs/target/checkstyle-result.xml>
with 5652 unique warnings and 0 duplicates.
[CHECKSTYLE] Successfully parsed file <https://builds.apache.org/job/Atlas-master-IntegrationTests/ws/graphdb/api/target/checkstyle-result.xml>
with 5944 unique warnings and 0 duplicates.
[CHECKSTYLE] Successfully parsed file <https://builds.apache.org/job/Atlas-master-IntegrationTests/ws/graphdb/common/target/checkstyle-result.xml>
with 6153 unique warnings and 0 duplicates.
[CHECKSTYLE] Successfully parsed file <https://builds.apache.org/job/Atlas-master-IntegrationTests/ws/graphdb/graphdb-impls/target/checkstyle-result.xml>
with 6153 unique warnings and 0 duplicates.
[CHECKSTYLE] Successfully parsed file <https://builds.apache.org/job/Atlas-master-IntegrationTests/ws/graphdb/janus/target/checkstyle-result.xml>
with 7199 unique warnings and 0 duplicates.
[CHECKSTYLE] Successfully parsed file <https://builds.apache.org/job/Atlas-master-IntegrationTests/ws/graphdb/target/checkstyle-result.xml>
with 7199 unique warnings and 0 duplicates.
[CHECKSTYLE] Successfully parsed file <https://builds.apache.org/job/Atlas-master-IntegrationTests/ws/graphdb/titan0/target/checkstyle-result.xml>
with 9697 unique warnings and 0 duplicates.
[CHECKSTYLE] Successfully parsed file <https://builds.apache.org/job/Atlas-master-IntegrationTests/ws/intg/target/checkstyle-result.xml>
with 20640 unique warnings and 0 duplicates.
[CHECKSTYLE] Successfully parsed file <https://builds.apache.org/job/Atlas-master-IntegrationTests/ws/notification/target/checkstyle-result.xml>
with 21876 unique warnings and 0 duplicates.
[CHECKSTYLE] Successfully parsed file <https://builds.apache.org/job/Atlas-master-IntegrationTests/ws/om-fwk-ocf/target/checkstyle-result.xml>
with 26606 unique warnings and 0 duplicates.
[CHECKSTYLE] Successfully parsed file <https://builds.apache.org/job/Atlas-master-IntegrationTests/ws/plugin-classloader/target/checkstyle-result.xml>
with 26719 unique warnings and 0 duplicates.
[CHECKSTYLE] Successfully parsed file <https://builds.apache.org/job/Atlas-master-IntegrationTests/ws/repository/target/checkstyle-result.xml>
with 46018 unique warnings and 0 duplicates.
[CHECKSTYLE] Successfully parsed file <https://builds.apache.org/job/Atlas-master-IntegrationTests/ws/server-api/target/checkstyle-result.xml>
with 46164 unique warnings and 0 duplicates.
[CHECKSTYLE] Successfully parsed file <https://builds.apache.org/job/Atlas-master-IntegrationTests/ws/shaded/hbase-client-shaded/target/checkstyle-result.xml>
with 46164 unique warnings and 0 duplicates.
[CHECKSTYLE] Successfully parsed file <https://builds.apache.org/job/Atlas-master-IntegrationTests/ws/shaded/hbase-server-shaded/target/checkstyle-result.xml>
with 46164 unique warnings and 0 duplicates.
[CHECKSTYLE] Successfully parsed file <https://builds.apache.org/job/Atlas-master-IntegrationTests/ws/target/checkstyle-result.xml>
with 46164 unique warnings and 0 duplicates.
[CHECKSTYLE] Successfully parsed file <https://builds.apache.org/job/Atlas-master-IntegrationTests/ws/test-tools/target/checkstyle-result.xml>
with 46202 unique warnings and 0 duplicates.
[CHECKSTYLE] Successfully parsed file <https://builds.apache.org/job/Atlas-master-IntegrationTests/ws/webapp/target/checkstyle-result.xml>
with 54161 unique warnings and 0 duplicates.
<Git Blamer> Using GitBlamer to create author and commit information for all warnings.
<Git Blamer> GIT_COMMIT=60c05eb753b0437679de3996e512f7378e4d78f1, workspace=<https://builds.apache.org/job/Atlas-master-IntegrationTests/ws/>
 > git rev-parse 60c05eb753b0437679de3996e512f7378e4d78f1^{commit} # timeout=10
[CHECKSTYLE] Computing warning deltas based on reference build #824
[FINDBUGS] Collecting findbugs analysis files...
[FINDBUGS] Searching for all files in <https://builds.apache.org/job/Atlas-master-IntegrationTests/ws/>
that match the pattern **/target/findbugs.xml
[FINDBUGS] Parsing 20 files in <https://builds.apache.org/job/Atlas-master-IntegrationTests/ws/>
[FINDBUGS] Successfully parsed file <https://builds.apache.org/job/Atlas-master-IntegrationTests/ws/addons/falcon-bridge-shim/target/findbugs.xml>
with 0 unique warnings and 0 duplicates.
[FINDBUGS] Successfully parsed file <https://builds.apache.org/job/Atlas-master-IntegrationTests/ws/addons/hive-bridge-shim/target/findbugs.xml>
with 0 unique warnings and 0 duplicates.
[FINDBUGS] Successfully parsed file <https://builds.apache.org/job/Atlas-master-IntegrationTests/ws/addons/hive-bridge/target/findbugs.xml>
with 0 unique warnings and 0 duplicates.
[FINDBUGS] Successfully parsed file <https://builds.apache.org/job/Atlas-master-IntegrationTests/ws/authorization/target/findbugs.xml>
with 0 unique warnings and 0 duplicates.
[FINDBUGS] Successfully parsed file <https://builds.apache.org/job/Atlas-master-IntegrationTests/ws/client/client-v1/target/findbugs.xml>
with 0 unique warnings and 0 duplicates.
[FINDBUGS] Successfully parsed file <https://builds.apache.org/job/Atlas-master-IntegrationTests/ws/client/client-v2/target/findbugs.xml>
with 0 unique warnings and 0 duplicates.
[FINDBUGS] Successfully parsed file <https://builds.apache.org/job/Atlas-master-IntegrationTests/ws/client/common/target/findbugs.xml>
with 0 unique warnings and 0 duplicates.
[FINDBUGS] Successfully parsed file <https://builds.apache.org/job/Atlas-master-IntegrationTests/ws/common/target/findbugs.xml>
with 0 unique warnings and 0 duplicates.
[FINDBUGS] Successfully parsed file <https://builds.apache.org/job/Atlas-master-IntegrationTests/ws/graphdb/api/target/findbugs.xml>
with 0 unique warnings and 0 duplicates.
[FINDBUGS] Successfully parsed file <https://builds.apache.org/job/Atlas-master-IntegrationTests/ws/graphdb/common/target/findbugs.xml>
with 0 unique warnings and 0 duplicates.
[FINDBUGS] Successfully parsed file <https://builds.apache.org/job/Atlas-master-IntegrationTests/ws/graphdb/janus/target/findbugs.xml>
with 0 unique warnings and 0 duplicates.
[FINDBUGS] Successfully parsed file <https://builds.apache.org/job/Atlas-master-IntegrationTests/ws/graphdb/titan0/target/findbugs.xml>
with 0 unique warnings and 0 duplicates.
[FINDBUGS] Successfully parsed file <https://builds.apache.org/job/Atlas-master-IntegrationTests/ws/intg/target/findbugs.xml>
with 0 unique warnings and 0 duplicates.
[FINDBUGS] Successfully parsed file <https://builds.apache.org/job/Atlas-master-IntegrationTests/ws/notification/target/findbugs.xml>
with 0 unique warnings and 0 duplicates.
[FINDBUGS] Successfully parsed file <https://builds.apache.org/job/Atlas-master-IntegrationTests/ws/om-fwk-ocf/target/findbugs.xml>
with 0 unique warnings and 0 duplicates.
[FINDBUGS] Successfully parsed file <https://builds.apache.org/job/Atlas-master-IntegrationTests/ws/plugin-classloader/target/findbugs.xml>
with 0 unique warnings and 0 duplicates.
[FINDBUGS] Successfully parsed file <https://builds.apache.org/job/Atlas-master-IntegrationTests/ws/repository/target/findbugs.xml>
with 0 unique warnings and 0 duplicates.
[FINDBUGS] Successfully parsed file <https://builds.apache.org/job/Atlas-master-IntegrationTests/ws/server-api/target/findbugs.xml>
with 0 unique warnings and 0 duplicates.
[FINDBUGS] Successfully parsed file <https://builds.apache.org/job/Atlas-master-IntegrationTests/ws/test-tools/target/findbugs.xml>
with 0 unique warnings and 0 duplicates.
[FINDBUGS] Successfully parsed file <https://builds.apache.org/job/Atlas-master-IntegrationTests/ws/webapp/target/findbugs.xml>
with 0 unique warnings and 0 duplicates.
<Git Blamer> Using GitBlamer to create author and commit information for all warnings.
<Git Blamer> GIT_COMMIT=60c05eb753b0437679de3996e512f7378e4d78f1, workspace=<https://builds.apache.org/job/Atlas-master-IntegrationTests/ws/>
[FINDBUGS] Computing warning deltas based on reference build #824
Archiving artifacts
[Fast Archiver] Compressed 138.04 MB of artifacts by 81.6% relative to #824
TestNG Reports Processing: START
Looking for TestNG results report in workspace using pattern: **/target/surefire-reports/testng-results.xml,**/target/failsafe-reports/testng-results.xml
Saving reports...
Processing '/x1/jenkins/jenkins-home/jobs/Atlas-master-IntegrationTests/builds/825/testng/testng-results-1.xml'
Processing '/x1/jenkins/jenkins-home/jobs/Atlas-master-IntegrationTests/builds/825/testng/testng-results-2.xml'
Processing '/x1/jenkins/jenkins-home/jobs/Atlas-master-IntegrationTests/builds/825/testng/testng-results.xml'
0.574713% of tests failed, which exceeded threshold of 0%. Marking build as UNSTABLE
TestNG Reports Processing: FINISH

Mime
View raw message