atlas-dev mailing list archives

Site index · List index
Message view « Date » · « Thread »
Top « Date » · « Thread »
From Apache Jenkins Server <jenk...@builds.apache.org>
Subject Build failed in Jenkins: Atlas-0.8-IntegrationTests #173
Date Wed, 14 Feb 2018 20:53:47 GMT
See <https://builds.apache.org/job/Atlas-0.8-IntegrationTests/173/display/redirect?page=changes>

Changes:

[madhan] ATLAS-2445: updated HBase hook to handle table-clone and

------------------------------------------
[...truncated 528.30 KB...]
127.0.0.1 - - [14/Feb/2018:20:49:41 +0000] "GET /api/atlas/v2/types/typedef/name/hive_table_v2
HTTP/1.1" 404 - "-" "Java/1.8.0_152"
127.0.0.1 - - [14/Feb/2018:20:49:41 +0000] "GET /api/atlas/v2/types/typedef/name/hive_process_v2
HTTP/1.1" 404 - "-" "Java/1.8.0_152"
127.0.0.1 - - [14/Feb/2018:20:49:41 +0000] "GET /api/atlas/v2/types/typedef/name/classification
HTTP/1.1" 200 - "-" "Java/1.8.0_152"
127.0.0.1 - - [14/Feb/2018:20:49:41 +0000] "GET /api/atlas/v2/types/typedef/name/pii_Tag HTTP/1.1"
200 - "-" "Java/1.8.0_152"
127.0.0.1 - - [14/Feb/2018:20:49:41 +0000] "GET /api/atlas/v2/types/typedef/name/phi_Tag HTTP/1.1"
200 - "-" "Java/1.8.0_152"
127.0.0.1 - - [14/Feb/2018:20:49:41 +0000] "GET /api/atlas/v2/types/typedef/name/pci_Tag HTTP/1.1"
200 - "-" "Java/1.8.0_152"
127.0.0.1 - - [14/Feb/2018:20:49:41 +0000] "GET /api/atlas/v2/types/typedef/name/sox_Tag HTTP/1.1"
200 - "-" "Java/1.8.0_152"
127.0.0.1 - - [14/Feb/2018:20:49:41 +0000] "GET /api/atlas/v2/types/typedef/name/sec_Tag HTTP/1.1"
200 - "-" "Java/1.8.0_152"
127.0.0.1 - - [14/Feb/2018:20:49:41 +0000] "GET /api/atlas/v2/types/typedef/name/finance_Tag
HTTP/1.1" 200 - "-" "Java/1.8.0_152"
127.0.0.1 - - [14/Feb/2018:20:49:41 +0000] "POST /api/atlas/v2/types/typedefs HTTP/1.1" 200
- "-" "Java/1.8.0_152"
127.0.0.1 - - [14/Feb/2018:20:49:42 +0000] "POST /api/atlas/v2/entity HTTP/1.1" 200 - "-"
"Java/1.8.0_152"
127.0.0.1 - - [14/Feb/2018:20:49:42 +0000] "POST /api/atlas/v2/entity HTTP/1.1" 200 - "-"
"Java/1.8.0_152"
127.0.0.1 - - [14/Feb/2018:20:49:42 +0000] "GET /api/atlas/v2/entity/guid/791a3a80-e81f-4656-99c6-ebc146c0d771
HTTP/1.1" 200 - "-" "Java/1.8.0_152"
127.0.0.1 - - [14/Feb/2018:20:49:42 +0000] "POST /api/atlas/v2/entity HTTP/1.1" 200 - "-"
"Java/1.8.0_152"
127.0.0.1 - - [14/Feb/2018:20:49:43 +0000] "POST /api/atlas/v2/entity/guid/random/classifications
HTTP/1.1" 404 - "-" "Java/1.8.0_152"
127.0.0.1 - - [14/Feb/2018:20:49:43 +0000] "POST /api/atlas/v2/entity/bulk HTTP/1.1" 200 -
"-" "Java/1.8.0_152"
127.0.0.1 - - [14/Feb/2018:20:49:43 +0000] "POST /api/atlas/v2/entity HTTP/1.1" 200 - "-"
"Java/1.8.0_152"
127.0.0.1 - - [14/Feb/2018:20:49:43 +0000] "POST /api/atlas/v2/entity HTTP/1.1" 200 - "-"
"Java/1.8.0_152"
127.0.0.1 - - [14/Feb/2018:20:49:43 +0000] "DELETE /api/atlas/v2/entity/bulk?guid=249475aa-ae22-4d81-9df4-deaad0a40d74&guid=65b97192-6b18-400f-ae2f-4dda31930156
HTTP/1.1" 200 - "-" "Java/1.8.0_152"
127.0.0.1 - - [14/Feb/2018:20:49:43 +0000] "POST /api/atlas/v2/entity HTTP/1.1" 200 - "-"
"Java/1.8.0_152"
127.0.0.1 - - [14/Feb/2018:20:49:43 +0000] "DELETE /api/atlas/v2/entity/uniqueAttribute/type/hive_db_v2?attr:name=dbelGyzYBtiq%E6%AC%9A%E3%B5%85%E3%B8%AE%E8%A3%A1%E8%9B%B6%E8%80%BA%E6%B2%BF%E9%AD%B3%EA%B2%8C%EB%9B%8C
HTTP/1.1" 200 - "-" "Java/1.8.0_152"
127.0.0.1 - - [14/Feb/2018:20:49:43 +0000] "DELETE /api/atlas/v2/entity/guid/random/classification/blah_trait
HTTP/1.1" 400 - "-" "Java/1.8.0_152"
127.0.0.1 - - [14/Feb/2018:20:49:43 +0000] "GET /api/atlas/discovery/search/dsl?query=hive_db_v2+where+name%3D'dbelGyzYBtiq'&limit=10&offset=0
HTTP/1.1" 200 - "-" "Java/1.8.0_152"
127.0.0.1 - - [14/Feb/2018:20:49:44 +0000] "GET /api/atlas/discovery/search/dsl?query=hive_db_v2+where+name%3D'dbelGyzYBtiq'&limit=10&offset=0
HTTP/1.1" 200 - "-" "Java/1.8.0_152"
127.0.0.1 - - [14/Feb/2018:20:49:45 +0000] "POST /api/atlas/v2/entity HTTP/1.1" 200 - "-"
"Java/1.8.0_152"
127.0.0.1 - - [14/Feb/2018:20:49:45 +0000] "GET /api/atlas/discovery/search/dsl?query=hive_db_v2+where+name%3D'dbelGyzYBtiq'&limit=10&offset=0
HTTP/1.1" 200 - "-" "Java/1.8.0_152"
127.0.0.1 - - [14/Feb/2018:20:49:46 +0000] "POST /api/atlas/v2/types/typedefs HTTP/1.1" 200
- "-" "Java/1.8.0_152"
127.0.0.1 - - [14/Feb/2018:20:49:46 +0000] "POST /api/atlas/v2/entity HTTP/1.1" 200 - "-"
"Java/1.8.0_152"
127.0.0.1 - - [14/Feb/2018:20:49:46 +0000] "PUT /api/atlas/v2/types/typedefs HTTP/1.1" 200
- "-" "Java/1.8.0_152"
127.0.0.1 - - [14/Feb/2018:20:49:47 +0000] "GET /api/atlas/v2/entity/guid/99ecc236-df62-44da-809b-35d12012bf7c
HTTP/1.1" 200 - "-" "Java/1.8.0_152"
127.0.0.1 - - [14/Feb/2018:20:49:47 +0000] "POST /api/atlas/v2/entity HTTP/1.1" 404 - "-"
"Java/1.8.0_152"
127.0.0.1 - - [14/Feb/2018:20:49:47 +0000] "POST /api/atlas/v2/entity HTTP/1.1" 200 - "-"
"Java/1.8.0_152"
127.0.0.1 - - [14/Feb/2018:20:49:47 +0000] "POST /api/atlas/v2/entity HTTP/1.1" 200 - "-"
"Java/1.8.0_152"
127.0.0.1 - - [14/Feb/2018:20:49:47 +0000] "GET /api/atlas/v2/entity/uniqueAttribute/type/hive_db_v2?attr:name=dbelGyzYBtiq
HTTP/1.1" 200 - "-" "Java/1.8.0_152"
127.0.0.1 - - [14/Feb/2018:20:49:47 +0000] "GET /api/atlas/v2/entity/guid/blah HTTP/1.1" 404
- "-" "Java/1.8.0_152"
127.0.0.1 - - [14/Feb/2018:20:49:47 +0000] "POST /api/atlas/v2/entity HTTP/1.1" 200 - "-"
"Java/1.8.0_152"
127.0.0.1 - - [14/Feb/2018:20:49:47 +0000] "GET /api/atlas/entities/cb90367e-c9e4-4ef7-82e0-b90b3ee3a37b/audit?count=10
HTTP/1.1" 200 - "-" "Java/1.8.0_152"
127.0.0.1 - - [14/Feb/2018:20:49:47 +0000] "POST /api/atlas/v2/entity HTTP/1.1" 200 - "-"
"Java/1.8.0_152"
127.0.0.1 - - [14/Feb/2018:20:49:47 +0000] "POST /api/atlas/v2/entity HTTP/1.1" 200 - "-"
"Java/1.8.0_152"
127.0.0.1 - - [14/Feb/2018:20:49:47 +0000] "GET /api/atlas/v2/types/typedef/name/NbG9xJ46gw
HTTP/1.1" 404 - "-" "Java/1.8.0_152"
127.0.0.1 - - [14/Feb/2018:20:49:47 +0000] "POST /api/atlas/v2/types/typedefs HTTP/1.1" 200
- "-" "Java/1.8.0_152"
127.0.0.1 - - [14/Feb/2018:20:49:48 +0000] "POST /api/atlas/v2/entity HTTP/1.1" 200 - "-"
"Java/1.8.0_152"
127.0.0.1 - - [14/Feb/2018:20:49:48 +0000] "GET /api/atlas/v2/entity/guid/ce8c9420-7a18-4c4e-a313-62483eb98c91
HTTP/1.1" 200 - "-" "Java/1.8.0_152"
127.0.0.1 - - [14/Feb/2018:20:49:48 +0000] "GET /api/atlas/v2/entity/guid/791a3a80-e81f-4656-99c6-ebc146c0d771
HTTP/1.1" 200 - "-" "Java/1.8.0_152"
127.0.0.1 - - [14/Feb/2018:20:49:48 +0000] "POST /api/atlas/v2/entity HTTP/1.1" 200 - "-"
"Java/1.8.0_152"
127.0.0.1 - - [14/Feb/2018:20:49:48 +0000] "GET /api/atlas/v2/entity/guid/791a3a80-e81f-4656-99c6-ebc146c0d771
HTTP/1.1" 200 - "-" "Java/1.8.0_152"
127.0.0.1 - - [14/Feb/2018:20:49:48 +0000] "GET /api/atlas/v2/entity/guid/791a3a80-e81f-4656-99c6-ebc146c0d771
HTTP/1.1" 200 - "-" "Java/1.8.0_152"
127.0.0.1 - - [14/Feb/2018:20:49:48 +0000] "POST /api/atlas/v2/entity HTTP/1.1" 200 - "-"
"Java/1.8.0_152"
127.0.0.1 - - [14/Feb/2018:20:49:48 +0000] "GET /api/atlas/v2/entity/guid/791a3a80-e81f-4656-99c6-ebc146c0d771
HTTP/1.1" 200 - "-" "Java/1.8.0_152"
127.0.0.1 - - [14/Feb/2018:20:49:48 +0000] "GET /api/atlas/v2/entity/guid/791a3a80-e81f-4656-99c6-ebc146c0d771
HTTP/1.1" 200 - "-" "Java/1.8.0_152"
127.0.0.1 - - [14/Feb/2018:20:49:48 +0000] "POST /api/atlas/v2/entity HTTP/1.1" 200 - "-"
"Java/1.8.0_152"
127.0.0.1 - - [14/Feb/2018:20:49:48 +0000] "GET /api/atlas/v2/entity/guid/791a3a80-e81f-4656-99c6-ebc146c0d771
HTTP/1.1" 200 - "-" "Java/1.8.0_152"
127.0.0.1 - - [14/Feb/2018:20:49:48 +0000] "GET /api/atlas/v2/types/typedef/name/PII_Traith7nXO2WhX8
HTTP/1.1" 404 - "-" "Java/1.8.0_152"
127.0.0.1 - - [14/Feb/2018:20:49:48 +0000] "POST /api/atlas/v2/types/typedefs HTTP/1.1" 200
- "-" "Java/1.8.0_152"
127.0.0.1 - - [14/Feb/2018:20:49:48 +0000] "DELETE /api/atlas/v2/entity/guid/791a3a80-e81f-4656-99c6-ebc146c0d771/classification/PII_Traith7nXO2WhX8
HTTP/1.1" 404 - "-" "Java/1.8.0_152"
127.0.0.1 - - [14/Feb/2018:20:49:48 +0000] "GET /api/atlas/v2/types/typedef/name/PII_TraitzMyuneUM37
HTTP/1.1" 404 - "-" "Java/1.8.0_152"
127.0.0.1 - - [14/Feb/2018:20:49:48 +0000] "POST /api/atlas/v2/types/typedefs HTTP/1.1" 200
- "-" "Java/1.8.0_152"
127.0.0.1 - - [14/Feb/2018:20:49:49 +0000] "GET /api/atlas/v2/types/classificationdef/name/PII_TraitzMyuneUM37
HTTP/1.1" 200 - "-" "Java/1.8.0_152"
127.0.0.1 - - [14/Feb/2018:20:49:49 +0000] "POST /api/atlas/v2/entity/guid/791a3a80-e81f-4656-99c6-ebc146c0d771/classifications
HTTP/1.1" 204 - "-" "Java/1.8.0_152"
127.0.0.1 - - [14/Feb/2018:20:49:49 +0000] "GET /api/atlas/v2/entity/guid/791a3a80-e81f-4656-99c6-ebc146c0d771/classifications
HTTP/1.1" 200 - "-" "Java/1.8.0_152"
127.0.0.1 - - [14/Feb/2018:20:49:49 +0000] "GET /api/atlas/v2/entity/guid/791a3a80-e81f-4656-99c6-ebc146c0d771/classifications
HTTP/1.1" 200 - "-" "Java/1.8.0_152"
127.0.0.1 - - [14/Feb/2018:20:49:49 +0000] "POST /api/atlas/v2/entity HTTP/1.1" 200 - "-"
"Java/1.8.0_152"
127.0.0.1 - - [14/Feb/2018:20:49:49 +0000] "GET /api/atlas/v2/entity/guid/791a3a80-e81f-4656-99c6-ebc146c0d771
HTTP/1.1" 200 - "-" "Java/1.8.0_152"
127.0.0.1 - - [14/Feb/2018:20:49:49 +0000] "PUT /api/atlas/v2/entity/uniqueAttribute/type/hive_table_v2?attr:qualifiedName=tablei6AYCcr4QS
HTTP/1.1" 200 - "-" "Java/1.8.0_152"
127.0.0.1 - - [14/Feb/2018:20:49:49 +0000] "GET /api/atlas/v2/entity/guid/791a3a80-e81f-4656-99c6-ebc146c0d771
HTTP/1.1" 200 - "-" "Java/1.8.0_152"
127.0.0.1 - - [14/Feb/2018:20:49:49 +0000] "GET /api/atlas/v2/types/typedef/name/PII_TraitB2I5o14X86
HTTP/1.1" 404 - "-" "Java/1.8.0_152"
127.0.0.1 - - [14/Feb/2018:20:49:49 +0000] "POST /api/atlas/v2/types/typedefs HTTP/1.1" 200
- "-" "Java/1.8.0_152"
127.0.0.1 - - [14/Feb/2018:20:49:49 +0000] "POST /api/atlas/v2/entity/guid/791a3a80-e81f-4656-99c6-ebc146c0d771/classifications
HTTP/1.1" 204 - "-" "Java/1.8.0_152"
127.0.0.1 - - [14/Feb/2018:20:49:49 +0000] "GET /api/atlas/entities/791a3a80-e81f-4656-99c6-ebc146c0d771/audit?count=100
HTTP/1.1" 200 - "-" "Java/1.8.0_152"
127.0.0.1 - - [14/Feb/2018:20:49:50 +0000] "GET /api/atlas/v2/types/typedef/name/PII_TraitmuEsidJVrG
HTTP/1.1" 404 - "-" "Java/1.8.0_152"
127.0.0.1 - - [14/Feb/2018:20:49:50 +0000] "POST /api/atlas/v2/types/typedefs HTTP/1.1" 200
- "-" "Java/1.8.0_152"
127.0.0.1 - - [14/Feb/2018:20:49:50 +0000] "POST /api/atlas/v2/entity/guid/791a3a80-e81f-4656-99c6-ebc146c0d771/classifications
HTTP/1.1" 204 - "-" "Java/1.8.0_152"
127.0.0.1 - - [14/Feb/2018:20:49:50 +0000] "GET /api/atlas/v2/entity/guid/791a3a80-e81f-4656-99c6-ebc146c0d771
HTTP/1.1" 200 - "-" "Java/1.8.0_152"
127.0.0.1 - - [14/Feb/2018:20:49:50 +0000] "DELETE /api/atlas/v2/entity/guid/791a3a80-e81f-4656-99c6-ebc146c0d771/classification/PII_TraitB2I5o14X86
HTTP/1.1" 204 - "-" "Java/1.8.0_152"
127.0.0.1 - - [14/Feb/2018:20:49:50 +0000] "GET /api/atlas/entities/791a3a80-e81f-4656-99c6-ebc146c0d771/audit?count=100
HTTP/1.1" 200 - "-" "Java/1.8.0_152"
Tests run: 138, Failures: 2, Errors: 0, Skipped: 9, Time elapsed: 181.904 sec <<<
FAILURE! - in TestSuite
testSubmit(org.apache.atlas.web.integration.TypesJerseyResourceIT)  Time elapsed: 0.497 sec
 <<< FAILURE!
org.apache.atlas.AtlasServiceException: Metadata service API org.apache.atlas.AtlasClient$API_V1@11c5456c
failed with status 400 (Bad Request) Response Body ({"error":"table.database: invalid inverseRef
constraint. Inverse attribute database.database does not exist"})
	at org.apache.atlas.AtlasBaseClient.callAPIWithResource(AtlasBaseClient.java:387)
	at org.apache.atlas.AtlasBaseClient.callAPIWithResource(AtlasBaseClient.java:320)
	at org.apache.atlas.AtlasBaseClient.callAPI(AtlasBaseClient.java:208)
	at org.apache.atlas.AtlasClient.callAPIWithBody(AtlasClient.java:942)
	at org.apache.atlas.web.integration.TypesJerseyResourceIT.testSubmit(TypesJerseyResourceIT.java:84)

setUp(org.apache.atlas.notification.NotificationHookConsumerIT)  Time elapsed: 0.603 sec 
<<< FAILURE!
org.apache.atlas.AtlasException: Failed to start embedded kafka
	at sun.nio.ch.Net.bind0(Native Method)
	at sun.nio.ch.Net.bind(Net.java:433)
	at sun.nio.ch.Net.bind(Net.java:425)
	at sun.nio.ch.ServerSocketChannelImpl.bind(ServerSocketChannelImpl.java:223)
	at sun.nio.ch.ServerSocketAdaptor.bind(ServerSocketAdaptor.java:74)
	at sun.nio.ch.ServerSocketAdaptor.bind(ServerSocketAdaptor.java:67)
	at org.apache.zookeeper.server.NIOServerCnxnFactory.configure(NIOServerCnxnFactory.java:95)
	at org.apache.zookeeper.server.ServerCnxnFactory.createFactory(ServerCnxnFactory.java:126)
	at org.apache.atlas.kafka.EmbeddedKafkaServer.startZk(EmbeddedKafkaServer.java:113)
	at org.apache.atlas.kafka.EmbeddedKafkaServer.start(EmbeddedKafkaServer.java:77)
	at org.apache.atlas.web.integration.BaseResourceIT.initNotificationService(BaseResourceIT.java:699)
	at org.apache.atlas.notification.NotificationHookConsumerIT.setUp(NotificationHookConsumerIT.java:53)


Results :

Failed tests: 
  NotificationHookConsumerIT.setUp:53->BaseResourceIT.initNotificationService:699 »
Atlas
  TypesJerseyResourceIT.testSubmit:84 » AtlasService Metadata service API org.ap...

Tests run: 138, Failures: 2, Errors: 0, Skipped: 9

[INFO] 
[INFO] --- jetty-maven-plugin:9.2.12.v20150709:stop (stop-jetty) @ atlas-webapp ---
[INFO] Waiting 10 seconds for jetty to stop
[INFO] Stopped ServerConnector@dc2c3dd{HTTP/1.1}{0.0.0.0:31000}
[INFO] Closing Spring root WebApplicationContext
[INFO] Shutting down log4j
[INFO] Not cleaning cached beans: no such field javax.el.BeanELResolver.properties
[INFO] Stopped o.e.j.m.p.JettyWebAppContext@2948af4d{/,<https://builds.apache.org/job/Atlas-0.8-IntegrationTests/ws/webapp/target/atlas-webapp-0.8.3-SNAPSHOT/,UNAVAILABLE}{/home/jenkins/jenkins-slave/workspace/Atlas-0.8-IntegrationTests/webapp/target/atlas-webapp-0.8.3-SNAPSHOT.war}>
[INFO] Server reports itself as stopped
[INFO] 
[INFO] --- maven-source-plugin:2.4:jar-no-fork (attach-sources) @ atlas-webapp ---
[INFO] Building jar: <https://builds.apache.org/job/Atlas-0.8-IntegrationTests/ws/webapp/target/atlas-webapp-0.8.3-SNAPSHOT-sources.jar>
log4j:WARN No appenders could be found for logger (org.apache.zookeeper.ClientCnxn).
log4j:WARN Please initialize the log4j system properly.
log4j:WARN See http://logging.apache.org/log4j/1.2/faq.html#noconfig for more info.
[INFO] 
[INFO] --- maven-source-plugin:2.4:test-jar-no-fork (attach-sources) @ atlas-webapp ---
[INFO] Building jar: <https://builds.apache.org/job/Atlas-0.8-IntegrationTests/ws/webapp/target/atlas-webapp-0.8.3-SNAPSHOT-test-sources.jar>
[INFO] 
[INFO] --- maven-failsafe-plugin:2.18.1:verify (verify) @ atlas-webapp ---
[INFO] Failsafe report directory: <https://builds.apache.org/job/Atlas-0.8-IntegrationTests/ws/webapp/target/failsafe-reports>
[INFO] ------------------------------------------------------------------------
[INFO] Reactor Summary:
[INFO] 
[INFO] Apache Atlas Server Build Tools .................... SUCCESS [  0.567 s]
[INFO] apache-atlas ....................................... SUCCESS [  3.956 s]
[INFO] Apache Atlas Integration ........................... SUCCESS [ 16.949 s]
[INFO] Apache Atlas Common ................................ SUCCESS [  7.024 s]
[INFO] Apache Atlas Typesystem ............................ SUCCESS [ 45.388 s]
[INFO] Apache Atlas Client ................................ SUCCESS [  0.630 s]
[INFO] atlas-client-common ................................ SUCCESS [  6.099 s]
[INFO] atlas-client-v1 .................................... SUCCESS [  6.550 s]
[INFO] Apache Atlas Server API ............................ SUCCESS [  5.509 s]
[INFO] Apache Atlas Notification .......................... SUCCESS [  9.267 s]
[INFO] atlas-client-v2 .................................... SUCCESS [  5.023 s]
[INFO] Apache Atlas Graph Database Projects ............... SUCCESS [  0.438 s]
[INFO] Apache Atlas Graph Database API .................... SUCCESS [  4.444 s]
[INFO] Graph Database Common Code ......................... SUCCESS [  4.825 s]
[INFO] Apache Atlas Titan 1.0.0 GraphDB Impl .............. SUCCESS [ 32.771 s]
[INFO] Shaded version of Apache hbase client .............. SUCCESS [  7.399 s]
[INFO] Apache Atlas Titan 0.5.4 Graph DB Impl ............. SUCCESS [ 32.044 s]
[INFO] Apache Atlas Graph Database Implementation Dependencies SUCCESS [  0.611 s]
[INFO] Shaded version of Apache hbase server .............. SUCCESS [ 20.360 s]
[INFO] Apache Atlas Repository ............................ SUCCESS [01:10 min]
[INFO] Apache Atlas Authorization ......................... SUCCESS [  5.839 s]
[INFO] Apache Atlas Business Catalog ...................... SUCCESS [  9.114 s]
[INFO] Apache Atlas UI .................................... SUCCESS [01:11 min]
[INFO] Apache Atlas Web Application ....................... FAILURE [04:27 min]
[INFO] Apache Atlas Documentation ......................... SKIPPED
[INFO] Apache Atlas FileSystem Model ...................... SKIPPED
[INFO] Apache Atlas Plugin Classloader .................... SKIPPED
[INFO] Apache Atlas Hive Bridge Shim ...................... SKIPPED
[INFO] Apache Atlas Hive Bridge ........................... SKIPPED
[INFO] Apache Atlas Falcon Bridge Shim .................... SKIPPED
[INFO] Apache Atlas Falcon Bridge ......................... SKIPPED
[INFO] Apache Atlas Sqoop Bridge Shim ..................... SKIPPED
[INFO] Apache Atlas Sqoop Bridge .......................... SKIPPED
[INFO] Apache Atlas Storm Bridge Shim ..................... SKIPPED
[INFO] Apache Atlas Storm Bridge .......................... SKIPPED
[INFO] Apache Atlas Hbase Bridge Shim ..................... SKIPPED
[INFO] Apache Atlas Hbase Bridge .......................... SKIPPED
[INFO] Apache Atlas Distribution .......................... SKIPPED
[INFO] ------------------------------------------------------------------------
[INFO] BUILD FAILURE
[INFO] ------------------------------------------------------------------------
[INFO] Total time: 10:35 min
[INFO] Finished at: 2018-02-14T20:49:54Z
[INFO] Final Memory: 379M/3371M
[INFO] ------------------------------------------------------------------------
[ERROR] Failed to execute goal org.apache.maven.plugins:maven-failsafe-plugin:2.18.1:verify
(verify) on project atlas-webapp: There are test failures.
[ERROR] 
[ERROR] Please refer to <https://builds.apache.org/job/Atlas-0.8-IntegrationTests/ws/webapp/target/failsafe-reports>
for the individual test results.
[ERROR] -> [Help 1]
[ERROR] 
[ERROR] To see the full stack trace of the errors, re-run Maven with the -e switch.
[ERROR] Re-run Maven using the -X switch to enable full debug logging.
[ERROR] 
[ERROR] For more information about the errors and possible solutions, please read the following
articles:
[ERROR] [Help 1] http://cwiki.apache.org/confluence/display/MAVEN/MojoFailureException
[ERROR] 
[ERROR] After correcting the problems, you can resume the build with the command
[ERROR]   mvn <goals> -rf :atlas-webapp
Build step 'Execute shell' marked build as failure
[CHECKSTYLE] Collecting checkstyle analysis files...
[CHECKSTYLE] Searching for all files in <https://builds.apache.org/job/Atlas-0.8-IntegrationTests/ws/>
that match the pattern **/target/checkstyle-result.xml
[CHECKSTYLE] Parsing 22 files in <https://builds.apache.org/job/Atlas-0.8-IntegrationTests/ws/>
[CHECKSTYLE] Successfully parsed file <https://builds.apache.org/job/Atlas-0.8-IntegrationTests/ws/authorization/target/checkstyle-result.xml>
with 467 unique warnings and 0 duplicates.
[CHECKSTYLE] Successfully parsed file <https://builds.apache.org/job/Atlas-0.8-IntegrationTests/ws/catalog/target/checkstyle-result.xml>
with 2604 unique warnings and 0 duplicates.
[CHECKSTYLE] Successfully parsed file <https://builds.apache.org/job/Atlas-0.8-IntegrationTests/ws/client/client-v1/target/checkstyle-result.xml>
with 3480 unique warnings and 0 duplicates.
[CHECKSTYLE] Successfully parsed file <https://builds.apache.org/job/Atlas-0.8-IntegrationTests/ws/client/client-v2/target/checkstyle-result.xml>
with 3810 unique warnings and 0 duplicates.
[CHECKSTYLE] Successfully parsed file <https://builds.apache.org/job/Atlas-0.8-IntegrationTests/ws/client/common/target/checkstyle-result.xml>
with 4300 unique warnings and 0 duplicates.
[CHECKSTYLE] Successfully parsed file <https://builds.apache.org/job/Atlas-0.8-IntegrationTests/ws/client/target/checkstyle-result.xml>
with 4300 unique warnings and 0 duplicates.
[CHECKSTYLE] Successfully parsed file <https://builds.apache.org/job/Atlas-0.8-IntegrationTests/ws/common/target/checkstyle-result.xml>
with 5259 unique warnings and 0 duplicates.
[CHECKSTYLE] Successfully parsed file <https://builds.apache.org/job/Atlas-0.8-IntegrationTests/ws/dashboardv2/target/checkstyle-result.xml>
with 5259 unique warnings and 0 duplicates.
[CHECKSTYLE] Successfully parsed file <https://builds.apache.org/job/Atlas-0.8-IntegrationTests/ws/graphdb/api/target/checkstyle-result.xml>
with 5532 unique warnings and 0 duplicates.
[CHECKSTYLE] Successfully parsed file <https://builds.apache.org/job/Atlas-0.8-IntegrationTests/ws/graphdb/common/target/checkstyle-result.xml>
with 5719 unique warnings and 0 duplicates.
[CHECKSTYLE] Successfully parsed file <https://builds.apache.org/job/Atlas-0.8-IntegrationTests/ws/graphdb/graphdb-impls/target/checkstyle-result.xml>
with 5719 unique warnings and 0 duplicates.
[CHECKSTYLE] Successfully parsed file <https://builds.apache.org/job/Atlas-0.8-IntegrationTests/ws/graphdb/target/checkstyle-result.xml>
with 5719 unique warnings and 0 duplicates.
[CHECKSTYLE] Successfully parsed file <https://builds.apache.org/job/Atlas-0.8-IntegrationTests/ws/graphdb/titan0/target/checkstyle-result.xml>
with 8174 unique warnings and 0 duplicates.
[CHECKSTYLE] Successfully parsed file <https://builds.apache.org/job/Atlas-0.8-IntegrationTests/ws/graphdb/titan1/target/checkstyle-result.xml>
with 9141 unique warnings and 0 duplicates.
[CHECKSTYLE] Successfully parsed file <https://builds.apache.org/job/Atlas-0.8-IntegrationTests/ws/intg/target/checkstyle-result.xml>
with 16060 unique warnings and 0 duplicates.
[CHECKSTYLE] Successfully parsed file <https://builds.apache.org/job/Atlas-0.8-IntegrationTests/ws/notification/target/checkstyle-result.xml>
with 17817 unique warnings and 0 duplicates.
[CHECKSTYLE] Successfully parsed file <https://builds.apache.org/job/Atlas-0.8-IntegrationTests/ws/repository/target/checkstyle-result.xml>
with 36824 unique warnings and 0 duplicates.
[CHECKSTYLE] Successfully parsed file <https://builds.apache.org/job/Atlas-0.8-IntegrationTests/ws/server-api/target/checkstyle-result.xml>
with 37217 unique warnings and 0 duplicates.
[CHECKSTYLE] Successfully parsed file <https://builds.apache.org/job/Atlas-0.8-IntegrationTests/ws/shaded/hbase-client-shaded/target/checkstyle-result.xml>
with 37217 unique warnings and 0 duplicates.
[CHECKSTYLE] Successfully parsed file <https://builds.apache.org/job/Atlas-0.8-IntegrationTests/ws/shaded/hbase-server-shaded/target/checkstyle-result.xml>
with 37217 unique warnings and 0 duplicates.
[CHECKSTYLE] Successfully parsed file <https://builds.apache.org/job/Atlas-0.8-IntegrationTests/ws/target/checkstyle-result.xml>
with 37217 unique warnings and 0 duplicates.
[CHECKSTYLE] Successfully parsed file <https://builds.apache.org/job/Atlas-0.8-IntegrationTests/ws/typesystem/target/checkstyle-result.xml>
with 41457 unique warnings and 0 duplicates.
<Git Blamer> Using GitBlamer to create author and commit information for all warnings.
<Git Blamer> GIT_COMMIT=9640a7c64124d73930658eab24aa2f4251f7a818, workspace=<https://builds.apache.org/job/Atlas-0.8-IntegrationTests/ws/>
 > git rev-parse 9640a7c64124d73930658eab24aa2f4251f7a818^{commit} # timeout=10
<Git Blamer> Skipping file <https://builds.apache.org/job/Atlas-0.8-IntegrationTests/ws/catalog/src/main/java/org/apache/atlas/catalog/projection/Relation.java,>
no result found.
<Git Blamer> Skipping file <https://builds.apache.org/job/Atlas-0.8-IntegrationTests/ws/repository/src/main/java/org/apache/atlas/discovery/SearchIndexer.java,>
no result found.
[FINDBUGS] Collecting findbugs analysis files...
[FINDBUGS] Searching for all files in <https://builds.apache.org/job/Atlas-0.8-IntegrationTests/ws/>
that match the pattern **/target/findbugs.xml
[FINDBUGS] Parsing 15 files in <https://builds.apache.org/job/Atlas-0.8-IntegrationTests/ws/>
[FINDBUGS] Successfully parsed file <https://builds.apache.org/job/Atlas-0.8-IntegrationTests/ws/authorization/target/findbugs.xml>
with 0 unique warnings and 0 duplicates.
[FINDBUGS] Successfully parsed file <https://builds.apache.org/job/Atlas-0.8-IntegrationTests/ws/catalog/target/findbugs.xml>
with 0 unique warnings and 0 duplicates.
[FINDBUGS] Successfully parsed file <https://builds.apache.org/job/Atlas-0.8-IntegrationTests/ws/client/client-v1/target/findbugs.xml>
with 0 unique warnings and 0 duplicates.
[FINDBUGS] Successfully parsed file <https://builds.apache.org/job/Atlas-0.8-IntegrationTests/ws/client/client-v2/target/findbugs.xml>
with 0 unique warnings and 0 duplicates.
[FINDBUGS] Successfully parsed file <https://builds.apache.org/job/Atlas-0.8-IntegrationTests/ws/client/common/target/findbugs.xml>
with 0 unique warnings and 0 duplicates.
[FINDBUGS] Successfully parsed file <https://builds.apache.org/job/Atlas-0.8-IntegrationTests/ws/common/target/findbugs.xml>
with 0 unique warnings and 0 duplicates.
[FINDBUGS] Successfully parsed file <https://builds.apache.org/job/Atlas-0.8-IntegrationTests/ws/graphdb/api/target/findbugs.xml>
with 0 unique warnings and 0 duplicates.
[FINDBUGS] Successfully parsed file <https://builds.apache.org/job/Atlas-0.8-IntegrationTests/ws/graphdb/common/target/findbugs.xml>
with 0 unique warnings and 0 duplicates.
[FINDBUGS] Successfully parsed file <https://builds.apache.org/job/Atlas-0.8-IntegrationTests/ws/graphdb/titan0/target/findbugs.xml>
with 0 unique warnings and 0 duplicates.
[FINDBUGS] Successfully parsed file <https://builds.apache.org/job/Atlas-0.8-IntegrationTests/ws/graphdb/titan1/target/findbugs.xml>
with 0 unique warnings and 0 duplicates.
[FINDBUGS] Successfully parsed file <https://builds.apache.org/job/Atlas-0.8-IntegrationTests/ws/intg/target/findbugs.xml>
with 0 unique warnings and 0 duplicates.
[FINDBUGS] Successfully parsed file <https://builds.apache.org/job/Atlas-0.8-IntegrationTests/ws/notification/target/findbugs.xml>
with 0 unique warnings and 0 duplicates.
[FINDBUGS] Successfully parsed file <https://builds.apache.org/job/Atlas-0.8-IntegrationTests/ws/repository/target/findbugs.xml>
with 0 unique warnings and 0 duplicates.
[FINDBUGS] Successfully parsed file <https://builds.apache.org/job/Atlas-0.8-IntegrationTests/ws/server-api/target/findbugs.xml>
with 0 unique warnings and 0 duplicates.
[FINDBUGS] Successfully parsed file <https://builds.apache.org/job/Atlas-0.8-IntegrationTests/ws/typesystem/target/findbugs.xml>
with 0 unique warnings and 0 duplicates.
<Git Blamer> Using GitBlamer to create author and commit information for all warnings.
<Git Blamer> GIT_COMMIT=9640a7c64124d73930658eab24aa2f4251f7a818, workspace=<https://builds.apache.org/job/Atlas-0.8-IntegrationTests/ws/>
Archiving artifacts
[Fast Archiver] No prior successful build to compare, so performing full copy of artifacts
TestNG Reports Processing: START
Looking for TestNG results report in workspace using pattern: **/target/surefire-reports/testng-results.xml,**/target/failsafe-reports/testng-results.xml
Saving reports...
Processing '/x1/jenkins/jenkins-home/jobs/Atlas-0.8-IntegrationTests/builds/173/testng/testng-results.xml'
0.735294% of tests failed, which exceeded threshold of 0%. Marking build as UNSTABLE
TestNG Reports Processing: FINISH

Mime
View raw message