atlas-dev mailing list archives

Site index · List index
Message view « Date » · « Thread »
Top « Date » · « Thread »
From Apache Jenkins Server <jenk...@builds.apache.org>
Subject Build failed in Jenkins: Atlas-0.8-IntegrationTests #180
Date Thu, 22 Feb 2018 04:57:39 GMT
See <https://builds.apache.org/job/Atlas-0.8-IntegrationTests/180/display/redirect?page=changes>

Changes:

[madhan] ATLAS-2451: UI to list tables in a HBase namespace similar to tables

------------------------------------------
[...truncated 498.35 KB...]
127.0.0.1 - - [22/Feb/2018:04:51:32 +0000] "POST /api/atlas/entities HTTP/1.1" 201 - "-" "Java/1.8.0_152"
127.0.0.1 - - [22/Feb/2018:04:51:32 +0000] "POST /api/atlas/entities HTTP/1.1" 201 - "-" "Java/1.8.0_152"
127.0.0.1 - - [22/Feb/2018:04:51:32 +0000] "GET /api/atlas/v2/types/typedef/name/PII_TraitAsV8ZkOqJd
HTTP/1.1" 404 - "-" "Java/1.8.0_152"
127.0.0.1 - - [22/Feb/2018:04:51:32 +0000] "POST /api/atlas/types HTTP/1.1" 201 - "-" "Java/1.8.0_152"
127.0.0.1 - - [22/Feb/2018:04:51:32 +0000] "POST /api/atlas/entities/084c450e-0ff9-4c1b-96f1-9bddf215ae35/traits
HTTP/1.1" 201 - "-" "Java/1.8.0_152"
127.0.0.1 - - [22/Feb/2018:04:51:32 +0000] "GET /api/atlas/entities/084c450e-0ff9-4c1b-96f1-9bddf215ae35/traitDefinitions/PII_TraitAsV8ZkOqJd
HTTP/1.1" 200 - "-" "Java/1.8.0_152"
127.0.0.1 - - [22/Feb/2018:04:51:32 +0000] "GET /api/atlas/entities/084c450e-0ff9-4c1b-96f1-9bddf215ae35/traitDefinitions
HTTP/1.1" 200 - "-" "Java/1.8.0_152"
127.0.0.1 - - [22/Feb/2018:04:51:32 +0000] "GET /api/atlas/entities/blah HTTP/1.1" 404 - "-"
"Java/1.8.0_152"
127.0.0.1 - - [22/Feb/2018:04:51:32 +0000] "GET /api/atlas/v2/types/typedef/name/WB1Ya5v89X
HTTP/1.1" 404 - "-" "Java/1.8.0_152"
127.0.0.1 - - [22/Feb/2018:04:51:32 +0000] "POST /api/atlas/types HTTP/1.1" 201 - "-" "Java/1.8.0_152"
127.0.0.1 - - [22/Feb/2018:04:51:33 +0000] "POST /api/atlas/entities HTTP/1.1" 201 - "-" "Java/1.8.0_152"
127.0.0.1 - - [22/Feb/2018:04:51:33 +0000] "GET /api/atlas/entities/ca59a096-0987-407d-a90d-00039b37f7f5
HTTP/1.1" 200 - "-" "Java/1.8.0_152"
127.0.0.1 - - [22/Feb/2018:04:51:33 +0000] "POST /api/atlas/entities HTTP/1.1" 201 - "-" "Java/1.8.0_152"
127.0.0.1 - - [22/Feb/2018:04:51:33 +0000] "POST /api/atlas/entities HTTP/1.1" 201 - "-" "Java/1.8.0_152"
127.0.0.1 - - [22/Feb/2018:04:51:33 +0000] "GET /api/atlas/v2/types/typedef/name/PII_TraitT8zoAoraHb
HTTP/1.1" 404 - "-" "Java/1.8.0_152"
127.0.0.1 - - [22/Feb/2018:04:51:33 +0000] "POST /api/atlas/types HTTP/1.1" 201 - "-" "Java/1.8.0_152"
127.0.0.1 - - [22/Feb/2018:04:51:33 +0000] "POST /api/atlas/entities/eacd82c6-8f83-472c-a6d8-035b21226da5/traits
HTTP/1.1" 201 - "-" "Java/1.8.0_152"
127.0.0.1 - - [22/Feb/2018:04:51:33 +0000] "GET /api/atlas/entities/eacd82c6-8f83-472c-a6d8-035b21226da5/audit?count=100
HTTP/1.1" 200 - "-" "Java/1.8.0_152"
127.0.0.1 - - [22/Feb/2018:04:51:33 +0000] "DELETE /api/atlas/entities/eacd82c6-8f83-472c-a6d8-035b21226da5/traits/PII_TraitT8zoAoraHb
HTTP/1.1" 200 - "-" "Java/1.8.0_152"
127.0.0.1 - - [22/Feb/2018:04:51:33 +0000] "GET /api/atlas/entities/eacd82c6-8f83-472c-a6d8-035b21226da5/traitDefinitions/PII_TraitT8zoAoraHb
HTTP/1.1" 404 - "-" "Java/1.8.0_152"
127.0.0.1 - - [22/Feb/2018:04:51:33 +0000] "GET /api/atlas/entities/eacd82c6-8f83-472c-a6d8-035b21226da5/audit?count=100
HTTP/1.1" 200 - "-" "Java/1.8.0_152"
127.0.0.1 - - [22/Feb/2018:04:51:33 +0000] "POST /api/atlas/entities HTTP/1.1" 201 - "-" "Java/1.8.0_152"
127.0.0.1 - - [22/Feb/2018:04:51:33 +0000] "POST /api/atlas/entities HTTP/1.1" 201 - "-" "Java/1.8.0_152"
127.0.0.1 - - [22/Feb/2018:04:51:34 +0000] "POST /api/atlas/entities HTTP/1.1" 201 - "-" "Java/1.8.0_152"
127.0.0.1 - - [22/Feb/2018:04:51:34 +0000] "POST /api/atlas/entities HTTP/1.1" 201 - "-" "Java/1.8.0_152"
127.0.0.1 - - [22/Feb/2018:04:51:34 +0000] "POST /api/atlas/entities HTTP/1.1" 201 - "-" "Java/1.8.0_152"
127.0.0.1 - - [22/Feb/2018:04:51:34 +0000] "GET /api/atlas/entities/2cf5a15c-2495-4d95-a8e7-6f8841a95fe2/audit?count=100
HTTP/1.1" 200 - "-" "Java/1.8.0_152"
127.0.0.1 - - [22/Feb/2018:04:51:34 +0000] "GET /api/atlas/discovery/search/dsl?query=hive_db+where+qualifiedName%3D'dbh84dJMJydZ'&limit=10&offset=0
HTTP/1.1" 200 - "-" "Java/1.8.0_152"
127.0.0.1 - - [22/Feb/2018:04:51:35 +0000] "POST /api/atlas/entities HTTP/1.1" 201 - "-" "Java/1.8.0_152"
127.0.0.1 - - [22/Feb/2018:04:51:35 +0000] "GET /api/atlas/discovery/search/dsl?query=hive_db+where+qualifiedName%3D'dbh84dJMJydZ'&limit=10&offset=0
HTTP/1.1" 200 - "-" "Java/1.8.0_152"
127.0.0.1 - - [22/Feb/2018:04:51:36 +0000] "POST /api/atlas/entities HTTP/1.1" 201 - "-" "Java/1.8.0_152"
127.0.0.1 - - [22/Feb/2018:04:51:36 +0000] "GET /api/atlas/discovery/search/dsl?query=hive_db+where+qualifiedName%3D'dbh84dJMJydZ'&limit=10&offset=0
HTTP/1.1" 200 - "-" "Java/1.8.0_152"
127.0.0.1 - - [22/Feb/2018:04:51:37 +0000] "POST /api/atlas/entities/random/traits HTTP/1.1"
400 - "-" "Java/1.8.0_152"
127.0.0.1 - - [22/Feb/2018:04:51:37 +0000] "POST /api/atlas/entities HTTP/1.1" 201 - "-" "Java/1.8.0_152"
127.0.0.1 - - [22/Feb/2018:04:51:37 +0000] "GET /api/atlas/entities?type=hive_db&property=qualifiedName&value=WaBTQSlwn7
HTTP/1.1" 200 - "-" "Java/1.8.0_152"
127.0.0.1 - - [22/Feb/2018:04:51:37 +0000] "POST /api/atlas/entities HTTP/1.1" 201 - "-" "Java/1.8.0_152"
127.0.0.1 - - [22/Feb/2018:04:51:37 +0000] "POST /api/atlas/entities HTTP/1.1" 201 - "-" "Java/1.8.0_152"
127.0.0.1 - - [22/Feb/2018:04:51:37 +0000] "GET /api/atlas/v2/types/typedef/name/PII_TraitRXqr6qs2nj
HTTP/1.1" 404 - "-" "Java/1.8.0_152"
127.0.0.1 - - [22/Feb/2018:04:51:37 +0000] "POST /api/atlas/types HTTP/1.1" 201 - "-" "Java/1.8.0_152"
127.0.0.1 - - [22/Feb/2018:04:51:37 +0000] "POST /api/atlas/entities/f2b2696e-6710-403d-8cb7-62b249b81006/traits
HTTP/1.1" 201 - "-" "Java/1.8.0_152"
127.0.0.1 - - [22/Feb/2018:04:51:37 +0000] "POST /api/atlas/entities/f2b2696e-6710-403d-8cb7-62b249b81006/traits
HTTP/1.1" 400 - "-" "Java/1.8.0_152"
127.0.0.1 - - [22/Feb/2018:04:51:37 +0000] "POST /api/atlas/entities HTTP/1.1" 201 - "-" "Java/1.8.0_152"
127.0.0.1 - - [22/Feb/2018:04:51:37 +0000] "POST /api/atlas/entities HTTP/1.1" 400 - "-" "Java/1.8.0_152"
127.0.0.1 - - [22/Feb/2018:04:51:37 +0000] "POST /api/atlas/entities HTTP/1.1" 201 - "-" "Java/1.8.0_152"
127.0.0.1 - - [22/Feb/2018:04:51:37 +0000] "POST /api/atlas/entities HTTP/1.1" 201 - "-" "Java/1.8.0_152"
127.0.0.1 - - [22/Feb/2018:04:51:38 +0000] "GET /api/atlas/v2/types/typedef/name/PII_TraitNf7llphca3
HTTP/1.1" 404 - "-" "Java/1.8.0_152"
127.0.0.1 - - [22/Feb/2018:04:51:38 +0000] "POST /api/atlas/types HTTP/1.1" 201 - "-" "Java/1.8.0_152"
127.0.0.1 - - [22/Feb/2018:04:51:38 +0000] "DELETE /api/atlas/entities/113c575c-963e-44f4-b079-76f41707d8be/traits/PII_TraitNf7llphca3
HTTP/1.1" 404 - "-" "Java/1.8.0_152"
127.0.0.1 - - [22/Feb/2018:04:51:38 +0000] "POST /api/atlas/entities HTTP/1.1" 201 - "-" "Java/1.8.0_152"
127.0.0.1 - - [22/Feb/2018:04:51:38 +0000] "POST /api/atlas/entities HTTP/1.1" 201 - "-" "Java/1.8.0_152"
127.0.0.1 - - [22/Feb/2018:04:51:38 +0000] "GET /api/atlas/v2/types/typedef/name/PII_TraitedXhysCjNC
HTTP/1.1" 404 - "-" "Java/1.8.0_152"
127.0.0.1 - - [22/Feb/2018:04:51:38 +0000] "POST /api/atlas/types HTTP/1.1" 201 - "-" "Java/1.8.0_152"
127.0.0.1 - - [22/Feb/2018:04:51:38 +0000] "POST /api/atlas/entities/ad645902-4c08-4cee-8816-d46d28bdf9ea/traits
HTTP/1.1" 201 - "-" "Java/1.8.0_152"
127.0.0.1 - - [22/Feb/2018:04:51:38 +0000] "GET /api/atlas/entities/ad645902-4c08-4cee-8816-d46d28bdf9ea/audit?count=100
HTTP/1.1" 200 - "-" "Java/1.8.0_152"
127.0.0.1 - - [22/Feb/2018:04:51:38 +0000] "GET /api/atlas/entities?type=blah HTTP/1.1" 400
- "-" "Java/1.8.0_152"
127.0.0.1 - - [22/Feb/2018:04:51:38 +0000] "POST /api/atlas/entities HTTP/1.1" 201 - "-" "Java/1.8.0_152"
127.0.0.1 - - [22/Feb/2018:04:51:38 +0000] "POST /api/atlas/entities HTTP/1.1" 201 - "-" "Java/1.8.0_152"
127.0.0.1 - - [22/Feb/2018:04:51:38 +0000] "DELETE /api/atlas/entities/7243dd52-694e-4cda-833a-9dc3bcca5cbd/traits/blah_trait
HTTP/1.1" 404 - "-" "Java/1.8.0_152"
127.0.0.1 - - [22/Feb/2018:04:51:38 +0000] "POST /api/atlas/entities HTTP/1.1" 201 - "-" "Java/1.8.0_152"
127.0.0.1 - - [22/Feb/2018:04:51:39 +0000] "DELETE /api/atlas/entities?type=hive_db&property=qualifiedName&value=EhwBQGdoa4
HTTP/1.1" 200 - "-" "Java/1.8.0_152"
127.0.0.1 - - [22/Feb/2018:04:51:39 +0000] "GET /api/atlas/entities/5b1df013-e054-46df-b738-6aad47c8cc98
HTTP/1.1" 200 - "-" "Java/1.8.0_152"
127.0.0.1 - - [22/Feb/2018:04:51:39 +0000] "POST /api/atlas/entities HTTP/1.1" 201 - "-" "Java/1.8.0_152"
127.0.0.1 - - [22/Feb/2018:04:51:39 +0000] "POST /api/atlas/entities HTTP/1.1" 201 - "-" "Java/1.8.0_152"
127.0.0.1 - - [22/Feb/2018:04:51:39 +0000] "GET /api/atlas/v2/types/typedef/name/PII_TraittuYbZPWYmk
HTTP/1.1" 404 - "-" "Java/1.8.0_152"
127.0.0.1 - - [22/Feb/2018:04:51:39 +0000] "POST /api/atlas/types HTTP/1.1" 201 - "-" "Java/1.8.0_152"
127.0.0.1 - - [22/Feb/2018:04:51:39 +0000] "POST /api/atlas/entities/bb83ebab-eb35-4a9d-a52e-7e49f54cb6d5/traits
HTTP/1.1" 201 - "-" "Java/1.8.0_152"
127.0.0.1 - - [22/Feb/2018:04:51:39 +0000] "GET /api/atlas/entities/bb83ebab-eb35-4a9d-a52e-7e49f54cb6d5
HTTP/1.1" 200 - "-" "Java/1.8.0_152"
127.0.0.1 - - [22/Feb/2018:04:51:39 +0000] "POST /api/atlas/entities HTTP/1.1" 201 - "-" "Java/1.8.0_152"
127.0.0.1 - - [22/Feb/2018:04:51:39 +0000] "POST /api/atlas/entities HTTP/1.1" 201 - "-" "Java/1.8.0_152"
127.0.0.1 - - [22/Feb/2018:04:51:39 +0000] "PUT /api/atlas/entities HTTP/1.1" 200 - "-" "Java/1.8.0_152"
127.0.0.1 - - [22/Feb/2018:04:51:40 +0000] "GET /api/atlas/entities/d81c893b-e104-4311-909b-50855fb8e1c3
HTTP/1.1" 200 - "-" "Java/1.8.0_152"
127.0.0.1 - - [22/Feb/2018:04:51:40 +0000] "GET /api/atlas/v2/types/typedef/name/testyvKyJ2oH18
HTTP/1.1" 404 - "-" "Java/1.8.0_152"
127.0.0.1 - - [22/Feb/2018:04:51:40 +0000] "POST /api/atlas/types HTTP/1.1" 201 - "-" "Java/1.8.0_152"
127.0.0.1 - - [22/Feb/2018:04:51:40 +0000] "GET /api/atlas/entities?type=testyvKyJ2oH18 HTTP/1.1"
200 - "-" "Java/1.8.0_152"
127.0.0.1 - - [22/Feb/2018:04:51:40 +0000] "POST /api/atlas/entities HTTP/1.1" 201 - "-" "Java/1.8.0_152"
127.0.0.1 - - [22/Feb/2018:04:51:40 +0000] "POST /api/atlas/entities HTTP/1.1" 201 - "-" "Java/1.8.0_152"
127.0.0.1 - - [22/Feb/2018:04:51:40 +0000] "GET /api/atlas/entities/0acdcbf7-fc56-48f2-b631-432ef2468b9a
HTTP/1.1" 200 - "-" "Java/1.8.0_152"
127.0.0.1 - - [22/Feb/2018:04:51:40 +0000] "POST /api/atlas/entities HTTP/1.1" 201 - "-" "Java/1.8.0_152"
127.0.0.1 - - [22/Feb/2018:04:51:40 +0000] "POST /api/atlas/entities HTTP/1.1" 201 - "-" "Java/1.8.0_152"
127.0.0.1 - - [22/Feb/2018:04:51:40 +0000] "POST /api/atlas/entities/88162101-96e0-4dd0-88d2-ef4073a8789e?property=description
HTTP/1.1" 200 - "-" "Java/1.8.0_152"
127.0.0.1 - - [22/Feb/2018:04:51:40 +0000] "GET /api/atlas/entities/88162101-96e0-4dd0-88d2-ef4073a8789e
HTTP/1.1" 200 - "-" "Java/1.8.0_152"
127.0.0.1 - - [22/Feb/2018:04:51:40 +0000] "POST /api/atlas/entities/88162101-96e0-4dd0-88d2-ef4073a8789e?property=invalid_property
HTTP/1.1" 400 - "-" "Java/1.8.0_152"
127.0.0.1 - - [22/Feb/2018:04:51:40 +0000] "GET /api/atlas/entities/88162101-96e0-4dd0-88d2-ef4073a8789e
HTTP/1.1" 200 - "-" "Java/1.8.0_152"
127.0.0.1 - - [22/Feb/2018:04:51:58 +0000] "GET /api/atlas/admin/status HTTP/1.1" 200 - "-"
"Java/1.8.0_152"
127.0.0.1 - - [22/Feb/2018:04:51:58 +0000] "GET /api/atlas/v1/taxonomies HTTP/1.1" 403 493
"-" "Java/1.8.0_152"
127.0.0.1 - - [22/Feb/2018:04:51:58 +0000] "GET /api/atlas/admin/session HTTP/1.1" 200 - "-"
"Java/1.8.0_152"
127.0.0.1 - - [22/Feb/2018:04:51:58 +0000] "GET /api/atlas/admin/session HTTP/1.1" 401 317
"-" "Java/1.8.0_152"
Tests run: 142, Failures: 1, Errors: 0, Skipped: 21, Time elapsed: 107.754 sec <<<
FAILURE! - in TestSuite
setUp(org.apache.atlas.notification.NotificationHookConsumerIT)  Time elapsed: 0.417 sec 
<<< FAILURE!
org.apache.atlas.AtlasException: Failed to start embedded kafka
	at sun.nio.ch.Net.bind0(Native Method)
	at sun.nio.ch.Net.bind(Net.java:433)
	at sun.nio.ch.Net.bind(Net.java:425)
	at sun.nio.ch.ServerSocketChannelImpl.bind(ServerSocketChannelImpl.java:223)
	at sun.nio.ch.ServerSocketAdaptor.bind(ServerSocketAdaptor.java:74)
	at sun.nio.ch.ServerSocketAdaptor.bind(ServerSocketAdaptor.java:67)
	at org.apache.zookeeper.server.NIOServerCnxnFactory.configure(NIOServerCnxnFactory.java:95)
	at org.apache.zookeeper.server.ServerCnxnFactory.createFactory(ServerCnxnFactory.java:126)
	at org.apache.atlas.kafka.EmbeddedKafkaServer.startZk(EmbeddedKafkaServer.java:113)
	at org.apache.atlas.kafka.EmbeddedKafkaServer.start(EmbeddedKafkaServer.java:77)
	at org.apache.atlas.web.integration.BaseResourceIT.initNotificationService(BaseResourceIT.java:699)
	at org.apache.atlas.notification.NotificationHookConsumerIT.setUp(NotificationHookConsumerIT.java:53)


Results :

Failed tests: 
  NotificationHookConsumerIT.setUp:53->BaseResourceIT.initNotificationService:699 »
Atlas

Tests run: 142, Failures: 1, Errors: 0, Skipped: 21

[INFO] 
[INFO] --- jetty-maven-plugin:9.2.12.v20150709:stop (stop-jetty) @ atlas-webapp ---
[INFO] Waiting 10 seconds for jetty to stop
[INFO] Stopped ServerConnector@c944180{HTTP/1.1}{0.0.0.0:31000}
[INFO] Closing Spring root WebApplicationContext
[INFO] Shutting down log4j
[INFO] Not cleaning cached beans: no such field javax.el.BeanELResolver.properties
[INFO] Stopped o.e.j.m.p.JettyWebAppContext@3cc93c01{/,<https://builds.apache.org/job/Atlas-0.8-IntegrationTests/ws/webapp/target/atlas-webapp-0.8.3-SNAPSHOT/,UNAVAILABLE}{/home/jenkins/jenkins-slave/workspace/Atlas-0.8-IntegrationTests/webapp/target/atlas-webapp-0.8.3-SNAPSHOT.war}>
[INFO] Server reports itself as stopped
[INFO] 
[INFO] --- maven-source-plugin:2.4:jar-no-fork (attach-sources) @ atlas-webapp ---
[INFO] Building jar: <https://builds.apache.org/job/Atlas-0.8-IntegrationTests/ws/webapp/target/atlas-webapp-0.8.3-SNAPSHOT-sources.jar>
[INFO] 
[INFO] --- maven-source-plugin:2.4:test-jar-no-fork (attach-sources) @ atlas-webapp ---
[INFO] Building jar: <https://builds.apache.org/job/Atlas-0.8-IntegrationTests/ws/webapp/target/atlas-webapp-0.8.3-SNAPSHOT-test-sources.jar>
[INFO] 
[INFO] --- maven-failsafe-plugin:2.18.1:verify (verify) @ atlas-webapp ---
[INFO] Failsafe report directory: <https://builds.apache.org/job/Atlas-0.8-IntegrationTests/ws/webapp/target/failsafe-reports>
[INFO] ------------------------------------------------------------------------
[INFO] Reactor Summary:
[INFO] 
[INFO] Apache Atlas Server Build Tools .................... SUCCESS [  8.660 s]
[INFO] apache-atlas ....................................... SUCCESS [ 42.945 s]
[INFO] Apache Atlas Integration ........................... SUCCESS [ 51.551 s]
[INFO] Apache Atlas Common ................................ SUCCESS [  9.681 s]
[INFO] Apache Atlas Typesystem ............................ SUCCESS [ 50.768 s]
[INFO] Apache Atlas Client ................................ SUCCESS [  0.829 s]
[INFO] atlas-client-common ................................ SUCCESS [  7.803 s]
[INFO] atlas-client-v1 .................................... SUCCESS [  8.044 s]
[INFO] Apache Atlas Server API ............................ SUCCESS [  6.822 s]
[INFO] Apache Atlas Notification .......................... SUCCESS [ 11.415 s]
[INFO] atlas-client-v2 .................................... SUCCESS [  6.450 s]
[INFO] Apache Atlas Graph Database Projects ............... SUCCESS [  0.568 s]
[INFO] Apache Atlas Graph Database API .................... SUCCESS [  5.569 s]
[INFO] Graph Database Common Code ......................... SUCCESS [  5.701 s]
[INFO] Apache Atlas Titan 1.0.0 GraphDB Impl .............. SUCCESS [ 40.679 s]
[INFO] Shaded version of Apache hbase client .............. SUCCESS [  8.760 s]
[INFO] Apache Atlas Titan 0.5.4 Graph DB Impl ............. SUCCESS [ 36.500 s]
[INFO] Apache Atlas Graph Database Implementation Dependencies SUCCESS [  0.658 s]
[INFO] Shaded version of Apache hbase server .............. SUCCESS [ 22.393 s]
[INFO] Apache Atlas Repository ............................ SUCCESS [01:16 min]
[INFO] Apache Atlas Authorization ......................... SUCCESS [  6.380 s]
[INFO] Apache Atlas Business Catalog ...................... SUCCESS [ 10.275 s]
[INFO] Apache Atlas UI .................................... SUCCESS [01:16 min]
[INFO] Apache Atlas Web Application ....................... FAILURE [03:23 min]
[INFO] Apache Atlas Documentation ......................... SKIPPED
[INFO] Apache Atlas FileSystem Model ...................... SKIPPED
[INFO] Apache Atlas Plugin Classloader .................... SKIPPED
[INFO] Apache Atlas Hive Bridge Shim ...................... SKIPPED
[INFO] Apache Atlas Hive Bridge ........................... SKIPPED
[INFO] Apache Atlas Falcon Bridge Shim .................... SKIPPED
[INFO] Apache Atlas Falcon Bridge ......................... SKIPPED
[INFO] Apache Atlas Sqoop Bridge Shim ..................... SKIPPED
[INFO] Apache Atlas Sqoop Bridge .......................... SKIPPED
[INFO] Apache Atlas Storm Bridge Shim ..................... SKIPPED
[INFO] Apache Atlas Storm Bridge .......................... SKIPPED
[INFO] Apache Atlas Hbase Bridge Shim ..................... SKIPPED
[INFO] Apache Atlas Hbase Bridge .......................... SKIPPED
[INFO] Apache Atlas Distribution .......................... SKIPPED
[INFO] ------------------------------------------------------------------------
[INFO] BUILD FAILURE
[INFO] ------------------------------------------------------------------------
[INFO] Total time: 11:56 min
[INFO] Finished at: 2018-02-22T04:52:06Z
[INFO] Final Memory: 367M/2984M
[INFO] ------------------------------------------------------------------------
log4j:WARN No appenders could be found for logger (org.apache.zookeeper.ClientCnxn).
log4j:WARN Please initialize the log4j system properly.
log4j:WARN See http://logging.apache.org/log4j/1.2/faq.html#noconfig for more info.
[ERROR] Failed to execute goal org.apache.maven.plugins:maven-failsafe-plugin:2.18.1:verify
(verify) on project atlas-webapp: There are test failures.
[ERROR] 
[ERROR] Please refer to <https://builds.apache.org/job/Atlas-0.8-IntegrationTests/ws/webapp/target/failsafe-reports>
for the individual test results.
[ERROR] -> [Help 1]
[ERROR] 
[ERROR] To see the full stack trace of the errors, re-run Maven with the -e switch.
[ERROR] Re-run Maven using the -X switch to enable full debug logging.
[ERROR] 
[ERROR] For more information about the errors and possible solutions, please read the following
articles:
[ERROR] [Help 1] http://cwiki.apache.org/confluence/display/MAVEN/MojoFailureException
[ERROR] 
[ERROR] After correcting the problems, you can resume the build with the command
[ERROR]   mvn <goals> -rf :atlas-webapp
Build step 'Execute shell' marked build as failure
[CHECKSTYLE] Collecting checkstyle analysis files...
[CHECKSTYLE] Searching for all files in <https://builds.apache.org/job/Atlas-0.8-IntegrationTests/ws/>
that match the pattern **/target/checkstyle-result.xml
[CHECKSTYLE] Parsing 22 files in <https://builds.apache.org/job/Atlas-0.8-IntegrationTests/ws/>
[CHECKSTYLE] Successfully parsed file <https://builds.apache.org/job/Atlas-0.8-IntegrationTests/ws/authorization/target/checkstyle-result.xml>
with 471 unique warnings and 0 duplicates.
[CHECKSTYLE] Successfully parsed file <https://builds.apache.org/job/Atlas-0.8-IntegrationTests/ws/catalog/target/checkstyle-result.xml>
with 2608 unique warnings and 0 duplicates.
[CHECKSTYLE] Successfully parsed file <https://builds.apache.org/job/Atlas-0.8-IntegrationTests/ws/client/client-v1/target/checkstyle-result.xml>
with 3484 unique warnings and 0 duplicates.
[CHECKSTYLE] Successfully parsed file <https://builds.apache.org/job/Atlas-0.8-IntegrationTests/ws/client/client-v2/target/checkstyle-result.xml>
with 3814 unique warnings and 0 duplicates.
[CHECKSTYLE] Successfully parsed file <https://builds.apache.org/job/Atlas-0.8-IntegrationTests/ws/client/common/target/checkstyle-result.xml>
with 4304 unique warnings and 0 duplicates.
[CHECKSTYLE] Successfully parsed file <https://builds.apache.org/job/Atlas-0.8-IntegrationTests/ws/client/target/checkstyle-result.xml>
with 4304 unique warnings and 0 duplicates.
[CHECKSTYLE] Successfully parsed file <https://builds.apache.org/job/Atlas-0.8-IntegrationTests/ws/common/target/checkstyle-result.xml>
with 5263 unique warnings and 0 duplicates.
[CHECKSTYLE] Successfully parsed file <https://builds.apache.org/job/Atlas-0.8-IntegrationTests/ws/dashboardv2/target/checkstyle-result.xml>
with 5263 unique warnings and 0 duplicates.
[CHECKSTYLE] Successfully parsed file <https://builds.apache.org/job/Atlas-0.8-IntegrationTests/ws/graphdb/api/target/checkstyle-result.xml>
with 5536 unique warnings and 0 duplicates.
[CHECKSTYLE] Successfully parsed file <https://builds.apache.org/job/Atlas-0.8-IntegrationTests/ws/graphdb/common/target/checkstyle-result.xml>
with 5723 unique warnings and 0 duplicates.
[CHECKSTYLE] Successfully parsed file <https://builds.apache.org/job/Atlas-0.8-IntegrationTests/ws/graphdb/graphdb-impls/target/checkstyle-result.xml>
with 5723 unique warnings and 0 duplicates.
[CHECKSTYLE] Successfully parsed file <https://builds.apache.org/job/Atlas-0.8-IntegrationTests/ws/graphdb/target/checkstyle-result.xml>
with 5723 unique warnings and 0 duplicates.
[CHECKSTYLE] Successfully parsed file <https://builds.apache.org/job/Atlas-0.8-IntegrationTests/ws/graphdb/titan0/target/checkstyle-result.xml>
with 8178 unique warnings and 0 duplicates.
[CHECKSTYLE] Successfully parsed file <https://builds.apache.org/job/Atlas-0.8-IntegrationTests/ws/graphdb/titan1/target/checkstyle-result.xml>
with 9145 unique warnings and 0 duplicates.
[CHECKSTYLE] Successfully parsed file <https://builds.apache.org/job/Atlas-0.8-IntegrationTests/ws/intg/target/checkstyle-result.xml>
with 16065 unique warnings and 0 duplicates.
[CHECKSTYLE] Successfully parsed file <https://builds.apache.org/job/Atlas-0.8-IntegrationTests/ws/notification/target/checkstyle-result.xml>
with 17822 unique warnings and 0 duplicates.
[CHECKSTYLE] Successfully parsed file <https://builds.apache.org/job/Atlas-0.8-IntegrationTests/ws/repository/target/checkstyle-result.xml>
with 36832 unique warnings and 0 duplicates.
[CHECKSTYLE] Successfully parsed file <https://builds.apache.org/job/Atlas-0.8-IntegrationTests/ws/server-api/target/checkstyle-result.xml>
with 37225 unique warnings and 0 duplicates.
[CHECKSTYLE] Successfully parsed file <https://builds.apache.org/job/Atlas-0.8-IntegrationTests/ws/shaded/hbase-client-shaded/target/checkstyle-result.xml>
with 37225 unique warnings and 0 duplicates.
[CHECKSTYLE] Successfully parsed file <https://builds.apache.org/job/Atlas-0.8-IntegrationTests/ws/shaded/hbase-server-shaded/target/checkstyle-result.xml>
with 37225 unique warnings and 0 duplicates.
[CHECKSTYLE] Successfully parsed file <https://builds.apache.org/job/Atlas-0.8-IntegrationTests/ws/target/checkstyle-result.xml>
with 37225 unique warnings and 0 duplicates.
[CHECKSTYLE] Successfully parsed file <https://builds.apache.org/job/Atlas-0.8-IntegrationTests/ws/typesystem/target/checkstyle-result.xml>
with 41466 unique warnings and 0 duplicates.
<Git Blamer> Using GitBlamer to create author and commit information for all warnings.
<Git Blamer> GIT_COMMIT=0dae3e8e3a8973f938a91e8ea1f9e51bbc3bdf4b, workspace=<https://builds.apache.org/job/Atlas-0.8-IntegrationTests/ws/>
 > git rev-parse 0dae3e8e3a8973f938a91e8ea1f9e51bbc3bdf4b^{commit} # timeout=10
[FINDBUGS] Collecting findbugs analysis files...
[FINDBUGS] Searching for all files in <https://builds.apache.org/job/Atlas-0.8-IntegrationTests/ws/>
that match the pattern **/target/findbugs.xml
[FINDBUGS] Parsing 15 files in <https://builds.apache.org/job/Atlas-0.8-IntegrationTests/ws/>
[FINDBUGS] Successfully parsed file <https://builds.apache.org/job/Atlas-0.8-IntegrationTests/ws/authorization/target/findbugs.xml>
with 0 unique warnings and 0 duplicates.
[FINDBUGS] Successfully parsed file <https://builds.apache.org/job/Atlas-0.8-IntegrationTests/ws/catalog/target/findbugs.xml>
with 0 unique warnings and 0 duplicates.
[FINDBUGS] Successfully parsed file <https://builds.apache.org/job/Atlas-0.8-IntegrationTests/ws/client/client-v1/target/findbugs.xml>
with 0 unique warnings and 0 duplicates.
[FINDBUGS] Successfully parsed file <https://builds.apache.org/job/Atlas-0.8-IntegrationTests/ws/client/client-v2/target/findbugs.xml>
with 0 unique warnings and 0 duplicates.
[FINDBUGS] Successfully parsed file <https://builds.apache.org/job/Atlas-0.8-IntegrationTests/ws/client/common/target/findbugs.xml>
with 0 unique warnings and 0 duplicates.
[FINDBUGS] Successfully parsed file <https://builds.apache.org/job/Atlas-0.8-IntegrationTests/ws/common/target/findbugs.xml>
with 0 unique warnings and 0 duplicates.
[FINDBUGS] Successfully parsed file <https://builds.apache.org/job/Atlas-0.8-IntegrationTests/ws/graphdb/api/target/findbugs.xml>
with 0 unique warnings and 0 duplicates.
[FINDBUGS] Successfully parsed file <https://builds.apache.org/job/Atlas-0.8-IntegrationTests/ws/graphdb/common/target/findbugs.xml>
with 0 unique warnings and 0 duplicates.
[FINDBUGS] Successfully parsed file <https://builds.apache.org/job/Atlas-0.8-IntegrationTests/ws/graphdb/titan0/target/findbugs.xml>
with 0 unique warnings and 0 duplicates.
[FINDBUGS] Successfully parsed file <https://builds.apache.org/job/Atlas-0.8-IntegrationTests/ws/graphdb/titan1/target/findbugs.xml>
with 0 unique warnings and 0 duplicates.
[FINDBUGS] Successfully parsed file <https://builds.apache.org/job/Atlas-0.8-IntegrationTests/ws/intg/target/findbugs.xml>
with 0 unique warnings and 0 duplicates.
[FINDBUGS] Successfully parsed file <https://builds.apache.org/job/Atlas-0.8-IntegrationTests/ws/notification/target/findbugs.xml>
with 0 unique warnings and 0 duplicates.
[FINDBUGS] Successfully parsed file <https://builds.apache.org/job/Atlas-0.8-IntegrationTests/ws/repository/target/findbugs.xml>
with 0 unique warnings and 0 duplicates.
[FINDBUGS] Successfully parsed file <https://builds.apache.org/job/Atlas-0.8-IntegrationTests/ws/server-api/target/findbugs.xml>
with 0 unique warnings and 0 duplicates.
[FINDBUGS] Successfully parsed file <https://builds.apache.org/job/Atlas-0.8-IntegrationTests/ws/typesystem/target/findbugs.xml>
with 0 unique warnings and 0 duplicates.
<Git Blamer> Using GitBlamer to create author and commit information for all warnings.
<Git Blamer> GIT_COMMIT=0dae3e8e3a8973f938a91e8ea1f9e51bbc3bdf4b, workspace=<https://builds.apache.org/job/Atlas-0.8-IntegrationTests/ws/>
Archiving artifacts
[Fast Archiver] No prior successful build to compare, so performing full copy of artifacts
TestNG Reports Processing: START
Looking for TestNG results report in workspace using pattern: **/target/surefire-reports/testng-results.xml,**/target/failsafe-reports/testng-results.xml
Saving reports...
Processing '/x1/jenkins/jenkins-home/jobs/Atlas-0.8-IntegrationTests/builds/180/testng/testng-results.xml'
TestNG Reports Processing: FINISH

Mime
View raw message