atlas-dev mailing list archives

Site index · List index
Message view « Date » · « Thread »
Top « Date » · « Thread »
From Apache Jenkins Server <jenk...@builds.apache.org>
Subject Build failed in Jenkins: Atlas-master-IntegrationTests #524
Date Wed, 14 Feb 2018 23:04:08 GMT
See <https://builds.apache.org/job/Atlas-master-IntegrationTests/524/display/redirect?page=changes>

Changes:

[madhan] ATLAS-2444: Atlas changes for HDFS NameNode federation

------------------------------------------
[...truncated 625.61 KB...]
	at org.apache.atlas.hive.HiveITBase$1.evaluate(HiveITBase.java:168)
	at org.apache.atlas.hive.HiveITBase.waitFor(HiveITBase.java:205)
	at org.apache.atlas.hive.HiveITBase.assertEntityIsRegistered(HiveITBase.java:165)
	at org.apache.atlas.hive.HiveITBase.assertTableIsRegistered(HiveITBase.java:159)
	at org.apache.atlas.hive.HiveITBase.assertTableIsRegistered(HiveITBase.java:153)
	at org.apache.atlas.hive.hook.HiveHookIT.testDropView(HiveHookIT.java:1528)

testExportImportPartitionedTable(org.apache.atlas.hive.hook.HiveHookIT)  Time elapsed: 10.788
sec  <<< FAILURE!
java.lang.AssertionError: expected [pfile:/home/jenkins/jenkins-slave/workspace/atlas-master-integrationtests/addons/hive-bridge/target/export-data-5sfxxwsamw]
but found [pfile:/home/jenkins/jenkins-slave/workspace/atlas-master-integrationtests/addons/hive-bridge/target/export-data-5sfxxwsamw@primary]
	at org.testng.Assert.fail(Assert.java:94)
	at org.testng.Assert.failNotEquals(Assert.java:496)
	at org.testng.Assert.assertEquals(Assert.java:125)
	at org.testng.Assert.assertEquals(Assert.java:167)
	at org.apache.atlas.hive.hook.HiveHookIT.validateTables(HiveHookIT.java:270)
	at org.apache.atlas.hive.hook.HiveHookIT.validateOutputTables(HiveHookIT.java:253)
	at org.apache.atlas.hive.hook.HiveHookIT.validateProcess(HiveHookIT.java:498)
	at org.apache.atlas.hive.hook.HiveHookIT.testExportImportPartitionedTable(HiveHookIT.java:789)

testExportImportUnPartitionedTable(org.apache.atlas.hive.hook.HiveHookIT)  Time elapsed: 85.543
sec  <<< FAILURE!
java.lang.AssertionError: Assertions failed. Failing after waiting for timeout 80000 msecs
	at org.apache.atlas.AtlasBaseClient.callAPIWithResource(AtlasBaseClient.java:388)
	at org.apache.atlas.AtlasBaseClient.callAPIWithResource(AtlasBaseClient.java:323)
	at org.apache.atlas.AtlasBaseClient.callAPIWithRetries(AtlasBaseClient.java:472)
	at org.apache.atlas.AtlasClient.callAPIWithRetries(AtlasClient.java:931)
	at org.apache.atlas.AtlasClient.getEntity(AtlasClient.java:640)
	at org.apache.atlas.hive.HiveITBase$1.evaluate(HiveITBase.java:168)
	at org.apache.atlas.hive.HiveITBase.waitFor(HiveITBase.java:205)
	at org.apache.atlas.hive.HiveITBase.assertEntityIsRegistered(HiveITBase.java:165)
	at org.apache.atlas.hive.hook.HiveHookIT.assertProcessIsRegistered(HiveHookIT.java:1737)
	at org.apache.atlas.hive.hook.HiveHookIT.validateProcess(HiveHookIT.java:485)
	at org.apache.atlas.hive.hook.HiveHookIT.validateProcess(HiveHookIT.java:505)
	at org.apache.atlas.hive.hook.HiveHookIT.testExportImportUnPartitionedTable(HiveHookIT.java:736)

testInsertIntoDFSDirPartitioned(org.apache.atlas.hive.hook.HiveHookIT)  Time elapsed: 7.4
sec  <<< FAILURE!
java.lang.AssertionError: expected [pfile:/home/jenkins/jenkins-slave/workspace/atlas-master-integrationtests/addons/hive-bridge/target/somedfspath1-data-fnoeh2qkhl]
but found [pfile:/home/jenkins/jenkins-slave/workspace/atlas-master-integrationtests/addons/hive-bridge/target/somedfspath1-data-fnoeh2qkhl@primary]
	at org.testng.Assert.fail(Assert.java:94)
	at org.testng.Assert.failNotEquals(Assert.java:496)
	at org.testng.Assert.assertEquals(Assert.java:125)
	at org.testng.Assert.assertEquals(Assert.java:167)
	at org.apache.atlas.hive.hook.HiveHookIT.validateTables(HiveHookIT.java:270)
	at org.apache.atlas.hive.hook.HiveHookIT.validateOutputTables(HiveHookIT.java:253)
	at org.apache.atlas.hive.hook.HiveHookIT.validateProcess(HiveHookIT.java:498)
	at org.apache.atlas.hive.hook.HiveHookIT.testInsertIntoDFSDirPartitioned(HiveHookIT.java:636)

testLoadDFSPathPartitioned(org.apache.atlas.hive.hook.HiveHookIT)  Time elapsed: 10.607 sec
 <<< FAILURE!
java.lang.AssertionError: expected [pfile:/home/jenkins/jenkins-slave/workspace/atlas-master-integrationtests/addons/hive-bridge/target/loaddfsfile-data-p9b6n2biuw]
but found [pfile:/home/jenkins/jenkins-slave/workspace/atlas-master-integrationtests/addons/hive-bridge/target/loaddfsfile-data-p9b6n2biuw@primary]
	at org.testng.Assert.fail(Assert.java:94)
	at org.testng.Assert.failNotEquals(Assert.java:496)
	at org.testng.Assert.assertEquals(Assert.java:125)
	at org.testng.Assert.assertEquals(Assert.java:167)
	at org.apache.atlas.hive.hook.HiveHookIT.validateTables(HiveHookIT.java:270)
	at org.apache.atlas.hive.hook.HiveHookIT.validateInputTables(HiveHookIT.java:257)
	at org.apache.atlas.hive.hook.HiveHookIT.validateProcess(HiveHookIT.java:491)
	at org.apache.atlas.hive.hook.HiveHookIT.testLoadDFSPathPartitioned(HiveHookIT.java:458)

testUpdateProcess(org.apache.atlas.hive.hook.HiveHookIT)  Time elapsed: 6.974 sec  <<<
FAILURE!
java.lang.AssertionError: expected [pfile:/home/jenkins/jenkins-slave/workspace/atlas-master-integrationtests/addons/hive-bridge/target/somedfspath1-data-ataqu5m4zp]
but found [pfile:/home/jenkins/jenkins-slave/workspace/atlas-master-integrationtests/addons/hive-bridge/target/somedfspath1-data-ataqu5m4zp@primary]
	at org.testng.Assert.fail(Assert.java:94)
	at org.testng.Assert.failNotEquals(Assert.java:496)
	at org.testng.Assert.assertEquals(Assert.java:125)
	at org.testng.Assert.assertEquals(Assert.java:167)
	at org.apache.atlas.hive.hook.HiveHookIT.validateTables(HiveHookIT.java:270)
	at org.apache.atlas.hive.hook.HiveHookIT.validateOutputTables(HiveHookIT.java:253)
	at org.apache.atlas.hive.hook.HiveHookIT.validateProcess(HiveHookIT.java:498)
	at org.apache.atlas.hive.hook.HiveHookIT.validateProcess(HiveHookIT.java:505)
	at org.apache.atlas.hive.hook.HiveHookIT.testUpdateProcess(HiveHookIT.java:588)

testCreateTableAndImport(org.apache.atlas.hive.bridge.HiveMetastoreBridgeIT)  Time elapsed:
85.437 sec  <<< FAILURE!
java.lang.AssertionError: Assertions failed. Failing after waiting for timeout 80000 msecs
	at org.apache.atlas.AtlasBaseClient.callAPIWithResource(AtlasBaseClient.java:388)
	at org.apache.atlas.AtlasBaseClient.callAPIWithResource(AtlasBaseClient.java:323)
	at org.apache.atlas.AtlasBaseClient.callAPIWithRetries(AtlasBaseClient.java:472)
	at org.apache.atlas.AtlasClient.callAPIWithRetries(AtlasClient.java:931)
	at org.apache.atlas.AtlasClient.getEntity(AtlasClient.java:640)
	at org.apache.atlas.hive.HiveITBase$1.evaluate(HiveITBase.java:168)
	at org.apache.atlas.hive.HiveITBase.waitFor(HiveITBase.java:205)
	at org.apache.atlas.hive.HiveITBase.assertEntityIsRegistered(HiveITBase.java:165)
	at org.apache.atlas.hive.HiveITBase.assertHDFSPathIsRegistered(HiveITBase.java:240)
	at org.apache.atlas.hive.HiveITBase.validateHDFSPaths(HiveITBase.java:228)
	at org.apache.atlas.hive.bridge.HiveMetastoreBridgeIT.testCreateTableAndImport(HiveMetastoreBridgeIT.java:49)


Results :

Failed tests: 
  HiveMetastoreBridgeIT.testCreateTableAndImport:49->HiveITBase.validateHDFSPaths:228->HiveITBase.assertHDFSPathIsRegistered:240->HiveITBase.assertEntityIsRegistered:165->HiveITBase.waitFor:209
Assertions failed. Failing after waiting for timeout 80000 msecs
  HiveHookIT.testAlterTableLocation:1296->HiveITBase.validateHDFSPaths:228->HiveITBase.assertHDFSPathIsRegistered:240->HiveITBase.assertEntityIsRegistered:165->HiveITBase.waitFor:209
Assertions failed. Failing after waiting for timeout 80000 msecs
  HiveHookIT.testAlterViewAsSelect:379->assertProcessIsRegistered:1712->HiveITBase.assertEntityIsRegistered:165->HiveITBase.waitFor:209
Assertions failed. Failing after waiting for timeout 80000 msecs
  HiveHookIT.testAlterViewProperties:1639->testAlterProperties:1612->verifyEntityProperties:1646->assertTableIsRegistered:1804->HiveITBase.assertTableIsRegistered:159->HiveITBase.assertEntityIsRegistered:165->HiveITBase.waitFor:209
Assertions failed. Failing after waiting for timeout 80000 msecs
  HiveHookIT.testAlterViewRename:1270->HiveITBase.assertTableIsRegistered:153->HiveITBase.assertTableIsRegistered:159->HiveITBase.assertEntityIsRegistered:165->HiveITBase.waitFor:209
Assertions failed. Failing after waiting for timeout 80000 msecs
  HiveHookIT.testCreateView:366->assertProcessIsRegistered:1712->HiveITBase.assertEntityIsRegistered:165->HiveITBase.waitFor:209
Assertions failed. Failing after waiting for timeout 80000 msecs
  HiveHookIT.testDropView:1528->HiveITBase.assertTableIsRegistered:153->HiveITBase.assertTableIsRegistered:159->HiveITBase.assertEntityIsRegistered:165->HiveITBase.waitFor:209
Assertions failed. Failing after waiting for timeout 80000 msecs
  HiveHookIT.testExportImportPartitionedTable:789->validateProcess:498->validateOutputTables:253->validateTables:270
expected [pfile:/home/jenkins/jenkins-slave/workspace/atlas-master-integrationtests/addons/hive-bridge/target/export-data-5sfxxwsamw]
but found [pfile:/home/jenkins/jenkins-slave/workspace/atlas-master-integrationtests/addons/hive-bridge/target/export-data-5sfxxwsamw@primary]
  HiveHookIT.testExportImportUnPartitionedTable:736->validateProcess:505->validateProcess:485->assertProcessIsRegistered:1737->HiveITBase.assertEntityIsRegistered:165->HiveITBase.waitFor:209
Assertions failed. Failing after waiting for timeout 80000 msecs
  HiveHookIT.testInsertIntoDFSDirPartitioned:636->validateProcess:498->validateOutputTables:253->validateTables:270
expected [pfile:/home/jenkins/jenkins-slave/workspace/atlas-master-integrationtests/addons/hive-bridge/target/somedfspath1-data-fnoeh2qkhl]
but found [pfile:/home/jenkins/jenkins-slave/workspace/atlas-master-integrationtests/addons/hive-bridge/target/somedfspath1-data-fnoeh2qkhl@primary]
  HiveHookIT.testLoadDFSPathPartitioned:458->validateProcess:491->validateInputTables:257->validateTables:270
expected [pfile:/home/jenkins/jenkins-slave/workspace/atlas-master-integrationtests/addons/hive-bridge/target/loaddfsfile-data-p9b6n2biuw]
but found [pfile:/home/jenkins/jenkins-slave/workspace/atlas-master-integrationtests/addons/hive-bridge/target/loaddfsfile-data-p9b6n2biuw@primary]
  HiveHookIT.testUpdateProcess:588->validateProcess:505->validateProcess:498->validateOutputTables:253->validateTables:270
expected [pfile:/home/jenkins/jenkins-slave/workspace/atlas-master-integrationtests/addons/hive-bridge/target/somedfspath1-data-ataqu5m4zp]
but found [pfile:/home/jenkins/jenkins-slave/workspace/atlas-master-integrationtests/addons/hive-bridge/target/somedfspath1-data-ataqu5m4zp@primary]

Tests run: 45, Failures: 12, Errors: 0, Skipped: 0

[INFO] 
[INFO] --- jetty-maven-plugin:9.3.14.v20161028:stop (stop-jetty) @ hive-bridge ---
[INFO] Waiting 10 seconds for jetty to stop
[INFO] Stopped ServerConnector@152340ea{HTTP/1.1,[http/1.1]}{0.0.0.0:31000}
[INFO] Closing Spring root WebApplicationContext
[INFO] Shutting down log4j
[INFO] Stopped o.e.j.m.p.JettyWebAppContext@f251715{/,file://<https://builds.apache.org/job/Atlas-master-IntegrationTests/ws/webapp/target/atlas-webapp-1.0.0-SNAPSHOT/,UNAVAILABLE}{/home/jenkins/jenkins-slave/workspace/Atlas-master-IntegrationTests/webapp/target/atlas-webapp-1.0.0-SNAPSHOT.war}>
[INFO] Server reports itself as stopped
[INFO] 
[INFO] --- maven-source-plugin:2.4:jar-no-fork (attach-sources) @ hive-bridge ---
[INFO] Building jar: <https://builds.apache.org/job/Atlas-master-IntegrationTests/ws/addons/hive-bridge/target/hive-bridge-1.0.0-SNAPSHOT-sources.jar>
[INFO] 
[INFO] --- maven-source-plugin:2.4:test-jar-no-fork (attach-sources) @ hive-bridge ---
[INFO] Building jar: <https://builds.apache.org/job/Atlas-master-IntegrationTests/ws/addons/hive-bridge/target/hive-bridge-1.0.0-SNAPSHOT-test-sources.jar>
[INFO] 
[INFO] --- maven-failsafe-plugin:2.18.1:verify (verify) @ hive-bridge ---
[INFO] Failsafe report directory: <https://builds.apache.org/job/Atlas-master-IntegrationTests/ws/addons/hive-bridge/target/failsafe-reports>
[INFO] ------------------------------------------------------------------------
[INFO] Reactor Summary:
[INFO] 
[INFO] Apache Atlas Server Build Tools .................... SUCCESS [  0.519 s]
[INFO] apache-atlas ....................................... SUCCESS [  3.473 s]
[INFO] Apache Atlas Test Utility Tools .................... SUCCESS [  9.574 s]
[INFO] Open Connector Framework (OCF) ..................... SUCCESS [  9.659 s]
[INFO] Apache Atlas Integration ........................... SUCCESS [ 17.981 s]
[INFO] Apache Atlas Common ................................ SUCCESS [  7.986 s]
[INFO] Apache Atlas Client ................................ SUCCESS [  0.485 s]
[INFO] atlas-client-common ................................ SUCCESS [  5.851 s]
[INFO] atlas-client-v1 .................................... SUCCESS [  6.290 s]
[INFO] Apache Atlas Server API ............................ SUCCESS [  5.425 s]
[INFO] Apache Atlas Notification .......................... SUCCESS [  7.891 s]
[INFO] atlas-client-v2 .................................... SUCCESS [  5.316 s]
[INFO] Apache Atlas Graph Database Projects ............... SUCCESS [  0.425 s]
[INFO] Apache Atlas Graph Database API .................... SUCCESS [  4.568 s]
[INFO] Graph Database Common Code ......................... SUCCESS [  4.589 s]
[INFO] Apache Atlas JanusGraph DB Impl .................... SUCCESS [ 10.187 s]
[INFO] Apache Atlas Graph Database Implementation Dependencies SUCCESS [  1.843 s]
[INFO] Shaded version of Apache hbase client .............. SUCCESS [  8.010 s]
[INFO] Apache Atlas Titan 0.5.4 Graph DB Impl ............. SUCCESS [ 35.698 s]
[INFO] Shaded version of Apache hbase server .............. SUCCESS [ 19.217 s]
[INFO] Apache Atlas Repository ............................ SUCCESS [ 26.200 s]
[INFO] Apache Atlas Authorization ......................... SUCCESS [  6.441 s]
[INFO] Apache Atlas UI .................................... SUCCESS [01:15 min]
[INFO] Apache Atlas Web Application ....................... SUCCESS [02:35 min]
[INFO] Apache Atlas Documentation ......................... SUCCESS [  2.840 s]
[INFO] Apache Atlas FileSystem Model ...................... SUCCESS [  2.194 s]
[INFO] Apache Atlas Plugin Classloader .................... SUCCESS [  5.656 s]
[INFO] Apache Atlas Hive Bridge Shim ...................... SUCCESS [  4.762 s]
[INFO] Apache Atlas Hive Bridge ........................... FAILURE [16:02 min]
[INFO] Apache Atlas Falcon Bridge Shim .................... SKIPPED
[INFO] Apache Atlas Falcon Bridge ......................... SKIPPED
[INFO] Apache Atlas Sqoop Bridge Shim ..................... SKIPPED
[INFO] Apache Atlas Sqoop Bridge .......................... SKIPPED
[INFO] Apache Atlas Storm Bridge Shim ..................... SKIPPED
[INFO] Apache Atlas Storm Bridge .......................... SKIPPED
[INFO] Apache Atlas Hbase Bridge Shim ..................... SKIPPED
[INFO] Apache Atlas Hbase Bridge .......................... SKIPPED
[INFO] Apache Atlas Distribution .......................... SKIPPED
[INFO] ------------------------------------------------------------------------
[INFO] BUILD FAILURE
[INFO] ------------------------------------------------------------------------
[INFO] Total time: 23:28 min
[INFO] Finished at: 2018-02-14T22:56:48Z
[INFO] Final Memory: 565M/3039M
[INFO] ------------------------------------------------------------------------
log4j:WARN No appenders could be found for logger (org.apache.zookeeper.ClientCnxn).
log4j:WARN Please initialize the log4j system properly.
log4j:WARN See http://logging.apache.org/log4j/1.2/faq.html#noconfig for more info.
[ERROR] Failed to execute goal org.apache.maven.plugins:maven-failsafe-plugin:2.18.1:verify
(verify) on project hive-bridge: There are test failures.
[ERROR] 
[ERROR] Please refer to <https://builds.apache.org/job/Atlas-master-IntegrationTests/ws/addons/hive-bridge/target/failsafe-reports>
for the individual test results.
[ERROR] -> [Help 1]
[ERROR] 
[ERROR] To see the full stack trace of the errors, re-run Maven with the -e switch.
[ERROR] Re-run Maven using the -X switch to enable full debug logging.
[ERROR] 
[ERROR] For more information about the errors and possible solutions, please read the following
articles:
[ERROR] [Help 1] http://cwiki.apache.org/confluence/display/MAVEN/MojoFailureException
[ERROR] 
[ERROR] After correcting the problems, you can resume the build with the command
[ERROR]   mvn <goals> -rf :hive-bridge
Build step 'Execute shell' marked build as failure
[CHECKSTYLE] Collecting checkstyle analysis files...
[CHECKSTYLE] Searching for all files in <https://builds.apache.org/job/Atlas-master-IntegrationTests/ws/>
that match the pattern **/target/checkstyle-result.xml
[CHECKSTYLE] Parsing 27 files in <https://builds.apache.org/job/Atlas-master-IntegrationTests/ws/>
[CHECKSTYLE] Successfully parsed file <https://builds.apache.org/job/Atlas-master-IntegrationTests/ws/addons/hdfs-model/target/checkstyle-result.xml>
with 0 unique warnings and 0 duplicates.
[CHECKSTYLE] Successfully parsed file <https://builds.apache.org/job/Atlas-master-IntegrationTests/ws/addons/hive-bridge-shim/target/checkstyle-result.xml>
with 15 unique warnings and 0 duplicates.
[CHECKSTYLE] Successfully parsed file <https://builds.apache.org/job/Atlas-master-IntegrationTests/ws/authorization/target/checkstyle-result.xml>
with 476 unique warnings and 0 duplicates.
[CHECKSTYLE] Successfully parsed file <https://builds.apache.org/job/Atlas-master-IntegrationTests/ws/client/client-v1/target/checkstyle-result.xml>
with 1356 unique warnings and 0 duplicates.
[CHECKSTYLE] Successfully parsed file <https://builds.apache.org/job/Atlas-master-IntegrationTests/ws/client/client-v2/target/checkstyle-result.xml>
with 1701 unique warnings and 0 duplicates.
[CHECKSTYLE] Successfully parsed file <https://builds.apache.org/job/Atlas-master-IntegrationTests/ws/client/common/target/checkstyle-result.xml>
with 2189 unique warnings and 0 duplicates.
[CHECKSTYLE] Successfully parsed file <https://builds.apache.org/job/Atlas-master-IntegrationTests/ws/client/target/checkstyle-result.xml>
with 2189 unique warnings and 0 duplicates.
[CHECKSTYLE] Successfully parsed file <https://builds.apache.org/job/Atlas-master-IntegrationTests/ws/common/target/checkstyle-result.xml>
with 3206 unique warnings and 0 duplicates.
[CHECKSTYLE] Successfully parsed file <https://builds.apache.org/job/Atlas-master-IntegrationTests/ws/dashboardv2/target/checkstyle-result.xml>
with 3206 unique warnings and 0 duplicates.
[CHECKSTYLE] Successfully parsed file <https://builds.apache.org/job/Atlas-master-IntegrationTests/ws/docs/target/checkstyle-result.xml>
with 3206 unique warnings and 0 duplicates.
[CHECKSTYLE] Successfully parsed file <https://builds.apache.org/job/Atlas-master-IntegrationTests/ws/graphdb/api/target/checkstyle-result.xml>
with 3482 unique warnings and 0 duplicates.
[CHECKSTYLE] Successfully parsed file <https://builds.apache.org/job/Atlas-master-IntegrationTests/ws/graphdb/common/target/checkstyle-result.xml>
with 3678 unique warnings and 0 duplicates.
[CHECKSTYLE] Successfully parsed file <https://builds.apache.org/job/Atlas-master-IntegrationTests/ws/graphdb/graphdb-impls/target/checkstyle-result.xml>
with 3678 unique warnings and 0 duplicates.
[CHECKSTYLE] Successfully parsed file <https://builds.apache.org/job/Atlas-master-IntegrationTests/ws/graphdb/janus/target/checkstyle-result.xml>
with 4687 unique warnings and 0 duplicates.
[CHECKSTYLE] Successfully parsed file <https://builds.apache.org/job/Atlas-master-IntegrationTests/ws/graphdb/target/checkstyle-result.xml>
with 4687 unique warnings and 0 duplicates.
[CHECKSTYLE] Successfully parsed file <https://builds.apache.org/job/Atlas-master-IntegrationTests/ws/graphdb/titan0/target/checkstyle-result.xml>
with 7153 unique warnings and 0 duplicates.
[CHECKSTYLE] Successfully parsed file <https://builds.apache.org/job/Atlas-master-IntegrationTests/ws/intg/target/checkstyle-result.xml>
with 17737 unique warnings and 0 duplicates.
[CHECKSTYLE] Successfully parsed file <https://builds.apache.org/job/Atlas-master-IntegrationTests/ws/notification/target/checkstyle-result.xml>
with 18972 unique warnings and 0 duplicates.
[CHECKSTYLE] Successfully parsed file <https://builds.apache.org/job/Atlas-master-IntegrationTests/ws/om-fwk-ocf/target/checkstyle-result.xml>
with 23679 unique warnings and 0 duplicates.
[CHECKSTYLE] Successfully parsed file <https://builds.apache.org/job/Atlas-master-IntegrationTests/ws/plugin-classloader/target/checkstyle-result.xml>
with 23792 unique warnings and 0 duplicates.
[CHECKSTYLE] Successfully parsed file <https://builds.apache.org/job/Atlas-master-IntegrationTests/ws/repository/target/checkstyle-result.xml>
with 42393 unique warnings and 0 duplicates.
[CHECKSTYLE] Successfully parsed file <https://builds.apache.org/job/Atlas-master-IntegrationTests/ws/server-api/target/checkstyle-result.xml>
with 42602 unique warnings and 0 duplicates.
[CHECKSTYLE] Successfully parsed file <https://builds.apache.org/job/Atlas-master-IntegrationTests/ws/shaded/hbase-client-shaded/target/checkstyle-result.xml>
with 42602 unique warnings and 0 duplicates.
[CHECKSTYLE] Successfully parsed file <https://builds.apache.org/job/Atlas-master-IntegrationTests/ws/shaded/hbase-server-shaded/target/checkstyle-result.xml>
with 42602 unique warnings and 0 duplicates.
[CHECKSTYLE] Successfully parsed file <https://builds.apache.org/job/Atlas-master-IntegrationTests/ws/target/checkstyle-result.xml>
with 42602 unique warnings and 0 duplicates.
[CHECKSTYLE] Successfully parsed file <https://builds.apache.org/job/Atlas-master-IntegrationTests/ws/test-tools/target/checkstyle-result.xml>
with 42640 unique warnings and 0 duplicates.
[CHECKSTYLE] Successfully parsed file <https://builds.apache.org/job/Atlas-master-IntegrationTests/ws/webapp/target/checkstyle-result.xml>
with 50470 unique warnings and 0 duplicates.
<Git Blamer> Using GitBlamer to create author and commit information for all warnings.
<Git Blamer> GIT_COMMIT=3ec37cae8d8297258334f4489605ff44bffd6f5c, workspace=<https://builds.apache.org/job/Atlas-master-IntegrationTests/ws/>
 > git rev-parse 3ec37cae8d8297258334f4489605ff44bffd6f5c^{commit} # timeout=10
[CHECKSTYLE] Computing warning deltas based on reference build #523
[FINDBUGS] Collecting findbugs analysis files...
[FINDBUGS] Searching for all files in <https://builds.apache.org/job/Atlas-master-IntegrationTests/ws/>
that match the pattern **/target/findbugs.xml
[FINDBUGS] Parsing 18 files in <https://builds.apache.org/job/Atlas-master-IntegrationTests/ws/>
[FINDBUGS] Successfully parsed file <https://builds.apache.org/job/Atlas-master-IntegrationTests/ws/addons/hive-bridge-shim/target/findbugs.xml>
with 0 unique warnings and 0 duplicates.
[FINDBUGS] Successfully parsed file <https://builds.apache.org/job/Atlas-master-IntegrationTests/ws/authorization/target/findbugs.xml>
with 0 unique warnings and 0 duplicates.
[FINDBUGS] Successfully parsed file <https://builds.apache.org/job/Atlas-master-IntegrationTests/ws/client/client-v1/target/findbugs.xml>
with 0 unique warnings and 0 duplicates.
[FINDBUGS] Successfully parsed file <https://builds.apache.org/job/Atlas-master-IntegrationTests/ws/client/client-v2/target/findbugs.xml>
with 0 unique warnings and 0 duplicates.
[FINDBUGS] Successfully parsed file <https://builds.apache.org/job/Atlas-master-IntegrationTests/ws/client/common/target/findbugs.xml>
with 0 unique warnings and 0 duplicates.
[FINDBUGS] Successfully parsed file <https://builds.apache.org/job/Atlas-master-IntegrationTests/ws/common/target/findbugs.xml>
with 0 unique warnings and 0 duplicates.
[FINDBUGS] Successfully parsed file <https://builds.apache.org/job/Atlas-master-IntegrationTests/ws/graphdb/api/target/findbugs.xml>
with 0 unique warnings and 0 duplicates.
[FINDBUGS] Successfully parsed file <https://builds.apache.org/job/Atlas-master-IntegrationTests/ws/graphdb/common/target/findbugs.xml>
with 0 unique warnings and 0 duplicates.
[FINDBUGS] Successfully parsed file <https://builds.apache.org/job/Atlas-master-IntegrationTests/ws/graphdb/janus/target/findbugs.xml>
with 0 unique warnings and 0 duplicates.
[FINDBUGS] Successfully parsed file <https://builds.apache.org/job/Atlas-master-IntegrationTests/ws/graphdb/titan0/target/findbugs.xml>
with 0 unique warnings and 0 duplicates.
[FINDBUGS] Successfully parsed file <https://builds.apache.org/job/Atlas-master-IntegrationTests/ws/intg/target/findbugs.xml>
with 0 unique warnings and 0 duplicates.
[FINDBUGS] Successfully parsed file <https://builds.apache.org/job/Atlas-master-IntegrationTests/ws/notification/target/findbugs.xml>
with 0 unique warnings and 0 duplicates.
[FINDBUGS] Successfully parsed file <https://builds.apache.org/job/Atlas-master-IntegrationTests/ws/om-fwk-ocf/target/findbugs.xml>
with 0 unique warnings and 0 duplicates.
[FINDBUGS] Successfully parsed file <https://builds.apache.org/job/Atlas-master-IntegrationTests/ws/plugin-classloader/target/findbugs.xml>
with 0 unique warnings and 0 duplicates.
[FINDBUGS] Successfully parsed file <https://builds.apache.org/job/Atlas-master-IntegrationTests/ws/repository/target/findbugs.xml>
with 0 unique warnings and 0 duplicates.
[FINDBUGS] Successfully parsed file <https://builds.apache.org/job/Atlas-master-IntegrationTests/ws/server-api/target/findbugs.xml>
with 0 unique warnings and 0 duplicates.
[FINDBUGS] Successfully parsed file <https://builds.apache.org/job/Atlas-master-IntegrationTests/ws/test-tools/target/findbugs.xml>
with 0 unique warnings and 0 duplicates.
[FINDBUGS] Successfully parsed file <https://builds.apache.org/job/Atlas-master-IntegrationTests/ws/webapp/target/findbugs.xml>
with 0 unique warnings and 0 duplicates.
<Git Blamer> Using GitBlamer to create author and commit information for all warnings.
<Git Blamer> GIT_COMMIT=3ec37cae8d8297258334f4489605ff44bffd6f5c, workspace=<https://builds.apache.org/job/Atlas-master-IntegrationTests/ws/>
[FINDBUGS] Computing warning deltas based on reference build #523
Archiving artifacts
[Fast Archiver] Compressed 137.80 MB of artifacts by 79.4% relative to #523
TestNG Reports Processing: START
Looking for TestNG results report in workspace using pattern: **/target/surefire-reports/testng-results.xml,**/target/failsafe-reports/testng-results.xml
Saving reports...
Processing '/x1/jenkins/jenkins-home/jobs/Atlas-master-IntegrationTests/builds/524/testng/testng-results-1.xml'
Processing '/x1/jenkins/jenkins-home/jobs/Atlas-master-IntegrationTests/builds/524/testng/testng-results.xml'
7.017544% of tests failed, which exceeded threshold of 0%. Marking build as UNSTABLE
TestNG Reports Processing: FINISH

Mime
View raw message