atlas-dev mailing list archives

Site index · List index
Message view « Date » · « Thread »
Top « Date » · « Thread »
From Apache Jenkins Server <jenk...@builds.apache.org>
Subject Build failed in Jenkins: Atlas-master-IntegrationTests #513
Date Wed, 14 Feb 2018 03:59:44 GMT
See <https://builds.apache.org/job/Atlas-master-IntegrationTests/513/display/redirect>

------------------------------------------
[...truncated 690.80 KB...]
INFO: Registering Spring bean, lineageREST, of type org.apache.atlas.web.rest.LineageREST
as a root resource class
Feb 14, 2018 3:49:14 AM com.sun.jersey.spi.spring.container.SpringComponentProviderFactory
registerSpringBeans
INFO: Registering Spring bean, allExceptionMapper, of type org.apache.atlas.web.errors.AllExceptionMapper
as a provider class
Feb 14, 2018 3:49:14 AM com.sun.jersey.spi.spring.container.SpringComponentProviderFactory
registerSpringBeans
INFO: Registering Spring bean, atlasBaseExceptionMapper, of type org.apache.atlas.web.errors.AtlasBaseExceptionMapper
as a provider class
Feb 14, 2018 3:49:14 AM com.sun.jersey.spi.spring.container.SpringComponentProviderFactory
registerSpringBeans
INFO: Registering Spring bean, notFoundExceptionMapper, of type org.apache.atlas.web.errors.NotFoundExceptionMapper
as a provider class
Feb 14, 2018 3:49:14 AM com.sun.jersey.spi.spring.container.SpringComponentProviderFactory
registerSpringBeans
INFO: Registering Spring bean, atlasJsonProvider, of type org.apache.atlas.web.util.AtlasJsonProvider
as a provider class
Feb 14, 2018 3:49:14 AM com.sun.jersey.server.impl.application.WebApplicationImpl _initiate
INFO: Initiating Jersey application, version 'Jersey: 1.19 02/11/2015 03:25 AM'
[INFO] Started o.e.j.m.p.JettyWebAppContext@623807d4{/,file://<https://builds.apache.org/job/Atlas-master-IntegrationTests/ws/webapp/target/atlas-webapp-1.0.0-SNAPSHOT/,AVAILABLE}{/home/jenkins/jenkins-slave/workspace/Atlas-master-IntegrationTests/webapp/target/atlas-webapp-1.0.0-SNAPSHOT.war}>
[INFO] Started ServerConnector@3a5c2a42{HTTP/1.1,[http/1.1]}{0.0.0.0:31000}
[INFO] Started @965033ms
[INFO] Started Jetty Server
[INFO] 
[INFO] --- maven-failsafe-plugin:2.18.1:integration-test (integration-test) @ sqoop-bridge
---
[WARNING] useSystemClassloader setting has no effect when not forking
[INFO] Failsafe report directory: <https://builds.apache.org/job/Atlas-master-IntegrationTests/ws/addons/sqoop-bridge/target/failsafe-reports>
Running org.apache.atlas.sqoop.hook.SqoopHookIT
127.0.0.1 - - [14/Feb/2018:03:49:17 +0000] "GET //localhost:31000/api/atlas/entities?type=sqoop_dbdatastore&property=qualifiedName&value=mysql+--url+jdbc:mysql:///localhost/db+--table+myTable
HTTP/1.1" 404 154 "-" "Java/1.8.0_152"
127.0.0.1 - - [14/Feb/2018:03:49:22 +0000] "GET //localhost:31000/api/atlas/entities?type=sqoop_dbdatastore&property=qualifiedName&value=mysql+--url+jdbc:mysql:///localhost/db+--table+myTable
HTTP/1.1" 404 154 "-" "Java/1.8.0_152"
127.0.0.1 - - [14/Feb/2018:03:49:27 +0000] "GET //localhost:31000/api/atlas/entities?type=sqoop_dbdatastore&property=qualifiedName&value=mysql+--url+jdbc:mysql:///localhost/db+--table+myTable
HTTP/1.1" 404 154 "-" "Java/1.8.0_152"
127.0.0.1 - - [14/Feb/2018:03:49:32 +0000] "GET //localhost:31000/api/atlas/entities?type=sqoop_dbdatastore&property=qualifiedName&value=mysql+--url+jdbc:mysql:///localhost/db+--table+myTable
HTTP/1.1" 404 154 "-" "Java/1.8.0_152"
127.0.0.1 - - [14/Feb/2018:03:49:37 +0000] "GET //localhost:31000/api/atlas/entities?type=sqoop_dbdatastore&property=qualifiedName&value=mysql+--url+jdbc:mysql:///localhost/db+--table+myTable
HTTP/1.1" 404 154 "-" "Java/1.8.0_152"
127.0.0.1 - - [14/Feb/2018:03:49:42 +0000] "GET //localhost:31000/api/atlas/entities?type=sqoop_dbdatastore&property=qualifiedName&value=mysql+--url+jdbc:mysql:///localhost/db+--table+myTable
HTTP/1.1" 404 154 "-" "Java/1.8.0_152"
127.0.0.1 - - [14/Feb/2018:03:49:47 +0000] "GET //localhost:31000/api/atlas/entities?type=sqoop_dbdatastore&property=qualifiedName&value=mysql+--url+jdbc:mysql:///localhost/db+--table+myTable
HTTP/1.1" 404 154 "-" "Java/1.8.0_152"
127.0.0.1 - - [14/Feb/2018:03:49:52 +0000] "GET //localhost:31000/api/atlas/entities?type=sqoop_dbdatastore&property=qualifiedName&value=mysql+--url+jdbc:mysql:///localhost/db+--table+myTable
HTTP/1.1" 404 154 "-" "Java/1.8.0_152"
127.0.0.1 - - [14/Feb/2018:03:49:57 +0000] "GET //localhost:31000/api/atlas/entities?type=sqoop_dbdatastore&property=qualifiedName&value=mysql+--url+jdbc:mysql:///localhost/db+--table+myTable
HTTP/1.1" 404 154 "-" "Java/1.8.0_152"
127.0.0.1 - - [14/Feb/2018:03:50:02 +0000] "GET //localhost:31000/api/atlas/entities?type=sqoop_dbdatastore&property=qualifiedName&value=mysql+--url+jdbc:mysql:///localhost/db+--table+myTable
HTTP/1.1" 404 154 "-" "Java/1.8.0_152"
127.0.0.1 - - [14/Feb/2018:03:50:07 +0000] "GET //localhost:31000/api/atlas/entities?type=sqoop_dbdatastore&property=qualifiedName&value=mysql+--url+jdbc:mysql:///localhost/db+--table+myTable
HTTP/1.1" 404 154 "-" "Java/1.8.0_152"
127.0.0.1 - - [14/Feb/2018:03:50:12 +0000] "GET //localhost:31000/api/atlas/entities?type=sqoop_dbdatastore&property=qualifiedName&value=mysql+--url+jdbc:mysql:///localhost/db+--table+myTable
HTTP/1.1" 404 154 "-" "Java/1.8.0_152"
127.0.0.1 - - [14/Feb/2018:03:50:17 +0000] "GET //localhost:31000/api/atlas/entities?type=sqoop_dbdatastore&property=qualifiedName&value=mysql+--url+jdbc:mysql:///localhost/db+--table+myTable
HTTP/1.1" 404 154 "-" "Java/1.8.0_152"
127.0.0.1 - - [14/Feb/2018:03:50:22 +0000] "GET //localhost:31000/api/atlas/entities?type=sqoop_dbdatastore&property=qualifiedName&value=mysql+--url+jdbc:mysql:///localhost/db+--table+myTable
HTTP/1.1" 404 154 "-" "Java/1.8.0_152"
127.0.0.1 - - [14/Feb/2018:03:50:27 +0000] "GET //localhost:31000/api/atlas/entities?type=sqoop_dbdatastore&property=qualifiedName&value=mysql+--url+jdbc:mysql:///localhost/db+--table+myTable
HTTP/1.1" 404 154 "-" "Java/1.8.0_152"
127.0.0.1 - - [14/Feb/2018:03:50:32 +0000] "GET //localhost:31000/api/atlas/entities?type=sqoop_dbdatastore&property=qualifiedName&value=mysql+--url+jdbc:mysql:///localhost/db+--table+myTable
HTTP/1.1" 404 154 "-" "Java/1.8.0_152"
127.0.0.1 - - [14/Feb/2018:03:50:37 +0000] "GET //localhost:31000/api/atlas/entities?type=sqoop_dbdatastore&property=qualifiedName&value=mysql+--url+jdbc:mysql:///localhost/db+--table+myTable
HTTP/1.1" 404 154 "-" "Java/1.8.0_152"
127.0.0.1 - - [14/Feb/2018:03:50:38 +0000] "GET //localhost:31000/api/atlas/entities?type=sqoop_dbdatastore&property=qualifiedName&value=mysql+--url+jdbc:mysql:///localhost/db+--table+myTable
HTTP/1.1" 404 154 "-" "Java/1.8.0_152"
127.0.0.1 - - [14/Feb/2018:03:50:43 +0000] "GET //localhost:31000/api/atlas/entities?type=sqoop_dbdatastore&property=qualifiedName&value=mysql+--url+jdbc:mysql:///localhost/db+--table+myTable
HTTP/1.1" 404 154 "-" "Java/1.8.0_152"
127.0.0.1 - - [14/Feb/2018:03:50:48 +0000] "GET //localhost:31000/api/atlas/entities?type=sqoop_dbdatastore&property=qualifiedName&value=mysql+--url+jdbc:mysql:///localhost/db+--table+myTable
HTTP/1.1" 404 154 "-" "Java/1.8.0_152"
127.0.0.1 - - [14/Feb/2018:03:50:53 +0000] "GET //localhost:31000/api/atlas/entities?type=sqoop_dbdatastore&property=qualifiedName&value=mysql+--url+jdbc:mysql:///localhost/db+--table+myTable
HTTP/1.1" 404 154 "-" "Java/1.8.0_152"
127.0.0.1 - - [14/Feb/2018:03:50:58 +0000] "GET //localhost:31000/api/atlas/entities?type=sqoop_dbdatastore&property=qualifiedName&value=mysql+--url+jdbc:mysql:///localhost/db+--table+myTable
HTTP/1.1" 404 154 "-" "Java/1.8.0_152"
127.0.0.1 - - [14/Feb/2018:03:51:03 +0000] "GET //localhost:31000/api/atlas/entities?type=sqoop_dbdatastore&property=qualifiedName&value=mysql+--url+jdbc:mysql:///localhost/db+--table+myTable
HTTP/1.1" 404 154 "-" "Java/1.8.0_152"
127.0.0.1 - - [14/Feb/2018:03:51:08 +0000] "GET //localhost:31000/api/atlas/entities?type=sqoop_dbdatastore&property=qualifiedName&value=mysql+--url+jdbc:mysql:///localhost/db+--table+myTable
HTTP/1.1" 404 154 "-" "Java/1.8.0_152"
127.0.0.1 - - [14/Feb/2018:03:51:13 +0000] "GET //localhost:31000/api/atlas/entities?type=sqoop_dbdatastore&property=qualifiedName&value=mysql+--url+jdbc:mysql:///localhost/db+--table+myTable
HTTP/1.1" 404 154 "-" "Java/1.8.0_152"
127.0.0.1 - - [14/Feb/2018:03:51:18 +0000] "GET //localhost:31000/api/atlas/entities?type=sqoop_dbdatastore&property=qualifiedName&value=mysql+--url+jdbc:mysql:///localhost/db+--table+myTable
HTTP/1.1" 404 154 "-" "Java/1.8.0_152"
127.0.0.1 - - [14/Feb/2018:03:51:23 +0000] "GET //localhost:31000/api/atlas/entities?type=sqoop_dbdatastore&property=qualifiedName&value=mysql+--url+jdbc:mysql:///localhost/db+--table+myTable
HTTP/1.1" 404 154 "-" "Java/1.8.0_152"
127.0.0.1 - - [14/Feb/2018:03:51:28 +0000] "GET //localhost:31000/api/atlas/entities?type=sqoop_dbdatastore&property=qualifiedName&value=mysql+--url+jdbc:mysql:///localhost/db+--table+myTable
HTTP/1.1" 404 154 "-" "Java/1.8.0_152"
127.0.0.1 - - [14/Feb/2018:03:51:33 +0000] "GET //localhost:31000/api/atlas/entities?type=sqoop_dbdatastore&property=qualifiedName&value=mysql+--url+jdbc:mysql:///localhost/db+--table+myTable
HTTP/1.1" 404 154 "-" "Java/1.8.0_152"
127.0.0.1 - - [14/Feb/2018:03:51:39 +0000] "GET //localhost:31000/api/atlas/entities?type=sqoop_dbdatastore&property=qualifiedName&value=mysql+--url+jdbc:mysql:///localhost/db+--table+myTable
HTTP/1.1" 404 154 "-" "Java/1.8.0_152"
127.0.0.1 - - [14/Feb/2018:03:51:44 +0000] "GET //localhost:31000/api/atlas/entities?type=sqoop_dbdatastore&property=qualifiedName&value=mysql+--url+jdbc:mysql:///localhost/db+--table+myTable
HTTP/1.1" 404 154 "-" "Java/1.8.0_152"
127.0.0.1 - - [14/Feb/2018:03:51:49 +0000] "GET //localhost:31000/api/atlas/entities?type=sqoop_dbdatastore&property=qualifiedName&value=mysql+--url+jdbc:mysql:///localhost/db+--table+myTable
HTTP/1.1" 404 154 "-" "Java/1.8.0_152"
127.0.0.1 - - [14/Feb/2018:03:51:54 +0000] "GET //localhost:31000/api/atlas/entities?type=sqoop_dbdatastore&property=qualifiedName&value=mysql+--url+jdbc:mysql:///localhost/db+--table+myTable
HTTP/1.1" 404 154 "-" "Java/1.8.0_152"
127.0.0.1 - - [14/Feb/2018:03:51:59 +0000] "GET //localhost:31000/api/atlas/entities?type=sqoop_dbdatastore&property=qualifiedName&value=mysql+--url+jdbc:mysql:///localhost/db+--table+myTable
HTTP/1.1" 404 154 "-" "Java/1.8.0_152"
Tests run: 2, Failures: 2, Errors: 0, Skipped: 0, Time elapsed: 164.517 sec <<< FAILURE!
- in org.apache.atlas.sqoop.hook.SqoopHookIT
testSqoopExport(org.apache.atlas.sqoop.hook.SqoopHookIT)  Time elapsed: 82.398 sec  <<<
FAILURE!
java.lang.AssertionError: Assertions failed. Failing after waiting for timeout 80000 msecs
	at org.apache.atlas.AtlasBaseClient.callAPIWithResource(AtlasBaseClient.java:388)
	at org.apache.atlas.AtlasBaseClient.callAPIWithResource(AtlasBaseClient.java:323)
	at org.apache.atlas.AtlasBaseClient.callAPIWithRetries(AtlasBaseClient.java:472)
	at org.apache.atlas.AtlasClient.callAPIWithRetries(AtlasClient.java:931)
	at org.apache.atlas.AtlasClient.getEntity(AtlasClient.java:640)
	at org.apache.atlas.sqoop.hook.SqoopHookIT$1.evaluate(SqoopHookIT.java:108)
	at org.apache.atlas.sqoop.hook.SqoopHookIT.waitFor(SqoopHookIT.java:133)
	at org.apache.atlas.sqoop.hook.SqoopHookIT.assertEntityIsRegistered(SqoopHookIT.java:105)
	at org.apache.atlas.sqoop.hook.SqoopHookIT.assertDBStoreIsRegistered(SqoopHookIT.java:90)
	at org.apache.atlas.sqoop.hook.SqoopHookIT.testSqoopExport(SqoopHookIT.java:82)

testSqoopImport(org.apache.atlas.sqoop.hook.SqoopHookIT)  Time elapsed: 81.336 sec  <<<
FAILURE!
java.lang.AssertionError: Assertions failed. Failing after waiting for timeout 80000 msecs
	at org.apache.atlas.AtlasBaseClient.callAPIWithResource(AtlasBaseClient.java:388)
	at org.apache.atlas.AtlasBaseClient.callAPIWithResource(AtlasBaseClient.java:323)
	at org.apache.atlas.AtlasBaseClient.callAPIWithRetries(AtlasBaseClient.java:472)
	at org.apache.atlas.AtlasClient.callAPIWithRetries(AtlasClient.java:931)
	at org.apache.atlas.AtlasClient.getEntity(AtlasClient.java:640)
	at org.apache.atlas.sqoop.hook.SqoopHookIT$1.evaluate(SqoopHookIT.java:108)
	at org.apache.atlas.sqoop.hook.SqoopHookIT.waitFor(SqoopHookIT.java:133)
	at org.apache.atlas.sqoop.hook.SqoopHookIT.assertEntityIsRegistered(SqoopHookIT.java:105)
	at org.apache.atlas.sqoop.hook.SqoopHookIT.assertDBStoreIsRegistered(SqoopHookIT.java:90)
	at org.apache.atlas.sqoop.hook.SqoopHookIT.testSqoopImport(SqoopHookIT.java:67)


Results :

Failed tests: 
  SqoopHookIT.testSqoopExport:82->assertDBStoreIsRegistered:90->assertEntityIsRegistered:105->waitFor:137
Assertions failed. Failing after waiting for timeout 80000 msecs
  SqoopHookIT.testSqoopImport:67->assertDBStoreIsRegistered:90->assertEntityIsRegistered:105->waitFor:137
Assertions failed. Failing after waiting for timeout 80000 msecs

Tests run: 2, Failures: 2, Errors: 0, Skipped: 0

[INFO] 
[INFO] --- jetty-maven-plugin:9.3.14.v20161028:stop (stop-jetty) @ sqoop-bridge ---
[INFO] Waiting 10 seconds for jetty to stop
[INFO] Stopped ServerConnector@3a5c2a42{HTTP/1.1,[http/1.1]}{0.0.0.0:31000}
[INFO] Closing Spring root WebApplicationContext
[INFO] Shutting down log4j
[INFO] Stopped o.e.j.m.p.JettyWebAppContext@623807d4{/,file://<https://builds.apache.org/job/Atlas-master-IntegrationTests/ws/webapp/target/atlas-webapp-1.0.0-SNAPSHOT/,UNAVAILABLE}{/home/jenkins/jenkins-slave/workspace/Atlas-master-IntegrationTests/webapp/target/atlas-webapp-1.0.0-SNAPSHOT.war}>
[INFO] Server reports itself as stopped
[INFO] 
[INFO] --- maven-source-plugin:2.4:jar-no-fork (attach-sources) @ sqoop-bridge ---
[INFO] Building jar: <https://builds.apache.org/job/Atlas-master-IntegrationTests/ws/addons/sqoop-bridge/target/sqoop-bridge-1.0.0-SNAPSHOT-sources.jar>
[INFO] 
[INFO] --- maven-source-plugin:2.4:test-jar-no-fork (attach-sources) @ sqoop-bridge ---
[INFO] Building jar: <https://builds.apache.org/job/Atlas-master-IntegrationTests/ws/addons/sqoop-bridge/target/sqoop-bridge-1.0.0-SNAPSHOT-test-sources.jar>
[INFO] 
[INFO] --- maven-failsafe-plugin:2.18.1:verify (verify) @ sqoop-bridge ---
[INFO] Failsafe report directory: <https://builds.apache.org/job/Atlas-master-IntegrationTests/ws/addons/sqoop-bridge/target/failsafe-reports>
[INFO] ------------------------------------------------------------------------
[INFO] Reactor Summary:
[INFO] 
[INFO] Apache Atlas Server Build Tools .................... SUCCESS [  0.653 s]
[INFO] apache-atlas ....................................... SUCCESS [  3.728 s]
[INFO] Apache Atlas Test Utility Tools .................... SUCCESS [  9.462 s]
[INFO] Open Connector Framework (OCF) ..................... SUCCESS [  9.553 s]
[INFO] Apache Atlas Integration ........................... SUCCESS [ 18.135 s]
[INFO] Apache Atlas Common ................................ SUCCESS [  7.472 s]
[INFO] Apache Atlas Client ................................ SUCCESS [  0.437 s]
[INFO] atlas-client-common ................................ SUCCESS [  6.443 s]
[INFO] atlas-client-v1 .................................... SUCCESS [  6.636 s]
[INFO] Apache Atlas Server API ............................ SUCCESS [  5.198 s]
[INFO] Apache Atlas Notification .......................... SUCCESS [  8.114 s]
[INFO] atlas-client-v2 .................................... SUCCESS [  5.212 s]
[INFO] Apache Atlas Graph Database Projects ............... SUCCESS [  0.402 s]
[INFO] Apache Atlas Graph Database API .................... SUCCESS [  4.821 s]
[INFO] Graph Database Common Code ......................... SUCCESS [  4.859 s]
[INFO] Apache Atlas JanusGraph DB Impl .................... SUCCESS [ 13.209 s]
[INFO] Apache Atlas Graph Database Implementation Dependencies SUCCESS [  1.867 s]
[INFO] Shaded version of Apache hbase client .............. SUCCESS [  7.470 s]
[INFO] Apache Atlas Titan 0.5.4 Graph DB Impl ............. SUCCESS [ 37.124 s]
[INFO] Shaded version of Apache hbase server .............. SUCCESS [ 19.016 s]
[INFO] Apache Atlas Repository ............................ SUCCESS [ 25.342 s]
[INFO] Apache Atlas Authorization ......................... SUCCESS [  5.972 s]
[INFO] Apache Atlas UI .................................... SUCCESS [01:09 min]
[INFO] Apache Atlas Web Application ....................... SUCCESS [02:34 min]
[INFO] Apache Atlas Documentation ......................... SUCCESS [  2.827 s]
[INFO] Apache Atlas FileSystem Model ...................... SUCCESS [  2.130 s]
[INFO] Apache Atlas Plugin Classloader .................... SUCCESS [  5.630 s]
[INFO] Apache Atlas Hive Bridge Shim ...................... SUCCESS [  4.573 s]
[INFO] Apache Atlas Hive Bridge ........................... SUCCESS [06:51 min]
[INFO] Apache Atlas Falcon Bridge Shim .................... SUCCESS [  5.550 s]
[INFO] Apache Atlas Falcon Bridge ......................... SUCCESS [ 58.699 s]
[INFO] Apache Atlas Sqoop Bridge Shim ..................... SUCCESS [  4.140 s]
[INFO] Apache Atlas Sqoop Bridge .......................... FAILURE [03:30 min]
[INFO] Apache Atlas Storm Bridge Shim ..................... SKIPPED
[INFO] Apache Atlas Storm Bridge .......................... SKIPPED
[INFO] Apache Atlas Hbase Bridge Shim ..................... SKIPPED
[INFO] Apache Atlas Hbase Bridge .......................... SKIPPED
[INFO] Apache Atlas Distribution .......................... SKIPPED
[INFO] ------------------------------------------------------------------------
[INFO] BUILD FAILURE
[INFO] ------------------------------------------------------------------------
[INFO] Total time: 18:51 min
[INFO] Finished at: 2018-02-14T03:52:02Z
[INFO] Final Memory: 912M/3747M
[INFO] ------------------------------------------------------------------------
log4j:WARN No appenders could be found for logger (org.apache.zookeeper.ClientCnxn).
log4j:WARN Please initialize the log4j system properly.
log4j:WARN See http://logging.apache.org/log4j/1.2/faq.html#noconfig for more info.
[ERROR] Failed to execute goal org.apache.maven.plugins:maven-failsafe-plugin:2.18.1:verify
(verify) on project sqoop-bridge: There are test failures.
[ERROR] 
[ERROR] Please refer to <https://builds.apache.org/job/Atlas-master-IntegrationTests/ws/addons/sqoop-bridge/target/failsafe-reports>
for the individual test results.
[ERROR] -> [Help 1]
[ERROR] 
[ERROR] To see the full stack trace of the errors, re-run Maven with the -e switch.
[ERROR] Re-run Maven using the -X switch to enable full debug logging.
[ERROR] 
[ERROR] For more information about the errors and possible solutions, please read the following
articles:
[ERROR] [Help 1] http://cwiki.apache.org/confluence/display/MAVEN/MojoFailureException
[ERROR] 
[ERROR] After correcting the problems, you can resume the build with the command
[ERROR]   mvn <goals> -rf :sqoop-bridge
Build step 'Execute shell' marked build as failure
[CHECKSTYLE] Collecting checkstyle analysis files...
[CHECKSTYLE] Searching for all files in <https://builds.apache.org/job/Atlas-master-IntegrationTests/ws/>
that match the pattern **/target/checkstyle-result.xml
[CHECKSTYLE] Parsing 31 files in <https://builds.apache.org/job/Atlas-master-IntegrationTests/ws/>
[CHECKSTYLE] Successfully parsed file <https://builds.apache.org/job/Atlas-master-IntegrationTests/ws/addons/falcon-bridge-shim/target/checkstyle-result.xml>
with 29 unique warnings and 0 duplicates.
[CHECKSTYLE] Successfully parsed file <https://builds.apache.org/job/Atlas-master-IntegrationTests/ws/addons/falcon-bridge/target/checkstyle-result.xml>
with 418 unique warnings and 0 duplicates.
[CHECKSTYLE] Successfully parsed file <https://builds.apache.org/job/Atlas-master-IntegrationTests/ws/addons/hdfs-model/target/checkstyle-result.xml>
with 418 unique warnings and 0 duplicates.
[CHECKSTYLE] Successfully parsed file <https://builds.apache.org/job/Atlas-master-IntegrationTests/ws/addons/hive-bridge-shim/target/checkstyle-result.xml>
with 433 unique warnings and 0 duplicates.
[CHECKSTYLE] Successfully parsed file <https://builds.apache.org/job/Atlas-master-IntegrationTests/ws/addons/hive-bridge/target/checkstyle-result.xml>
with 2263 unique warnings and 0 duplicates.
[CHECKSTYLE] Successfully parsed file <https://builds.apache.org/job/Atlas-master-IntegrationTests/ws/addons/sqoop-bridge-shim/target/checkstyle-result.xml>
with 2279 unique warnings and 0 duplicates.
[CHECKSTYLE] Successfully parsed file <https://builds.apache.org/job/Atlas-master-IntegrationTests/ws/authorization/target/checkstyle-result.xml>
with 2740 unique warnings and 0 duplicates.
[CHECKSTYLE] Successfully parsed file <https://builds.apache.org/job/Atlas-master-IntegrationTests/ws/client/client-v1/target/checkstyle-result.xml>
with 3620 unique warnings and 0 duplicates.
[CHECKSTYLE] Successfully parsed file <https://builds.apache.org/job/Atlas-master-IntegrationTests/ws/client/client-v2/target/checkstyle-result.xml>
with 3965 unique warnings and 0 duplicates.
[CHECKSTYLE] Successfully parsed file <https://builds.apache.org/job/Atlas-master-IntegrationTests/ws/client/common/target/checkstyle-result.xml>
with 4453 unique warnings and 0 duplicates.
[CHECKSTYLE] Successfully parsed file <https://builds.apache.org/job/Atlas-master-IntegrationTests/ws/client/target/checkstyle-result.xml>
with 4453 unique warnings and 0 duplicates.
[CHECKSTYLE] Successfully parsed file <https://builds.apache.org/job/Atlas-master-IntegrationTests/ws/common/target/checkstyle-result.xml>
with 5395 unique warnings and 0 duplicates.
[CHECKSTYLE] Successfully parsed file <https://builds.apache.org/job/Atlas-master-IntegrationTests/ws/dashboardv2/target/checkstyle-result.xml>
with 5395 unique warnings and 0 duplicates.
[CHECKSTYLE] Successfully parsed file <https://builds.apache.org/job/Atlas-master-IntegrationTests/ws/docs/target/checkstyle-result.xml>
with 5395 unique warnings and 0 duplicates.
[CHECKSTYLE] Successfully parsed file <https://builds.apache.org/job/Atlas-master-IntegrationTests/ws/graphdb/api/target/checkstyle-result.xml>
with 5671 unique warnings and 0 duplicates.
[CHECKSTYLE] Successfully parsed file <https://builds.apache.org/job/Atlas-master-IntegrationTests/ws/graphdb/common/target/checkstyle-result.xml>
with 5867 unique warnings and 0 duplicates.
[CHECKSTYLE] Successfully parsed file <https://builds.apache.org/job/Atlas-master-IntegrationTests/ws/graphdb/graphdb-impls/target/checkstyle-result.xml>
with 5867 unique warnings and 0 duplicates.
[CHECKSTYLE] Successfully parsed file <https://builds.apache.org/job/Atlas-master-IntegrationTests/ws/graphdb/janus/target/checkstyle-result.xml>
with 6876 unique warnings and 0 duplicates.
[CHECKSTYLE] Successfully parsed file <https://builds.apache.org/job/Atlas-master-IntegrationTests/ws/graphdb/target/checkstyle-result.xml>
with 6876 unique warnings and 0 duplicates.
[CHECKSTYLE] Successfully parsed file <https://builds.apache.org/job/Atlas-master-IntegrationTests/ws/graphdb/titan0/target/checkstyle-result.xml>
with 9342 unique warnings and 0 duplicates.
[CHECKSTYLE] Successfully parsed file <https://builds.apache.org/job/Atlas-master-IntegrationTests/ws/intg/target/checkstyle-result.xml>
with 19926 unique warnings and 0 duplicates.
[CHECKSTYLE] Successfully parsed file <https://builds.apache.org/job/Atlas-master-IntegrationTests/ws/notification/target/checkstyle-result.xml>
with 21161 unique warnings and 0 duplicates.
[CHECKSTYLE] Successfully parsed file <https://builds.apache.org/job/Atlas-master-IntegrationTests/ws/om-fwk-ocf/target/checkstyle-result.xml>
with 25868 unique warnings and 0 duplicates.
[CHECKSTYLE] Successfully parsed file <https://builds.apache.org/job/Atlas-master-IntegrationTests/ws/plugin-classloader/target/checkstyle-result.xml>
with 25981 unique warnings and 0 duplicates.
[CHECKSTYLE] Successfully parsed file <https://builds.apache.org/job/Atlas-master-IntegrationTests/ws/repository/target/checkstyle-result.xml>
with 44582 unique warnings and 0 duplicates.
[CHECKSTYLE] Successfully parsed file <https://builds.apache.org/job/Atlas-master-IntegrationTests/ws/server-api/target/checkstyle-result.xml>
with 44791 unique warnings and 0 duplicates.
[CHECKSTYLE] Successfully parsed file <https://builds.apache.org/job/Atlas-master-IntegrationTests/ws/shaded/hbase-client-shaded/target/checkstyle-result.xml>
with 44791 unique warnings and 0 duplicates.
[CHECKSTYLE] Successfully parsed file <https://builds.apache.org/job/Atlas-master-IntegrationTests/ws/shaded/hbase-server-shaded/target/checkstyle-result.xml>
with 44791 unique warnings and 0 duplicates.
[CHECKSTYLE] Successfully parsed file <https://builds.apache.org/job/Atlas-master-IntegrationTests/ws/target/checkstyle-result.xml>
with 44791 unique warnings and 0 duplicates.
[CHECKSTYLE] Successfully parsed file <https://builds.apache.org/job/Atlas-master-IntegrationTests/ws/test-tools/target/checkstyle-result.xml>
with 44829 unique warnings and 0 duplicates.
[CHECKSTYLE] Successfully parsed file <https://builds.apache.org/job/Atlas-master-IntegrationTests/ws/webapp/target/checkstyle-result.xml>
with 52659 unique warnings and 0 duplicates.
<Git Blamer> Using GitBlamer to create author and commit information for all warnings.
<Git Blamer> GIT_COMMIT=5618ad4ce3b608a5c6ab98dc794d231fb7a3673e, workspace=<https://builds.apache.org/job/Atlas-master-IntegrationTests/ws/>
 > git rev-parse 5618ad4ce3b608a5c6ab98dc794d231fb7a3673e^{commit} # timeout=10
[CHECKSTYLE] Computing warning deltas based on reference build #510
[FINDBUGS] Collecting findbugs analysis files...
[FINDBUGS] Searching for all files in <https://builds.apache.org/job/Atlas-master-IntegrationTests/ws/>
that match the pattern **/target/findbugs.xml
[FINDBUGS] Parsing 22 files in <https://builds.apache.org/job/Atlas-master-IntegrationTests/ws/>
[FINDBUGS] Successfully parsed file <https://builds.apache.org/job/Atlas-master-IntegrationTests/ws/addons/falcon-bridge-shim/target/findbugs.xml>
with 0 unique warnings and 0 duplicates.
[FINDBUGS] Successfully parsed file <https://builds.apache.org/job/Atlas-master-IntegrationTests/ws/addons/falcon-bridge/target/findbugs.xml>
with 0 unique warnings and 0 duplicates.
[FINDBUGS] Successfully parsed file <https://builds.apache.org/job/Atlas-master-IntegrationTests/ws/addons/hive-bridge-shim/target/findbugs.xml>
with 0 unique warnings and 0 duplicates.
[FINDBUGS] Successfully parsed file <https://builds.apache.org/job/Atlas-master-IntegrationTests/ws/addons/hive-bridge/target/findbugs.xml>
with 0 unique warnings and 0 duplicates.
[FINDBUGS] Successfully parsed file <https://builds.apache.org/job/Atlas-master-IntegrationTests/ws/addons/sqoop-bridge-shim/target/findbugs.xml>
with 0 unique warnings and 0 duplicates.
[FINDBUGS] Successfully parsed file <https://builds.apache.org/job/Atlas-master-IntegrationTests/ws/authorization/target/findbugs.xml>
with 0 unique warnings and 0 duplicates.
[FINDBUGS] Successfully parsed file <https://builds.apache.org/job/Atlas-master-IntegrationTests/ws/client/client-v1/target/findbugs.xml>
with 0 unique warnings and 0 duplicates.
[FINDBUGS] Successfully parsed file <https://builds.apache.org/job/Atlas-master-IntegrationTests/ws/client/client-v2/target/findbugs.xml>
with 0 unique warnings and 0 duplicates.
[FINDBUGS] Successfully parsed file <https://builds.apache.org/job/Atlas-master-IntegrationTests/ws/client/common/target/findbugs.xml>
with 0 unique warnings and 0 duplicates.
[FINDBUGS] Successfully parsed file <https://builds.apache.org/job/Atlas-master-IntegrationTests/ws/common/target/findbugs.xml>
with 0 unique warnings and 0 duplicates.
[FINDBUGS] Successfully parsed file <https://builds.apache.org/job/Atlas-master-IntegrationTests/ws/graphdb/api/target/findbugs.xml>
with 0 unique warnings and 0 duplicates.
[FINDBUGS] Successfully parsed file <https://builds.apache.org/job/Atlas-master-IntegrationTests/ws/graphdb/common/target/findbugs.xml>
with 0 unique warnings and 0 duplicates.
[FINDBUGS] Successfully parsed file <https://builds.apache.org/job/Atlas-master-IntegrationTests/ws/graphdb/janus/target/findbugs.xml>
with 0 unique warnings and 0 duplicates.
[FINDBUGS] Successfully parsed file <https://builds.apache.org/job/Atlas-master-IntegrationTests/ws/graphdb/titan0/target/findbugs.xml>
with 0 unique warnings and 0 duplicates.
[FINDBUGS] Successfully parsed file <https://builds.apache.org/job/Atlas-master-IntegrationTests/ws/intg/target/findbugs.xml>
with 0 unique warnings and 0 duplicates.
[FINDBUGS] Successfully parsed file <https://builds.apache.org/job/Atlas-master-IntegrationTests/ws/notification/target/findbugs.xml>
with 0 unique warnings and 0 duplicates.
[FINDBUGS] Successfully parsed file <https://builds.apache.org/job/Atlas-master-IntegrationTests/ws/om-fwk-ocf/target/findbugs.xml>
with 0 unique warnings and 0 duplicates.
[FINDBUGS] Successfully parsed file <https://builds.apache.org/job/Atlas-master-IntegrationTests/ws/plugin-classloader/target/findbugs.xml>
with 0 unique warnings and 0 duplicates.
[FINDBUGS] Successfully parsed file <https://builds.apache.org/job/Atlas-master-IntegrationTests/ws/repository/target/findbugs.xml>
with 0 unique warnings and 0 duplicates.
[FINDBUGS] Successfully parsed file <https://builds.apache.org/job/Atlas-master-IntegrationTests/ws/server-api/target/findbugs.xml>
with 0 unique warnings and 0 duplicates.
[FINDBUGS] Successfully parsed file <https://builds.apache.org/job/Atlas-master-IntegrationTests/ws/test-tools/target/findbugs.xml>
with 0 unique warnings and 0 duplicates.
[FINDBUGS] Successfully parsed file <https://builds.apache.org/job/Atlas-master-IntegrationTests/ws/webapp/target/findbugs.xml>
with 0 unique warnings and 0 duplicates.
<Git Blamer> Using GitBlamer to create author and commit information for all warnings.
<Git Blamer> GIT_COMMIT=5618ad4ce3b608a5c6ab98dc794d231fb7a3673e, workspace=<https://builds.apache.org/job/Atlas-master-IntegrationTests/ws/>
[FINDBUGS] Computing warning deltas based on reference build #510
Archiving artifacts
[Fast Archiver] Compressed 135.59 MB of artifacts by 80.9% relative to #510
TestNG Reports Processing: START
Looking for TestNG results report in workspace using pattern: **/target/surefire-reports/testng-results.xml,**/target/failsafe-reports/testng-results.xml
Saving reports...
Processing '/x1/jenkins/jenkins-home/jobs/Atlas-master-IntegrationTests/builds/513/testng/testng-results-1.xml'
Processing '/x1/jenkins/jenkins-home/jobs/Atlas-master-IntegrationTests/builds/513/testng/testng-results-2.xml'
Processing '/x1/jenkins/jenkins-home/jobs/Atlas-master-IntegrationTests/builds/513/testng/testng-results-3.xml'
Processing '/x1/jenkins/jenkins-home/jobs/Atlas-master-IntegrationTests/builds/513/testng/testng-results.xml'
1.136364% of tests failed, which exceeded threshold of 0%. Marking build as UNSTABLE
TestNG Reports Processing: FINISH

Mime
View raw message