atlas-dev mailing list archives

Site index · List index
Message view « Date » · « Thread »
Top « Date » · « Thread »
From Apache Jenkins Server <jenk...@builds.apache.org>
Subject Build failed in Jenkins: Atlas-master-NoTests #222
Date Wed, 10 Jan 2018 18:25:40 GMT
See <https://builds.apache.org/job/Atlas-master-NoTests/222/display/redirect?page=changes>

Changes:

[madhan] ATLAS-2349: Fix IT failures related to jackson serialization

------------------------------------------
[...truncated 430.40 KB...]
[INFO] --- maven-remote-resources-plugin:1.5:process (default) @ sqoop-bridge-shim ---
[INFO] 
[INFO] --- maven-resources-plugin:2.7:resources (default-resources) @ sqoop-bridge-shim ---
[INFO] Using 'UTF-8' encoding to copy filtered resources.
[INFO] skip non existing resourceDirectory <https://builds.apache.org/job/Atlas-master-NoTests/ws/addons/sqoop-bridge-shim/src/main/resources>
[INFO] Copying 0 resource to META-INF
[INFO] Copying 3 resources
[INFO] 
[INFO] --- maven-compiler-plugin:3.7.0:compile (default-compile) @ sqoop-bridge-shim ---
[INFO] Changes detected - recompiling the module!
[INFO] Compiling 1 source file to <https://builds.apache.org/job/Atlas-master-NoTests/ws/addons/sqoop-bridge-shim/target/classes>
[INFO] 
[INFO] --- maven-resources-plugin:2.7:testResources (default-testResources) @ sqoop-bridge-shim
---
[INFO] Using 'UTF-8' encoding to copy filtered resources.
[INFO] skip non existing resourceDirectory <https://builds.apache.org/job/Atlas-master-NoTests/ws/addons/sqoop-bridge-shim/src/test/resources>
[INFO] Copying 3 resources
[INFO] 
[INFO] --- maven-compiler-plugin:3.7.0:testCompile (default-testCompile) @ sqoop-bridge-shim
---
[INFO] No sources to compile
[INFO] 
[INFO] --- maven-surefire-plugin:2.18.1:test (default-test) @ sqoop-bridge-shim ---
[INFO] Tests are skipped.
[INFO] 
[INFO] --- maven-jar-plugin:2.5:jar (default-jar) @ sqoop-bridge-shim ---
[INFO] Building jar: <https://builds.apache.org/job/Atlas-master-NoTests/ws/addons/sqoop-bridge-shim/target/sqoop-bridge-shim-1.0.0-SNAPSHOT.jar>
[INFO] 
[INFO] --- maven-site-plugin:3.4:attach-descriptor (attach-descriptor) @ sqoop-bridge-shim
---
[INFO] 
[INFO] --- maven-failsafe-plugin:2.18.1:integration-test (integration-test) @ sqoop-bridge-shim
---
[INFO] Tests are skipped.
[INFO] 
[INFO] --- maven-source-plugin:2.4:jar-no-fork (attach-sources) @ sqoop-bridge-shim ---
[INFO] Building jar: <https://builds.apache.org/job/Atlas-master-NoTests/ws/addons/sqoop-bridge-shim/target/sqoop-bridge-shim-1.0.0-SNAPSHOT-sources.jar>
[INFO] 
[INFO] --- maven-source-plugin:2.4:test-jar-no-fork (attach-sources) @ sqoop-bridge-shim ---
[INFO] Building jar: <https://builds.apache.org/job/Atlas-master-NoTests/ws/addons/sqoop-bridge-shim/target/sqoop-bridge-shim-1.0.0-SNAPSHOT-test-sources.jar>
[INFO] 
[INFO] --- maven-failsafe-plugin:2.18.1:verify (verify) @ sqoop-bridge-shim ---
[INFO] Tests are skipped.
[INFO] 
[INFO] --- maven-checkstyle-plugin:2.9.1:check (checkstyle-check) @ sqoop-bridge-shim ---
[INFO] 
[INFO] >>> findbugs-maven-plugin:3.0.1:check (findbugs-check) > :findbugs @ sqoop-bridge-shim
>>>
[INFO] 
[INFO] --- findbugs-maven-plugin:3.0.1:findbugs (findbugs) @ sqoop-bridge-shim ---
[INFO] 
[INFO] <<< findbugs-maven-plugin:3.0.1:check (findbugs-check) < :findbugs @ sqoop-bridge-shim
<<<
[INFO] 
[INFO] 
[INFO] --- findbugs-maven-plugin:3.0.1:check (findbugs-check) @ sqoop-bridge-shim ---
[INFO] 
[INFO] --- maven-install-plugin:2.5.2:install (default-install) @ sqoop-bridge-shim ---
[INFO] Installing <https://builds.apache.org/job/Atlas-master-NoTests/ws/addons/sqoop-bridge-shim/target/sqoop-bridge-shim-1.0.0-SNAPSHOT.jar>
to /home/jenkins/.m2/repository/org/apache/atlas/sqoop-bridge-shim/1.0.0-SNAPSHOT/sqoop-bridge-shim-1.0.0-SNAPSHOT.jar
[INFO] Installing <https://builds.apache.org/job/Atlas-master-NoTests/ws/addons/sqoop-bridge-shim/pom.xml>
to /home/jenkins/.m2/repository/org/apache/atlas/sqoop-bridge-shim/1.0.0-SNAPSHOT/sqoop-bridge-shim-1.0.0-SNAPSHOT.pom
[INFO] Installing <https://builds.apache.org/job/Atlas-master-NoTests/ws/addons/sqoop-bridge-shim/target/sqoop-bridge-shim-1.0.0-SNAPSHOT-sources.jar>
to /home/jenkins/.m2/repository/org/apache/atlas/sqoop-bridge-shim/1.0.0-SNAPSHOT/sqoop-bridge-shim-1.0.0-SNAPSHOT-sources.jar
[INFO] Installing <https://builds.apache.org/job/Atlas-master-NoTests/ws/addons/sqoop-bridge-shim/target/sqoop-bridge-shim-1.0.0-SNAPSHOT-test-sources.jar>
to /home/jenkins/.m2/repository/org/apache/atlas/sqoop-bridge-shim/1.0.0-SNAPSHOT/sqoop-bridge-shim-1.0.0-SNAPSHOT-test-sources.jar
[INFO] 
[INFO] ------------------------------------------------------------------------
[INFO] Building Apache Atlas Sqoop Bridge 1.0.0-SNAPSHOT
[INFO] ------------------------------------------------------------------------
[INFO] 
[INFO] --- maven-clean-plugin:2.5:clean (default-clean) @ sqoop-bridge ---
[INFO] Deleting <https://builds.apache.org/job/Atlas-master-NoTests/ws/addons/sqoop-bridge>
(includes = [**/*.pyc], excludes = [])
[INFO] 
[INFO] --- maven-enforcer-plugin:3.0.0-M1:enforce (enforce-versions) @ sqoop-bridge ---
[INFO] 
[INFO] --- buildnumber-maven-plugin:1.4:create (default) @ sqoop-bridge ---
[INFO] Executing: /bin/sh -c cd '<https://builds.apache.org/job/Atlas-master-NoTests/ws/addons/sqoop-bridge'>
&& 'git' 'rev-parse' '--verify' 'HEAD'
[INFO] Working directory: <https://builds.apache.org/job/Atlas-master-NoTests/ws/addons/sqoop-bridge>
[INFO] Storing buildNumber: 74e565446b48b3a87ea9b51096265b00ea5f890b at timestamp: 1515608706276
[WARNING] Cannot get the branch information from the git repository: 
Detecting the current branch failed: fatal: ref HEAD is not a symbolic ref

[INFO] Executing: /bin/sh -c cd '<https://builds.apache.org/job/Atlas-master-NoTests/ws/addons/sqoop-bridge'>
&& 'git' 'rev-parse' '--verify' 'HEAD'
[INFO] Working directory: <https://builds.apache.org/job/Atlas-master-NoTests/ws/addons/sqoop-bridge>
[INFO] Storing buildScmBranch: UNKNOWN
[INFO] 
[INFO] --- apache-rat-plugin:0.12:check (rat-check) @ sqoop-bridge ---
[INFO] Enabled default license matchers.
[INFO] Will parse SCM ignores for exclusions...
[INFO] Finished adding exclusions from SCM ignore files.
[INFO] 61 implicit excludes (use -debug for more details).
[INFO] Exclude: **/antlr4/**
[INFO] Exclude: **/dependency-reduced-pom.xml
[INFO] Exclude: **/javax.script.ScriptEngineFactory
[INFO] Exclude: .reviewboardrc
[INFO] Exclude: 3party-licenses/**
[INFO] Exclude: **/.cache
[INFO] Exclude: **/.cache-main
[INFO] Exclude: **/.cache-tests
[INFO] Exclude: **/.checkstyle
[INFO] Exclude: **/*.txt
[INFO] Exclude: **/*.json
[INFO] Exclude: .pc/**
[INFO] Exclude: debian/**
[INFO] Exclude: .svn/**
[INFO] Exclude: .git/**
[INFO] Exclude: .gitignore
[INFO] Exclude: **/.idea/**
[INFO] Exclude: **/*.twiki
[INFO] Exclude: **/*.iml
[INFO] Exclude: **/*.json
[INFO] Exclude: **/*.log
[INFO] Exclude: **/target/**
[INFO] Exclude: **/target*/**
[INFO] Exclude: **/build/**
[INFO] Exclude: **/*.patch
[INFO] Exclude: derby.log
[INFO] Exclude: **/logs/**
[INFO] Exclude: **/.classpath
[INFO] Exclude: **/.project
[INFO] Exclude: **/.settings/**
[INFO] Exclude: **/test-output/**
[INFO] Exclude: **/mock/**
[INFO] Exclude: **/data/**
[INFO] Exclude: **/maven-eclipse.xml
[INFO] Exclude: **/.externalToolBuilders/**
[INFO] Exclude: **/build.log
[INFO] Exclude: **/.bowerrc
[INFO] Exclude: *.json
[INFO] Exclude: **/overlays/**
[INFO] Exclude: dev-support/**
[INFO] Exclude: **/users-credentials.properties
[INFO] Exclude: **/public/css/animate.min.css
[INFO] Exclude: **/public/css/bootstrap-sidebar.css
[INFO] Exclude: **/public/js/external_lib/**
[INFO] Exclude: **/node_modules/**
[INFO] Exclude: **/public/js/libs/**
[INFO] Exclude: **/atlas.data/**
[INFO] Exclude: **/${sys:atlas.data}/**
[INFO] Exclude: **/policy-store.txt
[INFO] Exclude: **/*rebel*.xml
[INFO] Exclude: **/*rebel*.xml.bak
[INFO] 6 resources included (use -debug for more details)
[INFO] Rat check: Summary over all files. Unapproved: 0, unknown: 0, generated: 0, approved:
6 licenses.
[INFO] 
[INFO] --- maven-resources-plugin:2.7:copy-resources (copy-resources) @ sqoop-bridge ---
[INFO] Using 'UTF-8' encoding to copy filtered resources.
[INFO] Copying 38 resources
[INFO] 
[INFO] --- maven-remote-resources-plugin:1.5:process (default) @ sqoop-bridge ---
[INFO] 
[INFO] --- maven-resources-plugin:2.7:resources (default-resources) @ sqoop-bridge ---
[INFO] Using 'UTF-8' encoding to copy filtered resources.
[INFO] skip non existing resourceDirectory <https://builds.apache.org/job/Atlas-master-NoTests/ws/addons/sqoop-bridge/src/main/resources>
[INFO] Copying 0 resource to META-INF
[INFO] Copying 3 resources
[INFO] 
[INFO] --- maven-compiler-plugin:3.7.0:compile (default-compile) @ sqoop-bridge ---
[INFO] Changes detected - recompiling the module!
[INFO] Compiling 2 source files to <https://builds.apache.org/job/Atlas-master-NoTests/ws/addons/sqoop-bridge/target/classes>
[INFO] <https://builds.apache.org/job/Atlas-master-NoTests/ws/addons/sqoop-bridge/src/main/java/org/apache/atlas/sqoop/hook/SqoopHook.java>:
<https://builds.apache.org/job/Atlas-master-NoTests/ws/addons/sqoop-bridge/src/main/java/org/apache/atlas/sqoop/hook/SqoopHook.java>
uses or overrides a deprecated API.
[INFO] <https://builds.apache.org/job/Atlas-master-NoTests/ws/addons/sqoop-bridge/src/main/java/org/apache/atlas/sqoop/hook/SqoopHook.java>:
Recompile with -Xlint:deprecation for details.
[INFO] 
[INFO] --- maven-resources-plugin:2.7:testResources (default-testResources) @ sqoop-bridge
---
[INFO] Using 'UTF-8' encoding to copy filtered resources.
[INFO] Copying 2 resources
[INFO] Copying 3 resources
[INFO] 
[INFO] --- maven-compiler-plugin:3.7.0:testCompile (default-testCompile) @ sqoop-bridge ---
[INFO] Changes detected - recompiling the module!
[INFO] Compiling 1 source file to <https://builds.apache.org/job/Atlas-master-NoTests/ws/addons/sqoop-bridge/target/test-classes>
[INFO] <https://builds.apache.org/job/Atlas-master-NoTests/ws/addons/sqoop-bridge/src/test/java/org/apache/atlas/sqoop/hook/SqoopHookIT.java>:
<https://builds.apache.org/job/Atlas-master-NoTests/ws/addons/sqoop-bridge/src/test/java/org/apache/atlas/sqoop/hook/SqoopHookIT.java>
uses or overrides a deprecated API.
[INFO] <https://builds.apache.org/job/Atlas-master-NoTests/ws/addons/sqoop-bridge/src/test/java/org/apache/atlas/sqoop/hook/SqoopHookIT.java>:
Recompile with -Xlint:deprecation for details.
[INFO] -------------------------------------------------------------
[ERROR] COMPILATION ERROR : 
[INFO] -------------------------------------------------------------
[ERROR] <https://builds.apache.org/job/Atlas-master-NoTests/ws/addons/sqoop-bridge/src/test/java/org/apache/atlas/sqoop/hook/SqoopHookIT.java>:[113,55]
incompatible types: com.fasterxml.jackson.databind.JsonNode cannot be converted to com.fasterxml.jackson.databind.node.ArrayNode
[ERROR] <https://builds.apache.org/job/Atlas-master-NoTests/ws/addons/sqoop-bridge/src/test/java/org/apache/atlas/sqoop/hook/SqoopHookIT.java>:[118,47]
incompatible types: com.fasterxml.jackson.databind.JsonNode cannot be converted to com.fasterxml.jackson.databind.node.ArrayNode
[INFO] 2 errors 
[INFO] -------------------------------------------------------------
[INFO] ------------------------------------------------------------------------
[INFO] Reactor Summary:
[INFO] 
[INFO] Apache Atlas Server Build Tools .................... SUCCESS [  2.864 s]
[INFO] apache-atlas ....................................... SUCCESS [  8.573 s]
[INFO] Apache Atlas Test Utility Tools .................... SUCCESS [  8.981 s]
[INFO] Apache Atlas Integration ........................... SUCCESS [ 11.830 s]
[INFO] Apache Atlas Common ................................ SUCCESS [  2.320 s]
[INFO] Apache Atlas Client ................................ SUCCESS [  0.460 s]
[INFO] atlas-client-common ................................ SUCCESS [  1.768 s]
[INFO] atlas-client-v1 .................................... SUCCESS [  3.838 s]
[INFO] Apache Atlas Server API ............................ SUCCESS [  1.942 s]
[INFO] Apache Atlas Notification .......................... SUCCESS [  3.147 s]
[INFO] atlas-client-v2 .................................... SUCCESS [  1.022 s]
[INFO] Apache Atlas Graph Database Projects ............... SUCCESS [  0.235 s]
[INFO] Apache Atlas Graph Database API .................... SUCCESS [  1.057 s]
[INFO] Graph Database Common Code ......................... SUCCESS [  1.548 s]
[INFO] Apache Atlas JanusGraph DB Impl .................... SUCCESS [ 11.145 s]
[INFO] Apache Atlas Graph Database Implementation Dependencies SUCCESS [  2.806 s]
[INFO] Shaded version of Apache hbase client .............. SUCCESS [ 14.702 s]
[INFO] Apache Atlas Titan 0.5.4 Graph DB Impl ............. SUCCESS [ 44.259 s]
[INFO] Shaded version of Apache hbase server .............. SUCCESS [ 30.206 s]
[INFO] Apache Atlas Repository ............................ SUCCESS [ 13.747 s]
[INFO] Apache Atlas Authorization ......................... SUCCESS [  1.299 s]
[INFO] Apache Atlas UI .................................... SUCCESS [01:53 min]
[INFO] Apache Atlas Web Application ....................... SUCCESS [03:24 min]
[INFO] Apache Atlas Documentation ......................... SUCCESS [  8.464 s]
[INFO] Apache Atlas FileSystem Model ...................... SUCCESS [  4.417 s]
[INFO] Apache Atlas Plugin Classloader .................... SUCCESS [  1.527 s]
[INFO] Apache Atlas Hive Bridge Shim ...................... SUCCESS [  1.595 s]
[INFO] Apache Atlas Hive Bridge ........................... SUCCESS [  5.518 s]
[INFO] Apache Atlas Falcon Bridge Shim .................... SUCCESS [  1.565 s]
[INFO] Apache Atlas Falcon Bridge ......................... SUCCESS [  3.272 s]
[INFO] Apache Atlas Sqoop Bridge Shim ..................... SUCCESS [  0.323 s]
[INFO] Apache Atlas Sqoop Bridge .......................... FAILURE [  3.155 s]
[INFO] Apache Atlas Storm Bridge Shim ..................... SKIPPED
[INFO] Apache Atlas Storm Bridge .......................... SKIPPED
[INFO] Apache Atlas Hbase Bridge Shim ..................... SKIPPED
[INFO] Apache Atlas Hbase Bridge .......................... SKIPPED
[INFO] Apache Atlas Distribution .......................... SKIPPED
[INFO] ------------------------------------------------------------------------
[INFO] BUILD FAILURE
[INFO] ------------------------------------------------------------------------
[INFO] Total time: 08:39 min
[INFO] Finished at: 2018-01-10T18:25:09Z
[INFO] Final Memory: 229M/2187M
[INFO] ------------------------------------------------------------------------
[ERROR] Failed to execute goal org.apache.maven.plugins:maven-compiler-plugin:3.7.0:testCompile
(default-testCompile) on project sqoop-bridge: Compilation failure: Compilation failure: 
[ERROR] <https://builds.apache.org/job/Atlas-master-NoTests/ws/addons/sqoop-bridge/src/test/java/org/apache/atlas/sqoop/hook/SqoopHookIT.java>:[113,55]
incompatible types: com.fasterxml.jackson.databind.JsonNode cannot be converted to com.fasterxml.jackson.databind.node.ArrayNode
[ERROR] <https://builds.apache.org/job/Atlas-master-NoTests/ws/addons/sqoop-bridge/src/test/java/org/apache/atlas/sqoop/hook/SqoopHookIT.java>:[118,47]
incompatible types: com.fasterxml.jackson.databind.JsonNode cannot be converted to com.fasterxml.jackson.databind.node.ArrayNode
[ERROR] -> [Help 1]
[ERROR] 
[ERROR] To see the full stack trace of the errors, re-run Maven with the -e switch.
[ERROR] Re-run Maven using the -X switch to enable full debug logging.
[ERROR] 
[ERROR] For more information about the errors and possible solutions, please read the following
articles:
[ERROR] [Help 1] http://cwiki.apache.org/confluence/display/MAVEN/MojoFailureException
[ERROR] 
[ERROR] After correcting the problems, you can resume the build with the command
[ERROR]   mvn <goals> -rf :sqoop-bridge
Build step 'Execute shell' marked build as failure
[CHECKSTYLE] Collecting checkstyle analysis files...
[CHECKSTYLE] Searching for all files in <https://builds.apache.org/job/Atlas-master-NoTests/ws/>
that match the pattern **/target/checkstyle-result.xml
[CHECKSTYLE] No files found. Configuration error?
<Git Blamer> Using GitBlamer to create author and commit information for all warnings.
<Git Blamer> GIT_COMMIT=74e565446b48b3a87ea9b51096265b00ea5f890b, workspace=<https://builds.apache.org/job/Atlas-master-NoTests/ws/>
[CHECKSTYLE] Computing warning deltas based on reference build #221
[FINDBUGS] Collecting findbugs analysis files...
[FINDBUGS] Searching for all files in <https://builds.apache.org/job/Atlas-master-NoTests/ws/>
that match the pattern **/target/findbugs.xml
[FINDBUGS] No files found. Configuration error?
<Git Blamer> Using GitBlamer to create author and commit information for all warnings.
<Git Blamer> GIT_COMMIT=74e565446b48b3a87ea9b51096265b00ea5f890b, workspace=<https://builds.apache.org/job/Atlas-master-NoTests/ws/>
[FINDBUGS] Computing warning deltas based on reference build #221
Archiving artifacts
[Fast Archiver] Compressed 129.21 MB of artifacts by 82.1% relative to #221
TestNG Reports Processing: START
Looking for TestNG results report in workspace using pattern: **/target/surefire-reports/testng-results.xml,**/target/failsafe-reports/testng-results.xml
Did not find any matching files.

Mime
View raw message