atlas-dev mailing list archives

Site index · List index
Message view « Date » · « Thread »
Top « Date » · « Thread »
From Apache Jenkins Server <jenk...@builds.apache.org>
Subject Build failed in Jenkins: Atlas-master-UnitTests #225
Date Thu, 04 Jan 2018 19:34:14 GMT
See <https://builds.apache.org/job/Atlas-master-UnitTests/225/display/redirect?page=changes>

Changes:

[ssubramanian] ATLAS-2331: Provide option to start embedded Solr server for Integration

------------------------------------------
[...truncated 178.73 KB...]
java.lang.NullPointerException: null
	at org.apache.atlas.query.GremlinQueryComposer.addOrderBy(GremlinQueryComposer.java:338)
	at org.apache.atlas.query.DSLVisitor.visitOrderByExpr(DSLVisitor.java:132)
	at org.apache.atlas.query.DSLVisitor.visitOrderByExpr(DSLVisitor.java:31)
	at org.apache.atlas.query.antlr4.AtlasDSLParser$OrderByExprContext.accept(AtlasDSLParser.java:1545)
	at org.antlr.v4.runtime.tree.AbstractParseTreeVisitor.visitChildren(AbstractParseTreeVisitor.java:46)
	at org.apache.atlas.query.antlr4.AtlasDSLParserBaseVisitor.visitQuery(AtlasDSLParserBaseVisitor.java:279)
	at org.apache.atlas.query.antlr4.AtlasDSLParser$QueryContext.accept(AtlasDSLParser.java:2130)
	at org.antlr.v4.runtime.tree.AbstractParseTreeVisitor.visit(AbstractParseTreeVisitor.java:18)
	at org.apache.atlas.query.GremlinQueryComposerTest.getGremlinQuery(GremlinQueryComposerTest.java:295)
	at org.apache.atlas.query.GremlinQueryComposerTest.verify(GremlinQueryComposerTest.java:259)
	at org.apache.atlas.query.GremlinQueryComposerTest.fromDBOrderByNameDesc(GremlinQueryComposerTest.java:137)

fromDBSelect(org.apache.atlas.query.GremlinQueryComposerTest)  Time elapsed: 0.099 sec  <<<
FAILURE!
java.lang.AssertionError: expected [def f(r){ return [['DB.name','DB.owner']].plus(r.collect({[it.value('DB.name'),it.value('DB.owner')]})).unique();
}; f(g.V().has('__typeName', 'DB').limit(25).toList())] but found [def f(r){ return [['DB.name','DB.owner']].plus(r.collect({[it.value('DB.name'),it.value('DB.owner')]})).unique();
}; f(g.V().has('__typeName', 'DB').toList())]
	at org.testng.Assert.fail(Assert.java:94)
	at org.testng.Assert.failNotEquals(Assert.java:496)
	at org.testng.Assert.assertEquals(Assert.java:125)
	at org.testng.Assert.assertEquals(Assert.java:178)
	at org.testng.Assert.assertEquals(Assert.java:188)
	at org.apache.atlas.query.GremlinQueryComposerTest.verify(GremlinQueryComposerTest.java:260)
	at org.apache.atlas.query.GremlinQueryComposerTest.fromDBSelect(GremlinQueryComposerTest.java:143)

nestedQueries(org.apache.atlas.query.GremlinQueryComposerTest)  Time elapsed: 0.162 sec  <<<
FAILURE!
java.lang.AssertionError: expected [g.V().has('__typeName', 'Table').or(__.has('Table.name',
eq("sales_fact")),__.has('Table.name', eq("testtable_1"))).limit(25).toList()] but found [g.V().has('__typeName',
'Table').or(__.has('Table.name', eq("sales_fact")),__.has('Table.name', eq("testtable_1"))).toList()]
	at org.testng.Assert.fail(Assert.java:94)
	at org.testng.Assert.failNotEquals(Assert.java:496)
	at org.testng.Assert.assertEquals(Assert.java:125)
	at org.testng.Assert.assertEquals(Assert.java:178)
	at org.testng.Assert.assertEquals(Assert.java:188)
	at org.apache.atlas.query.GremlinQueryComposerTest.verify(GremlinQueryComposerTest.java:260)
	at org.apache.atlas.query.GremlinQueryComposerTest.nestedQueries(GremlinQueryComposerTest.java:192)

subType(org.apache.atlas.query.GremlinQueryComposerTest)  Time elapsed: 0.036 sec  <<<
FAILURE!
java.lang.AssertionError: expected [def f(r){ return [['name','owner']].plus(r.collect({[it.value('Asset.name'),it.value('Asset.owner')]})).unique();
}; f(g.V().has('__typeName', within('Asset','Table')).limit(25).toList())] but found [def
f(r){ return [['name','owner']].plus(r.collect({[it.value('Asset.name'),it.value('Asset.owner')]})).unique();
}; f(g.V().has('__typeName', within('Asset','Table')).toList())]
	at org.testng.Assert.fail(Assert.java:94)
	at org.testng.Assert.failNotEquals(Assert.java:496)
	at org.testng.Assert.assertEquals(Assert.java:125)
	at org.testng.Assert.assertEquals(Assert.java:178)
	at org.testng.Assert.assertEquals(Assert.java:188)
	at org.apache.atlas.query.GremlinQueryComposerTest.verify(GremlinQueryComposerTest.java:260)
	at org.apache.atlas.query.GremlinQueryComposerTest.subType(GremlinQueryComposerTest.java:182)

tableSelectColumns(org.apache.atlas.query.GremlinQueryComposerTest)  Time elapsed: 0.07 sec
 <<< FAILURE!
java.lang.AssertionError: expected [def f(r){ r }; f(g.V().has('__typeName', 'Table').out('__Table.db').limit(25).toList())]
but found [def f(r){ r }; f(g.V().has('__typeName', 'Table').out('__Table.db').toList())]
	at org.testng.Assert.fail(Assert.java:94)
	at org.testng.Assert.failNotEquals(Assert.java:496)
	at org.testng.Assert.assertEquals(Assert.java:125)
	at org.testng.Assert.assertEquals(Assert.java:178)
	at org.testng.Assert.assertEquals(Assert.java:188)
	at org.apache.atlas.query.GremlinQueryComposerTest.verify(GremlinQueryComposerTest.java:260)
	at org.apache.atlas.query.GremlinQueryComposerTest.tableSelectColumns(GremlinQueryComposerTest.java:98)

whereClauseTextContains(org.apache.atlas.query.GremlinQueryComposerTest)  Time elapsed: 0.096
sec  <<< FAILURE!
java.lang.AssertionError: expected [def f(r){ return [['name','owner']].plus(r.collect({[it.value('DB.name'),it.value('DB.owner')]})).unique();
}; f(g.V().has('__typeName', 'DB').has('DB.name', eq("Reporting")).limit(25).toList())] but
found [def f(r){ return [['name','owner']].plus(r.collect({[it.value('DB.name'),it.value('DB.owner')]})).unique();
}; f(g.V().has('__typeName', 'DB').has('DB.name', eq("Reporting")).toList())]
	at org.testng.Assert.fail(Assert.java:94)
	at org.testng.Assert.failNotEquals(Assert.java:496)
	at org.testng.Assert.assertEquals(Assert.java:125)
	at org.testng.Assert.assertEquals(Assert.java:178)
	at org.testng.Assert.assertEquals(Assert.java:188)
	at org.apache.atlas.query.GremlinQueryComposerTest.verify(GremlinQueryComposerTest.java:260)
	at org.apache.atlas.query.GremlinQueryComposerTest.whereClauseTextContains(GremlinQueryComposerTest.java:155)

whereClauseWithAsTextContains(org.apache.atlas.query.GremlinQueryComposerTest)  Time elapsed:
0.045 sec  <<< FAILURE!
java.lang.AssertionError: expected [def f(r){ return [['t.name','t.owner']].plus(r.collect({[it.value('Table.name'),it.value('Table.owner')]})).unique();
}; f(g.V().has('__typeName', 'Table').as('t').has('Table.name', eq("testtable_1")).limit(25).toList())]
but found [def f(r){ return [['t.name','t.owner']].plus(r.collect({[it.value('Table.name'),it.value('Table.owner')]})).unique();
}; f(g.V().has('__typeName', 'Table').as('t').has('Table.name', eq("testtable_1")).toList())]
	at org.testng.Assert.fail(Assert.java:94)
	at org.testng.Assert.failNotEquals(Assert.java:496)
	at org.testng.Assert.assertEquals(Assert.java:125)
	at org.testng.Assert.assertEquals(Assert.java:178)
	at org.testng.Assert.assertEquals(Assert.java:188)
	at org.apache.atlas.query.GremlinQueryComposerTest.verify(GremlinQueryComposerTest.java:260)
	at org.apache.atlas.query.GremlinQueryComposerTest.whereClauseWithAsTextContains(GremlinQueryComposerTest.java:167)

whereClauseWithDateCompare(org.apache.atlas.query.GremlinQueryComposerTest)  Time elapsed:
0.664 sec  <<< FAILURE!
java.lang.AssertionError: expected [def f(r){ return [['t.name','t.owner']].plus(r.collect({[it.value('Table.name'),it.value('Table.owner')]})).unique();
}; f(g.V().has('__typeName', 'Table').as('t').has('Table.createdTime', eq('1513046158440')).limit(25).toList())]
but found [def f(r){ return [['t.name','t.owner']].plus(r.collect({[it.value('Table.name'),it.value('Table.owner')]})).unique();
}; f(g.V().has('__typeName', 'Table').as('t').has('Table.createdTime', eq('1513046158440')).toList())]
	at org.testng.Assert.fail(Assert.java:94)
	at org.testng.Assert.failNotEquals(Assert.java:496)
	at org.testng.Assert.assertEquals(Assert.java:125)
	at org.testng.Assert.assertEquals(Assert.java:178)
	at org.testng.Assert.assertEquals(Assert.java:188)
	at org.apache.atlas.query.GremlinQueryComposerTest.verify(GremlinQueryComposerTest.java:260)
	at org.apache.atlas.query.GremlinQueryComposerTest.whereClauseWithDateCompare(GremlinQueryComposerTest.java:174)

Tests run: 1, Failures: 0, Errors: 0, Skipped: 0, Time elapsed: 71.663 sec - in org.apache.atlas.services.MetricsServiceTest
Tests run: 1, Failures: 1, Errors: 0, Skipped: 0, Time elapsed: 73.215 sec <<< FAILURE!
- in org.apache.atlas.services.EntityDiscoveryServiceTest
dslTest(org.apache.atlas.services.EntityDiscoveryServiceTest)  Time elapsed: 0.367 sec  <<<
FAILURE!
java.lang.NullPointerException: null
	at org.apache.atlas.query.GremlinQueryComposer$Context.getActiveTypeName(GremlinQueryComposer.java:652)
	at org.apache.atlas.query.GremlinQueryComposer.addWhere(GremlinQueryComposer.java:151)
	at org.apache.atlas.query.DSLVisitor.processExpr(DSLVisitor.java:257)
	at org.apache.atlas.query.DSLVisitor.processExpr(DSLVisitor.java:186)
	at org.apache.atlas.query.DSLVisitor.visitWhereClause(DSLVisitor.java:146)
	at org.apache.atlas.query.DSLVisitor.visitWhereClause(DSLVisitor.java:31)
	at org.apache.atlas.query.antlr4.AtlasDSLParser$WhereClauseContext.accept(AtlasDSLParser.java:1670)
	at org.antlr.v4.runtime.tree.AbstractParseTreeVisitor.visitChildren(AbstractParseTreeVisitor.java:46)
	at org.apache.atlas.query.antlr4.AtlasDSLParserBaseVisitor.visitFromExpression(AtlasDSLParserBaseVisitor.java:223)
	at org.apache.atlas.query.DSLVisitor.visitFromExpression(DSLVisitor.java:168)
	at org.apache.atlas.query.DSLVisitor.visitFromExpression(DSLVisitor.java:31)
	at org.apache.atlas.query.antlr4.AtlasDSLParser$FromExpressionContext.accept(AtlasDSLParser.java:1711)
	at org.antlr.v4.runtime.tree.AbstractParseTreeVisitor.visitChildren(AbstractParseTreeVisitor.java:46)
	at org.apache.atlas.query.antlr4.AtlasDSLParserBaseVisitor.visitSingleQrySrc(AtlasDSLParserBaseVisitor.java:244)
	at org.apache.atlas.query.antlr4.AtlasDSLParser$SingleQrySrcContext.accept(AtlasDSLParser.java:1844)
	at org.antlr.v4.runtime.tree.AbstractParseTreeVisitor.visitChildren(AbstractParseTreeVisitor.java:46)
	at org.apache.atlas.query.antlr4.AtlasDSLParserBaseVisitor.visitCommaDelimitedQueries(AtlasDSLParserBaseVisitor.java:258)
	at org.apache.atlas.query.antlr4.AtlasDSLParser$CommaDelimitedQueriesContext.accept(AtlasDSLParser.java:1959)
	at org.antlr.v4.runtime.tree.AbstractParseTreeVisitor.visitChildren(AbstractParseTreeVisitor.java:46)
	at org.apache.atlas.query.antlr4.AtlasDSLParserBaseVisitor.visitQuerySrc(AtlasDSLParserBaseVisitor.java:272)
	at org.apache.atlas.query.antlr4.AtlasDSLParser$QuerySrcContext.accept(AtlasDSLParser.java:2069)
	at org.antlr.v4.runtime.tree.AbstractParseTreeVisitor.visitChildren(AbstractParseTreeVisitor.java:46)
	at org.apache.atlas.query.antlr4.AtlasDSLParserBaseVisitor.visitQuery(AtlasDSLParserBaseVisitor.java:279)
	at org.apache.atlas.query.antlr4.AtlasDSLParser$QueryContext.accept(AtlasDSLParser.java:2130)
	at org.apache.atlas.query.AtlasDSL$Translator.translate(AtlasDSL.java:130)
	at org.apache.atlas.discovery.EntityDiscoveryService.toGremlinQuery(EntityDiscoveryService.java:679)
	at org.apache.atlas.discovery.EntityDiscoveryService.searchUsingDslQuery(EntityDiscoveryService.java:126)
	at org.apache.atlas.GraphTransactionInterceptor.invoke(GraphTransactionInterceptor.java:60)
	at org.apache.atlas.services.EntityDiscoveryServiceTest.dslTest(EntityDiscoveryServiceTest.java:52)

Tests run: 10, Failures: 0, Errors: 0, Skipped: 0, Time elapsed: 90.832 sec - in org.apache.atlas.repository.store.graph.v1.AtlasRelationshipDefStoreV1Test
Tests run: 1, Failures: 0, Errors: 0, Skipped: 0, Time elapsed: 90.502 sec - in org.apache.atlas.repository.store.graph.v1.AtlasEntityDefStoreV1Test
Tests run: 4, Failures: 0, Errors: 0, Skipped: 0, Time elapsed: 103.283 sec - in org.apache.atlas.repository.store.graph.v1.AtlasRelationshipStoreSoftDeleteV1Test
Tests run: 4, Failures: 0, Errors: 0, Skipped: 0, Time elapsed: 109.645 sec - in org.apache.atlas.repository.store.graph.v1.AtlasRelationshipStoreHardDeleteV1Test
Tests run: 5, Failures: 0, Errors: 0, Skipped: 0, Time elapsed: 111.103 sec - in org.apache.atlas.repository.store.graph.v1.InverseReferenceUpdateHardDeleteV1Test
Tests run: 11, Failures: 0, Errors: 0, Skipped: 0, Time elapsed: 114.467 sec - in org.apache.atlas.repository.userprofile.UserProfileServiceTest
Tests run: 5, Failures: 0, Errors: 0, Skipped: 0, Time elapsed: 113.519 sec - in org.apache.atlas.repository.store.graph.v1.InverseReferenceUpdateSoftDeleteV1Test
Tests run: 10, Failures: 0, Errors: 0, Skipped: 0, Time elapsed: 120.218 sec - in org.apache.atlas.repository.impexp.ExportServiceTest
Tests run: 17, Failures: 0, Errors: 0, Skipped: 0, Time elapsed: 123.273 sec - in org.apache.atlas.repository.store.graph.AtlasTypeDefGraphStoreTest
Tests run: 14, Failures: 0, Errors: 0, Skipped: 0, Time elapsed: 125.038 sec - in org.apache.atlas.repository.store.graph.v1.AtlasEntityStoreV1Test
Tests run: 9, Failures: 1, Errors: 0, Skipped: 0, Time elapsed: 129.526 sec <<< FAILURE!
- in org.apache.atlas.repository.impexp.ImportServiceTest
importDB2(org.apache.atlas.repository.impexp.ImportServiceTest)  Time elapsed: 1.4 sec  <<<
FAILURE!
java.lang.AssertionError: entity:DB_v1 expected [true] but found [false]
	at org.testng.Assert.fail(Assert.java:94)
	at org.testng.Assert.failNotEquals(Assert.java:496)
	at org.testng.Assert.assertTrue(Assert.java:42)
	at org.apache.atlas.repository.impexp.ZipFileResourceTestUtils.verifyImportedMetrics(ZipFileResourceTestUtils.java:134)
	at org.apache.atlas.repository.impexp.ZipFileResourceTestUtils.runAndVerifyQuickStart_v1_Import(ZipFileResourceTestUtils.java:217)
	at org.apache.atlas.repository.impexp.ImportServiceTest.importDB2(ImportServiceTest.java:104)

Tests run: 212, Failures: 0, Errors: 0, Skipped: 0, Time elapsed: 167.476 sec - in org.apache.atlas.query.DSLQueriesTest

Results :

Failed tests: 
  GremlinQueryComposerTest.DBAsDSelectLimit:113->verify:260 expected [g.V().has('__typeName',
'DB').range(2, 2 + 5).limit(25).toList()] but found [g.V().has('__typeName', 'DB').range(2,
2 + 5).toList()]
  GremlinQueryComposerTest.DBHasName:74->verify:260 expected [g.V().has('__typeName', 'DB').has('DB.name').limit(25).toList()]
but found [g.V().has('__typeName', 'DB').has('DB.name').toList()]
  GremlinQueryComposerTest.DBOrderBy:119->verify:259->getGremlinQuery:295 » NullPointer
  GremlinQueryComposerTest.DBasD:80->verify:260 expected [g.V().has('__typeName', 'DB').as('d').limit(25).toList()]
but found [g.V().has('__typeName', 'DB').as('d').toList()]
  GremlinQueryComposerTest.DBasDSelect:86->verify:260 expected [def f(r){ return [['d.name','d.owner']].plus(r.collect({[it.value('DB.name'),it.value('DB.owner')]})).unique();
}; f(g.V().has('__typeName', 'DB').as('d').limit(25).toList())] but found [def f(r){ return
[['d.name','d.owner']].plus(r.collect({[it.value('DB.name'),it.value('DB.owner')]})).unique();
}; f(g.V().has('__typeName', 'DB').as('d').toList())]
  GremlinQueryComposerTest.TraitWithSpace:187->verify:260 expected [g.V().has('__typeName',
'Log Data').limit(25).toList()] but found [g.V().has('__typeName', 'Log Data').toList()]
  GremlinQueryComposerTest.classification:50->verify:260 expected [g.V().has('__traitNames',
within('PII')).limit(25).toList()] but found [g.V().has('__traitNames', within('PII')).toList()]
  GremlinQueryComposerTest.dimension:56->verify:260 expected [g.V().has('__typeName', 'Table').has('__traitNames',
within('Dimension')).limit(25).toList()] but found [g.V().has('__typeName', 'Table').has('__traitNames',
within('Dimension')).toList()]
  GremlinQueryComposerTest.fromDB:66->verify:260 expected [g.V().has('__typeName', 'DB').limit(25).toList()]
but found [g.V().has('__typeName', 'DB').toList()]
  GremlinQueryComposerTest.fromDBGroupBy:148->verify:260 expected [g.V().has('__typeName',
'DB').group().by('DB.owner').limit(25).toList()] but found [g.V().has('__typeName', 'DB').group().by('DB.owner').toList()]
  GremlinQueryComposerTest.fromDBOrderByNameDesc:137->verify:259->getGremlinQuery:295
» NullPointer
  GremlinQueryComposerTest.fromDBSelect:143->verify:260 expected [def f(r){ return [['DB.name','DB.owner']].plus(r.collect({[it.value('DB.name'),it.value('DB.owner')]})).unique();
}; f(g.V().has('__typeName', 'DB').limit(25).toList())] but found [def f(r){ return [['DB.name','DB.owner']].plus(r.collect({[it.value('DB.name'),it.value('DB.owner')]})).unique();
}; f(g.V().has('__typeName', 'DB').toList())]
  GremlinQueryComposerTest.nestedQueries:192->verify:260 expected [g.V().has('__typeName',
'Table').or(__.has('Table.name', eq("sales_fact")),__.has('Table.name', eq("testtable_1"))).limit(25).toList()]
but found [g.V().has('__typeName', 'Table').or(__.has('Table.name', eq("sales_fact")),__.has('Table.name',
eq("testtable_1"))).toList()]
  GremlinQueryComposerTest.subType:182->verify:260 expected [def f(r){ return [['name','owner']].plus(r.collect({[it.value('Asset.name'),it.value('Asset.owner')]})).unique();
}; f(g.V().has('__typeName', within('Asset','Table')).limit(25).toList())] but found [def
f(r){ return [['name','owner']].plus(r.collect({[it.value('Asset.name'),it.value('Asset.owner')]})).unique();
}; f(g.V().has('__typeName', within('Asset','Table')).toList())]
  GremlinQueryComposerTest.tableSelectColumns:98->verify:260 expected [def f(r){ r }; f(g.V().has('__typeName',
'Table').out('__Table.db').limit(25).toList())] but found [def f(r){ r }; f(g.V().has('__typeName',
'Table').out('__Table.db').toList())]
  GremlinQueryComposerTest.whereClauseTextContains:155->verify:260 expected [def f(r){
return [['name','owner']].plus(r.collect({[it.value('DB.name'),it.value('DB.owner')]})).unique();
}; f(g.V().has('__typeName', 'DB').has('DB.name', eq("Reporting")).limit(25).toList())] but
found [def f(r){ return [['name','owner']].plus(r.collect({[it.value('DB.name'),it.value('DB.owner')]})).unique();
}; f(g.V().has('__typeName', 'DB').has('DB.name', eq("Reporting")).toList())]
  GremlinQueryComposerTest.whereClauseWithAsTextContains:167->verify:260 expected [def
f(r){ return [['t.name','t.owner']].plus(r.collect({[it.value('Table.name'),it.value('Table.owner')]})).unique();
}; f(g.V().has('__typeName', 'Table').as('t').has('Table.name', eq("testtable_1")).limit(25).toList())]
but found [def f(r){ return [['t.name','t.owner']].plus(r.collect({[it.value('Table.name'),it.value('Table.owner')]})).unique();
}; f(g.V().has('__typeName', 'Table').as('t').has('Table.name', eq("testtable_1")).toList())]
  GremlinQueryComposerTest.whereClauseWithDateCompare:174->verify:260 expected [def f(r){
return [['t.name','t.owner']].plus(r.collect({[it.value('Table.name'),it.value('Table.owner')]})).unique();
}; f(g.V().has('__typeName', 'Table').as('t').has('Table.createdTime', eq('1513046158440')).limit(25).toList())]
but found [def f(r){ return [['t.name','t.owner']].plus(r.collect({[it.value('Table.name'),it.value('Table.owner')]})).unique();
}; f(g.V().has('__typeName', 'Table').as('t').has('Table.createdTime', eq('1513046158440')).toList())]
  ImportServiceTest.importDB2:104 entity:DB_v1 expected [true] but found [false]
  EntityDiscoveryServiceTest.dslTest:52 » NullPointer

Tests run: 385, Failures: 20, Errors: 0, Skipped: 0

[INFO] ------------------------------------------------------------------------
[INFO] Reactor Summary:
[INFO] 
[INFO] Apache Atlas Server Build Tools .................... SUCCESS [  0.517 s]
[INFO] apache-atlas ....................................... SUCCESS [  1.734 s]
[INFO] Apache Atlas Test Utility Tools .................... SUCCESS [  3.881 s]
[INFO] Apache Atlas Integration ........................... SUCCESS [ 35.500 s]
[INFO] Apache Atlas Common ................................ SUCCESS [  2.289 s]
[INFO] Apache Atlas Client ................................ SUCCESS [  0.152 s]
[INFO] atlas-client-common ................................ SUCCESS [  0.729 s]
[INFO] atlas-client-v1 .................................... SUCCESS [  2.978 s]
[INFO] Apache Atlas Server API ............................ SUCCESS [  0.696 s]
[INFO] Apache Atlas Notification .......................... SUCCESS [ 10.031 s]
[INFO] atlas-client-v2 .................................... SUCCESS [  0.555 s]
[INFO] Apache Atlas Graph Database Projects ............... SUCCESS [  0.073 s]
[INFO] Apache Atlas Graph Database API .................... SUCCESS [  0.488 s]
[INFO] Graph Database Common Code ......................... SUCCESS [  0.577 s]
[INFO] Apache Atlas JanusGraph DB Impl .................... SUCCESS [02:15 min]
[INFO] Apache Atlas Graph Database Implementation Dependencies SUCCESS [  2.331 s]
[INFO] Shaded version of Apache hbase client .............. SUCCESS [ 12.796 s]
[INFO] Apache Atlas Titan 0.5.4 Graph DB Impl ............. SUCCESS [ 37.280 s]
[INFO] Shaded version of Apache hbase server .............. SUCCESS [ 24.316 s]
[INFO] Apache Atlas Repository ............................ FAILURE [03:02 min]
[INFO] Apache Atlas Authorization ......................... SKIPPED
[INFO] Apache Atlas UI .................................... SKIPPED
[INFO] Apache Atlas Web Application ....................... SKIPPED
[INFO] Apache Atlas Documentation ......................... SKIPPED
[INFO] Apache Atlas FileSystem Model ...................... SKIPPED
[INFO] Apache Atlas Plugin Classloader .................... SKIPPED
[INFO] Apache Atlas Hive Bridge Shim ...................... SKIPPED
[INFO] Apache Atlas Hive Bridge ........................... SKIPPED
[INFO] Apache Atlas Falcon Bridge Shim .................... SKIPPED
[INFO] Apache Atlas Falcon Bridge ......................... SKIPPED
[INFO] Apache Atlas Sqoop Bridge Shim ..................... SKIPPED
[INFO] Apache Atlas Sqoop Bridge .......................... SKIPPED
[INFO] Apache Atlas Storm Bridge Shim ..................... SKIPPED
[INFO] Apache Atlas Storm Bridge .......................... SKIPPED
[INFO] Apache Atlas Hbase Bridge Shim ..................... SKIPPED
[INFO] Apache Atlas Hbase Bridge .......................... SKIPPED
[INFO] Apache Atlas Distribution .......................... SKIPPED
[INFO] ------------------------------------------------------------------------
[INFO] BUILD FAILURE
[INFO] ------------------------------------------------------------------------
[INFO] Total time: 07:35 min
[INFO] Finished at: 2018-01-04T19:33:55Z
[INFO] Final Memory: 123M/1894M
[INFO] ------------------------------------------------------------------------
[ERROR] Failed to execute goal org.apache.maven.plugins:maven-surefire-plugin:2.18.1:test
(default-test) on project atlas-repository: There are test failures.
[ERROR] 
[ERROR] Please refer to <https://builds.apache.org/job/Atlas-master-UnitTests/ws/repository/target/surefire-reports>
for the individual test results.
[ERROR] -> [Help 1]
[ERROR] 
[ERROR] To see the full stack trace of the errors, re-run Maven with the -e switch.
[ERROR] Re-run Maven using the -X switch to enable full debug logging.
[ERROR] 
[ERROR] For more information about the errors and possible solutions, please read the following
articles:
[ERROR] [Help 1] http://cwiki.apache.org/confluence/display/MAVEN/MojoFailureException
[ERROR] 
[ERROR] After correcting the problems, you can resume the build with the command
[ERROR]   mvn <goals> -rf :atlas-repository
Build step 'Execute shell' marked build as failure
[CHECKSTYLE] Collecting checkstyle analysis files...
[CHECKSTYLE] Searching for all files in <https://builds.apache.org/job/Atlas-master-UnitTests/ws/>
that match the pattern **/target/checkstyle-result.xml
[CHECKSTYLE] No files found. Configuration error?
<Git Blamer> Using GitBlamer to create author and commit information for all warnings.
<Git Blamer> GIT_COMMIT=1ff791cfca9c8167db92bbde0ce02969620cdd60, workspace=<https://builds.apache.org/job/Atlas-master-UnitTests/ws/>
[CHECKSTYLE] Computing warning deltas based on reference build #222
[FINDBUGS] Collecting findbugs analysis files...
[FINDBUGS] Searching for all files in <https://builds.apache.org/job/Atlas-master-UnitTests/ws/>
that match the pattern **/target/findbugs.xml
[FINDBUGS] No files found. Configuration error?
<Git Blamer> Using GitBlamer to create author and commit information for all warnings.
<Git Blamer> GIT_COMMIT=1ff791cfca9c8167db92bbde0ce02969620cdd60, workspace=<https://builds.apache.org/job/Atlas-master-UnitTests/ws/>
[FINDBUGS] Computing warning deltas based on reference build #222
Archiving artifacts
TestNG Reports Processing: START
Looking for TestNG results report in workspace using pattern: **/target/surefire-reports/testng-results.xml,**/target/failsafe-reports/testng-results.xml
Saving reports...
Processing '/x1/jenkins/jenkins-home/jobs/Atlas-master-UnitTests/builds/225/testng/testng-results-1.xml'
Processing '/x1/jenkins/jenkins-home/jobs/Atlas-master-UnitTests/builds/225/testng/testng-results-2.xml'
Processing '/x1/jenkins/jenkins-home/jobs/Atlas-master-UnitTests/builds/225/testng/testng-results-3.xml'
Processing '/x1/jenkins/jenkins-home/jobs/Atlas-master-UnitTests/builds/225/testng/testng-results-4.xml'
Processing '/x1/jenkins/jenkins-home/jobs/Atlas-master-UnitTests/builds/225/testng/testng-results-5.xml'
Processing '/x1/jenkins/jenkins-home/jobs/Atlas-master-UnitTests/builds/225/testng/testng-results.xml'
TestNG Reports Processing: FINISH

Mime
View raw message