atlas-dev mailing list archives

Site index · List index
Message view « Date » · « Thread »
Top « Date » · « Thread »
From Apache Jenkins Server <jenk...@builds.apache.org>
Subject Build failed in Jenkins: Atlas-0.8-IntegrationTests #143
Date Mon, 04 Dec 2017 15:57:11 GMT
See <https://builds.apache.org/job/Atlas-0.8-IntegrationTests/143/display/redirect?page=changes>

Changes:

[madhan] Atlas-2294: type creation populates description field with empty string

------------------------------------------
[...truncated 497.16 KB...]
127.0.0.1 - - [04/Dec/2017:15:50:09 +0000] "DELETE /api/atlas/entities?guid=03018807-550a-415f-b2de-b9946d1217e7&guid=d89c647a-4afc-484b-a480-d52a055dccb6
HTTP/1.1" 200 - "-" "Java/1.8.0_152"
127.0.0.1 - - [04/Dec/2017:15:50:09 +0000] "GET /api/atlas/entities/d89c647a-4afc-484b-a480-d52a055dccb6
HTTP/1.1" 200 - "-" "Java/1.8.0_152"
127.0.0.1 - - [04/Dec/2017:15:50:09 +0000] "GET /api/atlas/entities/03018807-550a-415f-b2de-b9946d1217e7
HTTP/1.1" 200 - "-" "Java/1.8.0_152"
127.0.0.1 - - [04/Dec/2017:15:50:09 +0000] "POST /api/atlas/entities HTTP/1.1" 201 - "-" "Java/1.8.0_152"
127.0.0.1 - - [04/Dec/2017:15:50:09 +0000] "POST /api/atlas/entities HTTP/1.1" 201 - "-" "Java/1.8.0_152"
127.0.0.1 - - [04/Dec/2017:15:50:09 +0000] "DELETE /api/atlas/entities?guid=ae3cb81b-3c82-4532-94f8-0996c8103503&guid=77bd5d44-c9fb-4275-9f97-99fb30cd9e4e
HTTP/1.1" 200 - "-" "Java/1.8.0_152"
127.0.0.1 - - [04/Dec/2017:15:50:09 +0000] "GET /api/atlas/entities/77bd5d44-c9fb-4275-9f97-99fb30cd9e4e
HTTP/1.1" 200 - "-" "Java/1.8.0_152"
127.0.0.1 - - [04/Dec/2017:15:50:10 +0000] "GET /api/atlas/entities/ae3cb81b-3c82-4532-94f8-0996c8103503
HTTP/1.1" 200 - "-" "Java/1.8.0_152"
127.0.0.1 - - [04/Dec/2017:15:50:10 +0000] "POST /api/atlas/entities HTTP/1.1" 201 - "-" "Java/1.8.0_152"
127.0.0.1 - - [04/Dec/2017:15:50:10 +0000] "DELETE /api/atlas/entities?type=hive_db&property=qualifiedName&value=pl2fk8LGyg
HTTP/1.1" 200 - "-" "Java/1.8.0_152"
127.0.0.1 - - [04/Dec/2017:15:50:10 +0000] "GET /api/atlas/entities/2148e925-330f-42f0-aa2c-85b5bb8b9114
HTTP/1.1" 200 - "-" "Java/1.8.0_152"
127.0.0.1 - - [04/Dec/2017:15:50:10 +0000] "POST /api/atlas/entities HTTP/1.1" 201 - "-" "Java/1.8.0_152"
127.0.0.1 - - [04/Dec/2017:15:50:10 +0000] "POST /api/atlas/entities HTTP/1.1" 201 - "-" "Java/1.8.0_152"
127.0.0.1 - - [04/Dec/2017:15:50:10 +0000] "GET /api/atlas/v2/types/typedef/name/PII_TraitVj8QnLGI6P
HTTP/1.1" 404 - "-" "Java/1.8.0_152"
127.0.0.1 - - [04/Dec/2017:15:50:10 +0000] "POST /api/atlas/types HTTP/1.1" 201 - "-" "Java/1.8.0_152"
127.0.0.1 - - [04/Dec/2017:15:50:10 +0000] "DELETE /api/atlas/entities/e87e8aa5-4c85-4919-a34c-78911b1c27d4/traits/PII_TraitVj8QnLGI6P
HTTP/1.1" 404 - "-" "Java/1.8.0_152"
127.0.0.1 - - [04/Dec/2017:15:50:10 +0000] "POST /api/atlas/entities HTTP/1.1" 201 - "-" "Java/1.8.0_152"
127.0.0.1 - - [04/Dec/2017:15:50:10 +0000] "POST /api/atlas/entities HTTP/1.1" 201 - "-" "Java/1.8.0_152"
127.0.0.1 - - [04/Dec/2017:15:50:10 +0000] "GET /api/atlas/v2/types/typedef/name/PII_TraitrNsOpPuYO2
HTTP/1.1" 404 - "-" "Java/1.8.0_152"
127.0.0.1 - - [04/Dec/2017:15:50:10 +0000] "POST /api/atlas/types HTTP/1.1" 201 - "-" "Java/1.8.0_152"
127.0.0.1 - - [04/Dec/2017:15:50:11 +0000] "POST /api/atlas/entities/fb52211e-aadd-47da-9086-b0a5367f4ea1/traits
HTTP/1.1" 201 - "-" "Java/1.8.0_152"
127.0.0.1 - - [04/Dec/2017:15:50:11 +0000] "GET /api/atlas/entities/fb52211e-aadd-47da-9086-b0a5367f4ea1/audit?count=100
HTTP/1.1" 200 - "-" "Java/1.8.0_152"
127.0.0.1 - - [04/Dec/2017:15:50:11 +0000] "DELETE /api/atlas/entities/fb52211e-aadd-47da-9086-b0a5367f4ea1/traits/PII_TraitrNsOpPuYO2
HTTP/1.1" 200 - "-" "Java/1.8.0_152"
127.0.0.1 - - [04/Dec/2017:15:50:11 +0000] "GET /api/atlas/entities/fb52211e-aadd-47da-9086-b0a5367f4ea1/traitDefinitions/PII_TraitrNsOpPuYO2
HTTP/1.1" 404 - "-" "Java/1.8.0_152"
127.0.0.1 - - [04/Dec/2017:15:50:11 +0000] "GET /api/atlas/entities/fb52211e-aadd-47da-9086-b0a5367f4ea1/audit?count=100
HTTP/1.1" 200 - "-" "Java/1.8.0_152"
127.0.0.1 - - [04/Dec/2017:15:50:11 +0000] "POST /api/atlas/entities HTTP/1.1" 201 - "-" "Java/1.8.0_152"
127.0.0.1 - - [04/Dec/2017:15:50:11 +0000] "POST /api/atlas/entities HTTP/1.1" 201 - "-" "Java/1.8.0_152"
127.0.0.1 - - [04/Dec/2017:15:50:11 +0000] "DELETE /api/atlas/entities/c5db123c-ae86-4b2d-a46c-4e248abac612/traits/blah_trait
HTTP/1.1" 404 - "-" "Java/1.8.0_152"
127.0.0.1 - - [04/Dec/2017:15:50:11 +0000] "POST /api/atlas/entities HTTP/1.1" 201 - "-" "Java/1.8.0_152"
127.0.0.1 - - [04/Dec/2017:15:50:11 +0000] "GET /api/atlas/entities/e3c04cbe-6b62-4a87-b4c4-170524456b84/audit?count=100
HTTP/1.1" 200 - "-" "Java/1.8.0_152"
127.0.0.1 - - [04/Dec/2017:15:50:11 +0000] "GET /api/atlas/discovery/search/dsl?query=hive_db+where+qualifiedName%3D'dbO0nZ5fNPLu'&limit=10&offset=0
HTTP/1.1" 200 - "-" "Java/1.8.0_152"
127.0.0.1 - - [04/Dec/2017:15:50:12 +0000] "POST /api/atlas/entities HTTP/1.1" 201 - "-" "Java/1.8.0_152"
127.0.0.1 - - [04/Dec/2017:15:50:12 +0000] "GET /api/atlas/discovery/search/dsl?query=hive_db+where+qualifiedName%3D'dbO0nZ5fNPLu'&limit=10&offset=0
HTTP/1.1" 200 - "-" "Java/1.8.0_152"
127.0.0.1 - - [04/Dec/2017:15:50:13 +0000] "POST /api/atlas/entities HTTP/1.1" 201 - "-" "Java/1.8.0_152"
127.0.0.1 - - [04/Dec/2017:15:50:13 +0000] "GET /api/atlas/discovery/search/dsl?query=hive_db+where+qualifiedName%3D'dbO0nZ5fNPLu'&limit=10&offset=0
HTTP/1.1" 200 - "-" "Java/1.8.0_152"
127.0.0.1 - - [04/Dec/2017:15:50:13 +0000] "POST /api/atlas/types HTTP/1.1" 201 - "-" "Java/1.8.0_152"
127.0.0.1 - - [04/Dec/2017:15:50:14 +0000] "POST /api/atlas/entities HTTP/1.1" 201 - "-" "Java/1.8.0_152"
127.0.0.1 - - [04/Dec/2017:15:50:14 +0000] "PUT /api/atlas/types HTTP/1.1" 200 - "-" "Java/1.8.0_152"
127.0.0.1 - - [04/Dec/2017:15:50:14 +0000] "GET /api/atlas/entities/f31e8a2b-fcf4-409b-b0a3-c75697a72d1f
HTTP/1.1" 200 - "-" "Java/1.8.0_152"
127.0.0.1 - - [04/Dec/2017:15:50:14 +0000] "POST /api/atlas/entities HTTP/1.1" 400 - "-" "Java/1.8.0_152"
127.0.0.1 - - [04/Dec/2017:15:50:14 +0000] "POST /api/atlas/entities HTTP/1.1" 400 - "-" "Java/1.8.0_152"
127.0.0.1 - - [04/Dec/2017:15:50:14 +0000] "POST /api/atlas/entities HTTP/1.1" 201 - "-" "Java/1.8.0_152"
127.0.0.1 - - [04/Dec/2017:15:50:14 +0000] "GET /api/atlas/entities?type=hive_db&property=qualifiedName&value=cQgiCVEKjG
HTTP/1.1" 200 - "-" "Java/1.8.0_152"
127.0.0.1 - - [04/Dec/2017:15:50:14 +0000] "POST /api/atlas/entities HTTP/1.1" 201 - "-" "Java/1.8.0_152"
127.0.0.1 - - [04/Dec/2017:15:50:14 +0000] "POST /api/atlas/entities HTTP/1.1" 201 - "-" "Java/1.8.0_152"
127.0.0.1 - - [04/Dec/2017:15:50:14 +0000] "GET /api/atlas/entities/85f5048c-2967-4bd1-b13c-6acdeddf47b6
HTTP/1.1" 200 - "-" "Java/1.8.0_152"
127.0.0.1 - - [04/Dec/2017:15:50:14 +0000] "POST /api/atlas/entities HTTP/1.1" 201 - "-" "Java/1.8.0_152"
127.0.0.1 - - [04/Dec/2017:15:50:15 +0000] "POST /api/atlas/entities HTTP/1.1" 201 - "-" "Java/1.8.0_152"
127.0.0.1 - - [04/Dec/2017:15:50:15 +0000] "GET /api/atlas/entities?type=hive_table HTTP/1.1"
200 - "-" "Java/1.8.0_152"
127.0.0.1 - - [04/Dec/2017:15:50:15 +0000] "GET /api/atlas/entities?type=blah HTTP/1.1" 400
- "-" "Java/1.8.0_152"
127.0.0.1 - - [04/Dec/2017:15:50:15 +0000] "GET /api/atlas/v2/types/typedef/name/testrXjzNyyOsQ
HTTP/1.1" 404 - "-" "Java/1.8.0_152"
127.0.0.1 - - [04/Dec/2017:15:50:15 +0000] "POST /api/atlas/types HTTP/1.1" 201 - "-" "Java/1.8.0_152"
127.0.0.1 - - [04/Dec/2017:15:50:15 +0000] "GET /api/atlas/entities?type=testrXjzNyyOsQ HTTP/1.1"
200 - "-" "Java/1.8.0_152"
127.0.0.1 - - [04/Dec/2017:15:50:15 +0000] "GET /api/atlas/entities/blah HTTP/1.1" 404 - "-"
"Java/1.8.0_152"
127.0.0.1 - - [04/Dec/2017:15:50:15 +0000] "POST /api/atlas/entities HTTP/1.1" 201 - "-" "Java/1.8.0_152"
127.0.0.1 - - [04/Dec/2017:15:50:15 +0000] "POST /api/atlas/entities HTTP/1.1" 201 - "-" "Java/1.8.0_152"
127.0.0.1 - - [04/Dec/2017:15:50:15 +0000] "GET /api/atlas/v2/types/typedef/name/PII_TraitIA1KfRoZzk
HTTP/1.1" 404 - "-" "Java/1.8.0_152"
127.0.0.1 - - [04/Dec/2017:15:50:15 +0000] "POST /api/atlas/types HTTP/1.1" 201 - "-" "Java/1.8.0_152"
127.0.0.1 - - [04/Dec/2017:15:50:15 +0000] "POST /api/atlas/entities/e12c2252-efa0-453f-b885-a330e199ba14/traits
HTTP/1.1" 201 - "-" "Java/1.8.0_152"
127.0.0.1 - - [04/Dec/2017:15:50:15 +0000] "GET /api/atlas/entities/e12c2252-efa0-453f-b885-a330e199ba14/traitDefinitions/PII_TraitIA1KfRoZzk
HTTP/1.1" 200 - "-" "Java/1.8.0_152"
127.0.0.1 - - [04/Dec/2017:15:50:15 +0000] "GET /api/atlas/entities/e12c2252-efa0-453f-b885-a330e199ba14/traitDefinitions
HTTP/1.1" 200 - "-" "Java/1.8.0_152"
127.0.0.1 - - [04/Dec/2017:15:50:15 +0000] "POST /api/atlas/entities HTTP/1.1" 201 - "-" "Java/1.8.0_152"
127.0.0.1 - - [04/Dec/2017:15:50:16 +0000] "POST /api/atlas/entities HTTP/1.1" 201 - "-" "Java/1.8.0_152"
127.0.0.1 - - [04/Dec/2017:15:50:16 +0000] "GET /api/atlas/entities/41396afa-945a-4f1d-90f6-85123880a9ea/traits
HTTP/1.1" 200 - "-" "Java/1.8.0_152"
127.0.0.1 - - [04/Dec/2017:15:50:16 +0000] "POST /api/atlas/entities HTTP/1.1" 201 - "-" "Java/1.8.0_152"
127.0.0.1 - - [04/Dec/2017:15:50:16 +0000] "POST /api/atlas/entities HTTP/1.1" 201 - "-" "Java/1.8.0_152"
127.0.0.1 - - [04/Dec/2017:15:50:16 +0000] "POST /api/atlas/entities/60660bc3-ed85-4401-aad0-ae80afd4d2db
HTTP/1.1" 200 - "-" "Java/1.8.0_152"
127.0.0.1 - - [04/Dec/2017:15:50:16 +0000] "GET /api/atlas/entities/60660bc3-ed85-4401-aad0-ae80afd4d2db
HTTP/1.1" 200 - "-" "Java/1.8.0_152"
127.0.0.1 - - [04/Dec/2017:15:50:16 +0000] "POST /api/atlas/entities HTTP/1.1" 201 - "-" "Java/1.8.0_152"
127.0.0.1 - - [04/Dec/2017:15:50:16 +0000] "POST /api/atlas/entities HTTP/1.1" 201 - "-" "Java/1.8.0_152"
127.0.0.1 - - [04/Dec/2017:15:50:16 +0000] "POST /api/atlas/entities/qualifiedName?type=hive_table&property=qualifiedName&value=tableZjtwYhU1G1
HTTP/1.1" 200 - "-" "Java/1.8.0_152"
127.0.0.1 - - [04/Dec/2017:15:50:16 +0000] "GET /api/atlas/entities/7ece9e18-5f0a-4509-89a1-e8afa564c852
HTTP/1.1" 200 - "-" "Java/1.8.0_152"
127.0.0.1 - - [04/Dec/2017:15:50:17 +0000] "POST /api/atlas/entities HTTP/1.1" 201 - "-" "Java/1.8.0_152"
127.0.0.1 - - [04/Dec/2017:15:50:17 +0000] "GET /api/atlas/entities/6e731b7f-48d9-4c11-95bf-56fedc71a9bb/audit?count=10
HTTP/1.1" 200 - "-" "Java/1.8.0_152"
127.0.0.1 - - [04/Dec/2017:15:50:17 +0000] "POST /api/atlas/entities HTTP/1.1" 201 - "-" "Java/1.8.0_152"
127.0.0.1 - - [04/Dec/2017:15:50:17 +0000] "POST /api/atlas/entities HTTP/1.1" 201 - "-" "Java/1.8.0_152"
127.0.0.1 - - [04/Dec/2017:15:50:17 +0000] "POST /api/atlas/entities HTTP/1.1" 201 - "-" "Java/1.8.0_152"
127.0.0.1 - - [04/Dec/2017:15:50:17 +0000] "POST /api/atlas/entities HTTP/1.1" 400 - "-" "Java/1.8.0_152"
127.0.0.1 - - [04/Dec/2017:15:50:17 +0000] "POST /api/atlas/entities HTTP/1.1" 201 - "-" "Java/1.8.0_152"
127.0.0.1 - - [04/Dec/2017:15:50:17 +0000] "GET /api/atlas/v2/types/typedef/name/NpOcyyY7qs
HTTP/1.1" 404 - "-" "Java/1.8.0_152"
127.0.0.1 - - [04/Dec/2017:15:50:17 +0000] "POST /api/atlas/types HTTP/1.1" 201 - "-" "Java/1.8.0_152"
127.0.0.1 - - [04/Dec/2017:15:50:17 +0000] "POST /api/atlas/entities HTTP/1.1" 201 - "-" "Java/1.8.0_152"
127.0.0.1 - - [04/Dec/2017:15:50:17 +0000] "GET /api/atlas/entities/f3e72ae5-cb81-43ec-8a9d-ab75907dbbca
HTTP/1.1" 200 - "-" "Java/1.8.0_152"
127.0.0.1 - - [04/Dec/2017:15:50:35 +0000] "GET /api/atlas/admin/status HTTP/1.1" 200 - "-"
"Java/1.8.0_152"
127.0.0.1 - - [04/Dec/2017:15:50:35 +0000] "GET /api/atlas/v1/taxonomies HTTP/1.1" 403 493
"-" "Java/1.8.0_152"
127.0.0.1 - - [04/Dec/2017:15:50:35 +0000] "GET /api/atlas/admin/session HTTP/1.1" 200 - "-"
"Java/1.8.0_152"
127.0.0.1 - - [04/Dec/2017:15:50:35 +0000] "GET /api/atlas/admin/session HTTP/1.1" 401 317
"-" "Java/1.8.0_152"
Tests run: 142, Failures: 1, Errors: 0, Skipped: 21, Time elapsed: 108.053 sec <<<
FAILURE! - in TestSuite
setUp(org.apache.atlas.notification.NotificationHookConsumerIT)  Time elapsed: 0.259 sec 
<<< FAILURE!
org.apache.atlas.AtlasException: Failed to start embedded kafka
	at sun.nio.ch.Net.bind0(Native Method)
	at sun.nio.ch.Net.bind(Net.java:433)
	at sun.nio.ch.Net.bind(Net.java:425)
	at sun.nio.ch.ServerSocketChannelImpl.bind(ServerSocketChannelImpl.java:223)
	at sun.nio.ch.ServerSocketAdaptor.bind(ServerSocketAdaptor.java:74)
	at sun.nio.ch.ServerSocketAdaptor.bind(ServerSocketAdaptor.java:67)
	at org.apache.zookeeper.server.NIOServerCnxnFactory.configure(NIOServerCnxnFactory.java:95)
	at org.apache.zookeeper.server.ServerCnxnFactory.createFactory(ServerCnxnFactory.java:126)
	at org.apache.atlas.kafka.EmbeddedKafkaServer.startZk(EmbeddedKafkaServer.java:113)
	at org.apache.atlas.kafka.EmbeddedKafkaServer.start(EmbeddedKafkaServer.java:77)
	at org.apache.atlas.web.integration.BaseResourceIT.initNotificationService(BaseResourceIT.java:699)
	at org.apache.atlas.notification.NotificationHookConsumerIT.setUp(NotificationHookConsumerIT.java:53)


Results :

Failed tests: 
  NotificationHookConsumerIT.setUp:53->BaseResourceIT.initNotificationService:699 »
Atlas

Tests run: 142, Failures: 1, Errors: 0, Skipped: 21

[INFO] 
[INFO] --- jetty-maven-plugin:9.2.12.v20150709:stop (stop-jetty) @ atlas-webapp ---
[INFO] Waiting 10 seconds for jetty to stop
[INFO] Stopped ServerConnector@a9e4646{HTTP/1.1}{0.0.0.0:31000}
[INFO] Closing Spring root WebApplicationContext
[INFO] Shutting down log4j
[INFO] Not cleaning cached beans: no such field javax.el.BeanELResolver.properties
[INFO] Stopped o.e.j.m.p.JettyWebAppContext@17f759ff{/,<https://builds.apache.org/job/Atlas-0.8-IntegrationTests/ws/webapp/target/atlas-webapp-0.8.2-SNAPSHOT/,UNAVAILABLE}{/home/jenkins/jenkins-slave/workspace/Atlas-0.8-IntegrationTests/webapp/target/atlas-webapp-0.8.2-SNAPSHOT.war}>
[INFO] Server reports itself as stopped
[INFO] 
[INFO] --- maven-source-plugin:2.4:jar-no-fork (attach-sources) @ atlas-webapp ---
[INFO] Building jar: <https://builds.apache.org/job/Atlas-0.8-IntegrationTests/ws/webapp/target/atlas-webapp-0.8.2-SNAPSHOT-sources.jar>
log4j:WARN No appenders could be found for logger (org.apache.zookeeper.ClientCnxn).
log4j:WARN Please initialize the log4j system properly.
log4j:WARN See http://logging.apache.org/log4j/1.2/faq.html#noconfig for more info.
[INFO] 
[INFO] --- maven-source-plugin:2.4:test-jar-no-fork (attach-sources) @ atlas-webapp ---
[INFO] Building jar: <https://builds.apache.org/job/Atlas-0.8-IntegrationTests/ws/webapp/target/atlas-webapp-0.8.2-SNAPSHOT-test-sources.jar>
[INFO] 
[INFO] --- maven-failsafe-plugin:2.18.1:verify (verify) @ atlas-webapp ---
[INFO] Failsafe report directory: <https://builds.apache.org/job/Atlas-0.8-IntegrationTests/ws/webapp/target/failsafe-reports>
[INFO] ------------------------------------------------------------------------
[INFO] Reactor Summary:
[INFO] 
[INFO] Apache Atlas Server Build Tools .................... SUCCESS [  0.808 s]
[INFO] apache-atlas ....................................... SUCCESS [  5.324 s]
[INFO] Apache Atlas Integration ........................... SUCCESS [ 19.064 s]
[INFO] Apache Atlas Common ................................ SUCCESS [  8.180 s]
[INFO] Apache Atlas Typesystem ............................ SUCCESS [ 46.693 s]
[INFO] Apache Atlas Client ................................ SUCCESS [  0.707 s]
[INFO] atlas-client-common ................................ SUCCESS [  7.319 s]
[INFO] atlas-client-v1 .................................... SUCCESS [  7.590 s]
[INFO] Apache Atlas Server API ............................ SUCCESS [  5.986 s]
[INFO] Apache Atlas Notification .......................... SUCCESS [ 10.194 s]
[INFO] atlas-client-v2 .................................... SUCCESS [  5.594 s]
[INFO] Apache Atlas Graph Database Projects ............... SUCCESS [  0.579 s]
[INFO] Apache Atlas Graph Database API .................... SUCCESS [  4.819 s]
[INFO] Graph Database Common Code ......................... SUCCESS [  5.121 s]
[INFO] Apache Atlas Titan 1.0.0 GraphDB Impl .............. SUCCESS [ 36.955 s]
[INFO] Shaded version of Apache hbase client .............. SUCCESS [  7.547 s]
[INFO] Apache Atlas Titan 0.5.4 Graph DB Impl ............. SUCCESS [ 35.162 s]
[INFO] Apache Atlas Graph Database Implementation Dependencies SUCCESS [  0.611 s]
[INFO] Shaded version of Apache hbase server .............. SUCCESS [ 22.575 s]
[INFO] Apache Atlas Repository ............................ SUCCESS [01:17 min]
[INFO] Apache Atlas Authorization ......................... SUCCESS [  6.934 s]
[INFO] Apache Atlas Business Catalog ...................... SUCCESS [ 10.099 s]
[INFO] Apache Atlas UI .................................... SUCCESS [01:12 min]
[INFO] Apache Atlas Web Application ....................... FAILURE [03:26 min]
[INFO] Apache Atlas Documentation ......................... SKIPPED
[INFO] Apache Atlas FileSystem Model ...................... SKIPPED
[INFO] Apache Atlas Plugin Classloader .................... SKIPPED
[INFO] Apache Atlas Hive Bridge Shim ...................... SKIPPED
[INFO] Apache Atlas Hive Bridge ........................... SKIPPED
[INFO] Apache Atlas Falcon Bridge Shim .................... SKIPPED
[INFO] Apache Atlas Falcon Bridge ......................... SKIPPED
[INFO] Apache Atlas Sqoop Bridge Shim ..................... SKIPPED
[INFO] Apache Atlas Sqoop Bridge .......................... SKIPPED
[INFO] Apache Atlas Storm Bridge Shim ..................... SKIPPED
[INFO] Apache Atlas Storm Bridge .......................... SKIPPED
[INFO] Apache Atlas Hbase Bridge Shim ..................... SKIPPED
[INFO] Apache Atlas Hbase Bridge .......................... SKIPPED
[INFO] Apache Atlas Distribution .......................... SKIPPED
[INFO] ------------------------------------------------------------------------
[INFO] BUILD FAILURE
[INFO] ------------------------------------------------------------------------
[INFO] Total time: 10:05 min
[INFO] Finished at: 2017-12-04T15:50:45Z
[INFO] Final Memory: 366M/2576M
[INFO] ------------------------------------------------------------------------
[ERROR] Failed to execute goal org.apache.maven.plugins:maven-failsafe-plugin:2.18.1:verify
(verify) on project atlas-webapp: There are test failures.
[ERROR] 
[ERROR] Please refer to <https://builds.apache.org/job/Atlas-0.8-IntegrationTests/ws/webapp/target/failsafe-reports>
for the individual test results.
[ERROR] -> [Help 1]
[ERROR] 
[ERROR] To see the full stack trace of the errors, re-run Maven with the -e switch.
[ERROR] Re-run Maven using the -X switch to enable full debug logging.
[ERROR] 
[ERROR] For more information about the errors and possible solutions, please read the following
articles:
[ERROR] [Help 1] http://cwiki.apache.org/confluence/display/MAVEN/MojoFailureException
[ERROR] 
[ERROR] After correcting the problems, you can resume the build with the command
[ERROR]   mvn <goals> -rf :atlas-webapp
Build step 'Execute shell' marked build as failure
[CHECKSTYLE] Collecting checkstyle analysis files...
[CHECKSTYLE] Searching for all files in <https://builds.apache.org/job/Atlas-0.8-IntegrationTests/ws/>
that match the pattern **/target/checkstyle-result.xml
[CHECKSTYLE] Parsing 22 files in <https://builds.apache.org/job/Atlas-0.8-IntegrationTests/ws/>
[CHECKSTYLE] Successfully parsed file <https://builds.apache.org/job/Atlas-0.8-IntegrationTests/ws/authorization/target/checkstyle-result.xml>
with 467 unique warnings and 0 duplicates.
[CHECKSTYLE] Successfully parsed file <https://builds.apache.org/job/Atlas-0.8-IntegrationTests/ws/catalog/target/checkstyle-result.xml>
with 2604 unique warnings and 0 duplicates.
[CHECKSTYLE] Successfully parsed file <https://builds.apache.org/job/Atlas-0.8-IntegrationTests/ws/client/client-v1/target/checkstyle-result.xml>
with 3480 unique warnings and 0 duplicates.
[CHECKSTYLE] Successfully parsed file <https://builds.apache.org/job/Atlas-0.8-IntegrationTests/ws/client/client-v2/target/checkstyle-result.xml>
with 3805 unique warnings and 0 duplicates.
[CHECKSTYLE] Successfully parsed file <https://builds.apache.org/job/Atlas-0.8-IntegrationTests/ws/client/common/target/checkstyle-result.xml>
with 4295 unique warnings and 0 duplicates.
[CHECKSTYLE] Successfully parsed file <https://builds.apache.org/job/Atlas-0.8-IntegrationTests/ws/client/target/checkstyle-result.xml>
with 4295 unique warnings and 0 duplicates.
[CHECKSTYLE] Successfully parsed file <https://builds.apache.org/job/Atlas-0.8-IntegrationTests/ws/common/target/checkstyle-result.xml>
with 5254 unique warnings and 0 duplicates.
[CHECKSTYLE] Successfully parsed file <https://builds.apache.org/job/Atlas-0.8-IntegrationTests/ws/dashboardv2/target/checkstyle-result.xml>
with 5254 unique warnings and 0 duplicates.
[CHECKSTYLE] Successfully parsed file <https://builds.apache.org/job/Atlas-0.8-IntegrationTests/ws/graphdb/api/target/checkstyle-result.xml>
with 5527 unique warnings and 0 duplicates.
[CHECKSTYLE] Successfully parsed file <https://builds.apache.org/job/Atlas-0.8-IntegrationTests/ws/graphdb/common/target/checkstyle-result.xml>
with 5714 unique warnings and 0 duplicates.
[CHECKSTYLE] Successfully parsed file <https://builds.apache.org/job/Atlas-0.8-IntegrationTests/ws/graphdb/graphdb-impls/target/checkstyle-result.xml>
with 5714 unique warnings and 0 duplicates.
[CHECKSTYLE] Successfully parsed file <https://builds.apache.org/job/Atlas-0.8-IntegrationTests/ws/graphdb/target/checkstyle-result.xml>
with 5714 unique warnings and 0 duplicates.
[CHECKSTYLE] Successfully parsed file <https://builds.apache.org/job/Atlas-0.8-IntegrationTests/ws/graphdb/titan0/target/checkstyle-result.xml>
with 8169 unique warnings and 0 duplicates.
[CHECKSTYLE] Successfully parsed file <https://builds.apache.org/job/Atlas-0.8-IntegrationTests/ws/graphdb/titan1/target/checkstyle-result.xml>
with 9136 unique warnings and 0 duplicates.
[CHECKSTYLE] Successfully parsed file <https://builds.apache.org/job/Atlas-0.8-IntegrationTests/ws/intg/target/checkstyle-result.xml>
with 15940 unique warnings and 0 duplicates.
[CHECKSTYLE] Successfully parsed file <https://builds.apache.org/job/Atlas-0.8-IntegrationTests/ws/notification/target/checkstyle-result.xml>
with 17529 unique warnings and 0 duplicates.
[CHECKSTYLE] Successfully parsed file <https://builds.apache.org/job/Atlas-0.8-IntegrationTests/ws/repository/target/checkstyle-result.xml>
with 36492 unique warnings and 0 duplicates.
[CHECKSTYLE] Successfully parsed file <https://builds.apache.org/job/Atlas-0.8-IntegrationTests/ws/server-api/target/checkstyle-result.xml>
with 36885 unique warnings and 0 duplicates.
[CHECKSTYLE] Successfully parsed file <https://builds.apache.org/job/Atlas-0.8-IntegrationTests/ws/shaded/hbase-client-shaded/target/checkstyle-result.xml>
with 36885 unique warnings and 0 duplicates.
[CHECKSTYLE] Successfully parsed file <https://builds.apache.org/job/Atlas-0.8-IntegrationTests/ws/shaded/hbase-server-shaded/target/checkstyle-result.xml>
with 36885 unique warnings and 0 duplicates.
[CHECKSTYLE] Successfully parsed file <https://builds.apache.org/job/Atlas-0.8-IntegrationTests/ws/target/checkstyle-result.xml>
with 36885 unique warnings and 0 duplicates.
[CHECKSTYLE] Successfully parsed file <https://builds.apache.org/job/Atlas-0.8-IntegrationTests/ws/typesystem/target/checkstyle-result.xml>
with 41103 unique warnings and 0 duplicates.
<Git Blamer> Using GitBlamer to create author and commit information for all warnings.
<Git Blamer> GIT_COMMIT=833b31e297b0c6b7670ef5b5bde18a755cb95c01, workspace=<https://builds.apache.org/job/Atlas-0.8-IntegrationTests/ws/>
 > git rev-parse 833b31e297b0c6b7670ef5b5bde18a755cb95c01^{commit} # timeout=10
[FINDBUGS] Collecting findbugs analysis files...
[FINDBUGS] Searching for all files in <https://builds.apache.org/job/Atlas-0.8-IntegrationTests/ws/>
that match the pattern **/target/findbugs.xml
[FINDBUGS] Parsing 15 files in <https://builds.apache.org/job/Atlas-0.8-IntegrationTests/ws/>
[FINDBUGS] Successfully parsed file <https://builds.apache.org/job/Atlas-0.8-IntegrationTests/ws/authorization/target/findbugs.xml>
with 0 unique warnings and 0 duplicates.
[FINDBUGS] Successfully parsed file <https://builds.apache.org/job/Atlas-0.8-IntegrationTests/ws/catalog/target/findbugs.xml>
with 0 unique warnings and 0 duplicates.
[FINDBUGS] Successfully parsed file <https://builds.apache.org/job/Atlas-0.8-IntegrationTests/ws/client/client-v1/target/findbugs.xml>
with 0 unique warnings and 0 duplicates.
[FINDBUGS] Successfully parsed file <https://builds.apache.org/job/Atlas-0.8-IntegrationTests/ws/client/client-v2/target/findbugs.xml>
with 0 unique warnings and 0 duplicates.
[FINDBUGS] Successfully parsed file <https://builds.apache.org/job/Atlas-0.8-IntegrationTests/ws/client/common/target/findbugs.xml>
with 0 unique warnings and 0 duplicates.
[FINDBUGS] Successfully parsed file <https://builds.apache.org/job/Atlas-0.8-IntegrationTests/ws/common/target/findbugs.xml>
with 0 unique warnings and 0 duplicates.
[FINDBUGS] Successfully parsed file <https://builds.apache.org/job/Atlas-0.8-IntegrationTests/ws/graphdb/api/target/findbugs.xml>
with 0 unique warnings and 0 duplicates.
[FINDBUGS] Successfully parsed file <https://builds.apache.org/job/Atlas-0.8-IntegrationTests/ws/graphdb/common/target/findbugs.xml>
with 0 unique warnings and 0 duplicates.
[FINDBUGS] Successfully parsed file <https://builds.apache.org/job/Atlas-0.8-IntegrationTests/ws/graphdb/titan0/target/findbugs.xml>
with 0 unique warnings and 0 duplicates.
[FINDBUGS] Successfully parsed file <https://builds.apache.org/job/Atlas-0.8-IntegrationTests/ws/graphdb/titan1/target/findbugs.xml>
with 0 unique warnings and 0 duplicates.
[FINDBUGS] Successfully parsed file <https://builds.apache.org/job/Atlas-0.8-IntegrationTests/ws/intg/target/findbugs.xml>
with 0 unique warnings and 0 duplicates.
[FINDBUGS] Successfully parsed file <https://builds.apache.org/job/Atlas-0.8-IntegrationTests/ws/notification/target/findbugs.xml>
with 0 unique warnings and 0 duplicates.
[FINDBUGS] Successfully parsed file <https://builds.apache.org/job/Atlas-0.8-IntegrationTests/ws/repository/target/findbugs.xml>
with 0 unique warnings and 0 duplicates.
[FINDBUGS] Successfully parsed file <https://builds.apache.org/job/Atlas-0.8-IntegrationTests/ws/server-api/target/findbugs.xml>
with 0 unique warnings and 0 duplicates.
[FINDBUGS] Successfully parsed file <https://builds.apache.org/job/Atlas-0.8-IntegrationTests/ws/typesystem/target/findbugs.xml>
with 0 unique warnings and 0 duplicates.
<Git Blamer> Using GitBlamer to create author and commit information for all warnings.
<Git Blamer> GIT_COMMIT=833b31e297b0c6b7670ef5b5bde18a755cb95c01, workspace=<https://builds.apache.org/job/Atlas-0.8-IntegrationTests/ws/>
Archiving artifacts
[Fast Archiver] No prior successful build to compare, so performing full copy of artifacts
TestNG Reports Processing: START
Looking for TestNG results report in workspace using pattern: **/target/surefire-reports/testng-results.xml,**/target/failsafe-reports/testng-results.xml
Saving reports...
Processing '/x1/jenkins/jenkins-home/jobs/Atlas-0.8-IntegrationTests/builds/143/testng/testng-results.xml'
TestNG Reports Processing: FINISH

Mime
View raw message