atlas-dev mailing list archives

Site index · List index
Message view « Date » · « Thread »
Top « Date » · « Thread »
From Apache Jenkins Server <jenk...@builds.apache.org>
Subject Build failed in Jenkins: Atlas-0.8-NoTests #148
Date Mon, 18 Dec 2017 05:31:18 GMT
See <https://builds.apache.org/job/Atlas-0.8-NoTests/148/display/redirect>

------------------------------------------
[...truncated 402.92 KB...]
[INFO] 
[INFO] --- maven-failsafe-plugin:2.18.1:verify (verify) @ hbase-bridge-shim ---
[INFO] Tests are skipped.
[INFO] 
[INFO] --- maven-checkstyle-plugin:2.9.1:check (checkstyle-check) @ hbase-bridge-shim ---
[INFO] 
[INFO] >>> findbugs-maven-plugin:3.0.1:check (findbugs-check) > :findbugs @ hbase-bridge-shim
>>>
[INFO] 
[INFO] --- findbugs-maven-plugin:3.0.1:findbugs (findbugs) @ hbase-bridge-shim ---
[INFO] 
[INFO] <<< findbugs-maven-plugin:3.0.1:check (findbugs-check) < :findbugs @ hbase-bridge-shim
<<<
[INFO] 
[INFO] 
[INFO] --- findbugs-maven-plugin:3.0.1:check (findbugs-check) @ hbase-bridge-shim ---
[INFO] 
[INFO] --- maven-install-plugin:2.5.2:install (default-install) @ hbase-bridge-shim ---
[INFO] Installing <https://builds.apache.org/job/Atlas-0.8-NoTests/ws/addons/hbase-bridge-shim/target/hbase-bridge-shim-0.8.2-SNAPSHOT.jar>
to /home/jenkins/.m2/repository/org/apache/atlas/hbase-bridge-shim/0.8.2-SNAPSHOT/hbase-bridge-shim-0.8.2-SNAPSHOT.jar
[INFO] Installing <https://builds.apache.org/job/Atlas-0.8-NoTests/ws/addons/hbase-bridge-shim/pom.xml>
to /home/jenkins/.m2/repository/org/apache/atlas/hbase-bridge-shim/0.8.2-SNAPSHOT/hbase-bridge-shim-0.8.2-SNAPSHOT.pom
[INFO] Installing <https://builds.apache.org/job/Atlas-0.8-NoTests/ws/addons/hbase-bridge-shim/target/hbase-bridge-shim-0.8.2-SNAPSHOT-sources.jar>
to /home/jenkins/.m2/repository/org/apache/atlas/hbase-bridge-shim/0.8.2-SNAPSHOT/hbase-bridge-shim-0.8.2-SNAPSHOT-sources.jar
[INFO] Installing <https://builds.apache.org/job/Atlas-0.8-NoTests/ws/addons/hbase-bridge-shim/target/hbase-bridge-shim-0.8.2-SNAPSHOT-test-sources.jar>
to /home/jenkins/.m2/repository/org/apache/atlas/hbase-bridge-shim/0.8.2-SNAPSHOT/hbase-bridge-shim-0.8.2-SNAPSHOT-test-sources.jar
[INFO] 
[INFO] ------------------------------------------------------------------------
[INFO] Building Apache Atlas Hbase Bridge 0.8.2-SNAPSHOT
[INFO] ------------------------------------------------------------------------
[INFO] 
[INFO] --- maven-clean-plugin:2.5:clean (default-clean) @ hbase-bridge ---
[INFO] Deleting <https://builds.apache.org/job/Atlas-0.8-NoTests/ws/addons/hbase-bridge>
(includes = [**/*.pyc], excludes = [])
[INFO] 
[INFO] --- maven-resources-plugin:2.7:copy-resources (copy-resources) @ hbase-bridge ---
[INFO] Using 'UTF-8' encoding to copy filtered resources.
[INFO] Copying 12 resources
[INFO] 
[INFO] --- buildnumber-maven-plugin:1.4:create (default) @ hbase-bridge ---
[INFO] Executing: /bin/sh -c cd '<https://builds.apache.org/job/Atlas-0.8-NoTests/ws/addons/hbase-bridge'>
&& 'git' 'rev-parse' '--verify' 'HEAD'
[INFO] Working directory: <https://builds.apache.org/job/Atlas-0.8-NoTests/ws/addons/hbase-bridge>
[INFO] Storing buildNumber: d6e69c6dd12448d413a51ae251756fd3c4825a7d at timestamp: 1513574997002
[WARNING] Cannot get the branch information from the git repository: 
Detecting the current branch failed: fatal: ref HEAD is not a symbolic ref

[INFO] Executing: /bin/sh -c cd '<https://builds.apache.org/job/Atlas-0.8-NoTests/ws/addons/hbase-bridge'>
&& 'git' 'rev-parse' '--verify' 'HEAD'
[INFO] Working directory: <https://builds.apache.org/job/Atlas-0.8-NoTests/ws/addons/hbase-bridge>
[INFO] Storing buildScmBranch: UNKNOWN
[INFO] 
[INFO] --- apache-rat-plugin:0.7:check (rat-check) @ hbase-bridge ---
[INFO] Exclude: **/dependency-reduced-pom.xml
[INFO] Exclude: **/javax.script.ScriptEngineFactory
[INFO] Exclude: .reviewboardrc
[INFO] Exclude: 3party-licenses/**
[INFO] Exclude: **/.cache
[INFO] Exclude: **/.cache-main
[INFO] Exclude: **/.cache-tests
[INFO] Exclude: **/.checkstyle
[INFO] Exclude: *.txt
[INFO] Exclude: **/*.json
[INFO] Exclude: .pc/**
[INFO] Exclude: debian/**
[INFO] Exclude: .svn/**
[INFO] Exclude: .git/**
[INFO] Exclude: .gitignore
[INFO] Exclude: **/.idea/**
[INFO] Exclude: **/*.twiki
[INFO] Exclude: **/*.iml
[INFO] Exclude: **/*.json
[INFO] Exclude: **/*.log
[INFO] Exclude: **/target/**
[INFO] Exclude: **/target*/**
[INFO] Exclude: **/build/**
[INFO] Exclude: **/*.patch
[INFO] Exclude: derby.log
[INFO] Exclude: **/logs/**
[INFO] Exclude: **/.classpath
[INFO] Exclude: **/.project
[INFO] Exclude: **/.settings/**
[INFO] Exclude: **/test-output/**
[INFO] Exclude: **/mock/**
[INFO] Exclude: **/data/**
[INFO] Exclude: **/maven-eclipse.xml
[INFO] Exclude: **/.externalToolBuilders/**
[INFO] Exclude: **/build.log
[INFO] Exclude: **/.bowerrc
[INFO] Exclude: *.json
[INFO] Exclude: **/overlays/**
[INFO] Exclude: dev-support/**
[INFO] Exclude: **/users-credentials.properties
[INFO] Exclude: **/public/css/animate.min.css
[INFO] Exclude: **/public/css/bootstrap-sidebar.css
[INFO] Exclude: **/public/js/external_lib/**
[INFO] Exclude: **/node_modules/**
[INFO] Exclude: **/public/js/libs/**
[INFO] Exclude: **/atlas.data/**
[INFO] Exclude: **/${sys:atlas.data}/**
[INFO] Exclude: **/policy-store.txt
[INFO] Exclude: **/*rebel*.xml
[INFO] Exclude: **/*rebel*.xml.bak
[INFO] 
[INFO] --- maven-remote-resources-plugin:1.5:process (default) @ hbase-bridge ---
[INFO] 
[INFO] --- maven-resources-plugin:2.7:resources (default-resources) @ hbase-bridge ---
[INFO] Using 'UTF-8' encoding to copy filtered resources.
[INFO] Copying 1 resource
[INFO] Copying 0 resource to META-INF
[INFO] Copying 3 resources
[INFO] 
[INFO] --- scala-maven-plugin:3.2.0:compile (scala-compile-first) @ hbase-bridge ---
[WARNING] Zinc server is not available at port 3030 - reverting to normal incremental compile
[INFO] Using incremental compilation
[INFO] Compiling 7 Java sources to <https://builds.apache.org/job/Atlas-0.8-NoTests/ws/addons/hbase-bridge/target/classes...>
[WARNING] warning: [options] bootstrap class path not set in conjunction with -source 1.7
[WARNING] Note: Some input files use or override a deprecated API.
[WARNING] Note: Recompile with -Xlint:deprecation for details.
[WARNING] 1 warning
[INFO] 
[INFO] --- maven-compiler-plugin:3.1:compile (default-compile) @ hbase-bridge ---
[INFO] Changes detected - recompiling the module!
[INFO] Compiling 7 source files to <https://builds.apache.org/job/Atlas-0.8-NoTests/ws/addons/hbase-bridge/target/classes>
[WARNING] <https://builds.apache.org/job/Atlas-0.8-NoTests/ws/addons/hbase-bridge/src/main/java/org/apache/atlas/hbase/hook/HBaseAtlasCoprocessorBase.java>:
Some input files use or override a deprecated API.
[WARNING] <https://builds.apache.org/job/Atlas-0.8-NoTests/ws/addons/hbase-bridge/src/main/java/org/apache/atlas/hbase/hook/HBaseAtlasCoprocessorBase.java>:
Recompile with -Xlint:deprecation for details.
[INFO] 
[INFO] --- maven-resources-plugin:2.7:testResources (default-testResources) @ hbase-bridge
---
[INFO] Using 'UTF-8' encoding to copy filtered resources.
[INFO] skip non existing resourceDirectory <https://builds.apache.org/job/Atlas-0.8-NoTests/ws/addons/hbase-bridge/src/test/resources>
[INFO] skip non existing resourceDirectory <https://builds.apache.org/job/Atlas-0.8-NoTests/ws/addons/hbase-bridge/typesystem/src/test/resources>
[INFO] Copying 3 resources
[INFO] 
[INFO] --- scala-maven-plugin:3.2.0:testCompile (scala-test-compile-first) @ hbase-bridge
---
[WARNING] Zinc server is not available at port 3030 - reverting to normal incremental compile
[INFO] Using incremental compilation
[INFO] Compiling 1 Java source to <https://builds.apache.org/job/Atlas-0.8-NoTests/ws/addons/hbase-bridge/target/test-classes...>
[WARNING] warning: [options] bootstrap class path not set in conjunction with -source 1.7
[WARNING] Note: <https://builds.apache.org/job/Atlas-0.8-NoTests/ws/addons/hbase-bridge/src/test/java/org/apache/atlas/hbase/HBaseAtlasHookIT.java>
uses or overrides a deprecated API.
[WARNING] Note: Recompile with -Xlint:deprecation for details.
[WARNING] 1 warning
[INFO] 
[INFO] --- maven-compiler-plugin:3.1:testCompile (default-testCompile) @ hbase-bridge ---
[INFO] Changes detected - recompiling the module!
[INFO] Compiling 1 source file to <https://builds.apache.org/job/Atlas-0.8-NoTests/ws/addons/hbase-bridge/target/test-classes>
[WARNING] <https://builds.apache.org/job/Atlas-0.8-NoTests/ws/addons/hbase-bridge/src/test/java/org/apache/atlas/hbase/HBaseAtlasHookIT.java>:
<https://builds.apache.org/job/Atlas-0.8-NoTests/ws/addons/hbase-bridge/src/test/java/org/apache/atlas/hbase/HBaseAtlasHookIT.java>
uses or overrides a deprecated API.
[WARNING] <https://builds.apache.org/job/Atlas-0.8-NoTests/ws/addons/hbase-bridge/src/test/java/org/apache/atlas/hbase/HBaseAtlasHookIT.java>:
Recompile with -Xlint:deprecation for details.
[INFO] 
[INFO] --- maven-surefire-plugin:2.18.1:test (default-test) @ hbase-bridge ---
[INFO] Tests are skipped.
[INFO] 
[INFO] --- maven-site-plugin:3.4:site (default) @ hbase-bridge ---
[INFO] maven.site.skip = true: Skipping site generation
[INFO] 
[INFO] --- maven-jar-plugin:2.5:jar (default-jar) @ hbase-bridge ---
[INFO] Building jar: <https://builds.apache.org/job/Atlas-0.8-NoTests/ws/addons/hbase-bridge/target/hbase-bridge-0.8.2-SNAPSHOT.jar>
[INFO] 
[INFO] --- maven-site-plugin:3.4:attach-descriptor (attach-descriptor) @ hbase-bridge ---
[INFO] 
[INFO] --- maven-dependency-plugin:2.10:copy (copy-hook) @ hbase-bridge ---
[INFO] Configured Artifact: org.apache.atlas:hbase-bridge:0.8.2-SNAPSHOT:jar
[INFO] Configured Artifact: org.json4s:json4s-native_2.11:3.2.11:jar
[INFO] Configured Artifact: org.json4s:json4s-core_2.11:3.2.11:jar
[INFO] Configured Artifact: org.json4s:json4s-ast_2.11:3.2.11:jar
[INFO] Configured Artifact: org.apache.atlas:atlas-client-v1:0.8.2-SNAPSHOT:jar
[INFO] Configured Artifact: org.apache.atlas:atlas-client-common:0.8.2-SNAPSHOT:jar
[INFO] Configured Artifact: org.apache.atlas:atlas-client-v2:0.8.2-SNAPSHOT:jar
[INFO] Configured Artifact: org.apache.atlas:atlas-intg:0.8.2-SNAPSHOT:jar
[INFO] Configured Artifact: org.apache.atlas:atlas-typesystem:0.8.2-SNAPSHOT:jar
[INFO] Configured Artifact: org.apache.atlas:atlas-notification:0.8.2-SNAPSHOT:jar
[INFO] Configured Artifact: org.apache.atlas:hdfs-model:0.8.2-SNAPSHOT:jar
[INFO] Configured Artifact: org.apache.atlas:atlas-common:0.8.2-SNAPSHOT:jar
[INFO] Configured Artifact: org.scala-lang:scala-compiler:2.11.8:jar
[INFO] Configured Artifact: org.scala-lang:scala-reflect:2.11.8:jar
[INFO] Configured Artifact: org.scala-lang:scala-library:2.11.8:jar
[INFO] Configured Artifact: org.scala-lang:scalap:2.11.8:jar
[INFO] Configured Artifact: com.google.inject.extensions:guice-multibindings:4.1.0:jar
[INFO] Configured Artifact: org.apache.kafka:kafka_2.11:0.10.0.0:jar
[INFO] Configured Artifact: org.apache.kafka:kafka-clients:0.10.0.0:jar
[INFO] Configured Artifact: com.google.code.gson:gson:2.5:jar
[INFO] Configured Artifact: org.scala-lang:scala-library:2.11.8:jar
[INFO] Configured Artifact: com.fasterxml.jackson.core:jackson-databind:?:jar
[INFO] ------------------------------------------------------------------------
[INFO] Reactor Summary:
[INFO] 
[INFO] Apache Atlas Server Build Tools .................... SUCCESS [  0.605 s]
[INFO] apache-atlas ....................................... SUCCESS [  2.669 s]
[INFO] Apache Atlas Integration ........................... SUCCESS [  4.267 s]
[INFO] Apache Atlas Common ................................ SUCCESS [  1.022 s]
[INFO] Apache Atlas Typesystem ............................ SUCCESS [ 27.236 s]
[INFO] Apache Atlas Client ................................ SUCCESS [  0.153 s]
[INFO] atlas-client-common ................................ SUCCESS [  0.730 s]
[INFO] atlas-client-v1 .................................... SUCCESS [  0.890 s]
[INFO] Apache Atlas Server API ............................ SUCCESS [  0.835 s]
[INFO] Apache Atlas Notification .......................... SUCCESS [  1.303 s]
[INFO] atlas-client-v2 .................................... SUCCESS [  0.505 s]
[INFO] Apache Atlas Graph Database Projects ............... SUCCESS [  0.087 s]
[INFO] Apache Atlas Graph Database API .................... SUCCESS [  0.476 s]
[INFO] Graph Database Common Code ......................... SUCCESS [  0.616 s]
[INFO] Apache Atlas Titan 1.0.0 GraphDB Impl .............. SUCCESS [ 26.649 s]
[INFO] Shaded version of Apache hbase client .............. SUCCESS [  7.200 s]
[INFO] Apache Atlas Titan 0.5.4 Graph DB Impl ............. SUCCESS [ 22.529 s]
[INFO] Apache Atlas Graph Database Implementation Dependencies SUCCESS [  0.275 s]
[INFO] Shaded version of Apache hbase server .............. SUCCESS [ 20.183 s]
[INFO] Apache Atlas Repository ............................ SUCCESS [ 39.903 s]
[INFO] Apache Atlas Authorization ......................... SUCCESS [  0.663 s]
[INFO] Apache Atlas Business Catalog ...................... SUCCESS [  1.438 s]
[INFO] Apache Atlas UI .................................... SUCCESS [01:03 min]
[INFO] Apache Atlas Web Application ....................... SUCCESS [01:27 min]
[INFO] Apache Atlas Documentation ......................... SUCCESS [  3.767 s]
[INFO] Apache Atlas FileSystem Model ...................... SUCCESS [  1.071 s]
[INFO] Apache Atlas Plugin Classloader .................... SUCCESS [  0.750 s]
[INFO] Apache Atlas Hive Bridge Shim ...................... SUCCESS [  0.886 s]
[INFO] Apache Atlas Hive Bridge ........................... SUCCESS [  3.072 s]
[INFO] Apache Atlas Falcon Bridge Shim .................... SUCCESS [  0.916 s]
[INFO] Apache Atlas Falcon Bridge ......................... SUCCESS [  1.224 s]
[INFO] Apache Atlas Sqoop Bridge Shim ..................... SUCCESS [  0.148 s]
[INFO] Apache Atlas Sqoop Bridge .......................... SUCCESS [  1.819 s]
[INFO] Apache Atlas Storm Bridge Shim ..................... SUCCESS [  0.401 s]
[INFO] Apache Atlas Storm Bridge .......................... SUCCESS [  7.263 s]
[INFO] Apache Atlas Hbase Bridge Shim ..................... SUCCESS [  2.236 s]
[INFO] Apache Atlas Hbase Bridge .......................... FAILURE [ 10.593 s]
[INFO] Apache Atlas Distribution .......................... SKIPPED
[INFO] ------------------------------------------------------------------------
[INFO] BUILD FAILURE
[INFO] ------------------------------------------------------------------------
[INFO] Total time: 05:46 min
[INFO] Finished at: 2017-12-18T05:30:07Z
[INFO] Final Memory: 403M/3130M
[INFO] ------------------------------------------------------------------------
[ERROR] Failed to execute goal org.apache.maven.plugins:maven-dependency-plugin:2.10:copy
(copy-hook) on project hbase-bridge: Unable to find artifact version of com.fasterxml.jackson.core:jackson-databind
in either dependency list or in project's dependency management. -> [Help 1]
[ERROR] 
[ERROR] To see the full stack trace of the errors, re-run Maven with the -e switch.
[ERROR] Re-run Maven using the -X switch to enable full debug logging.
[ERROR] 
[ERROR] For more information about the errors and possible solutions, please read the following
articles:
[ERROR] [Help 1] http://cwiki.apache.org/confluence/display/MAVEN/MojoExecutionException
[ERROR] 
[ERROR] After correcting the problems, you can resume the build with the command
[ERROR]   mvn <goals> -rf :hbase-bridge
Build step 'Execute shell' marked build as failure
[CHECKSTYLE] Collecting checkstyle analysis files...
[CHECKSTYLE] Searching for all files in <https://builds.apache.org/job/Atlas-0.8-NoTests/ws/>
that match the pattern **/target/checkstyle-result.xml
[CHECKSTYLE] No files found. Configuration error?
<Git Blamer> Using GitBlamer to create author and commit information for all warnings.
<Git Blamer> GIT_COMMIT=d6e69c6dd12448d413a51ae251756fd3c4825a7d, workspace=<https://builds.apache.org/job/Atlas-0.8-NoTests/ws/>
[CHECKSTYLE] Computing warning deltas based on reference build #146
[FINDBUGS] Collecting findbugs analysis files...
[FINDBUGS] Searching for all files in <https://builds.apache.org/job/Atlas-0.8-NoTests/ws/>
that match the pattern **/target/findbugs.xml
[FINDBUGS] No files found. Configuration error?
<Git Blamer> Using GitBlamer to create author and commit information for all warnings.
<Git Blamer> GIT_COMMIT=d6e69c6dd12448d413a51ae251756fd3c4825a7d, workspace=<https://builds.apache.org/job/Atlas-0.8-NoTests/ws/>
[FINDBUGS] Computing warning deltas based on reference build #146
Archiving artifacts
[Fast Archiver] Compressed 184.07 MB of artifacts by 61.7% relative to #146
TestNG Reports Processing: START
Looking for TestNG results report in workspace using pattern: **/target/surefire-reports/testng-results.xml,**/target/failsafe-reports/testng-results.xml
Did not find any matching files.

Mime
View raw message