atlas-dev mailing list archives

Site index · List index
Message view « Date » · « Thread »
Top « Date » · « Thread »
From Apache Jenkins Server <jenk...@builds.apache.org>
Subject Build failed in Jenkins: Atlas-0.8-IntegrationTests #154
Date Sun, 24 Dec 2017 17:54:25 GMT
See <https://builds.apache.org/job/Atlas-0.8-IntegrationTests/154/display/redirect?page=changes>

Changes:

[madhan] ATLAS-2318: UI - clicking on child tag twice, parent tag is selected

[madhan] ATLAS-2319: UI - deleting a tag which at 25+ position needs a refresh

------------------------------------------
[...truncated 488.00 KB...]
127.0.0.1 - - [24/Dec/2017:17:47:30 +0000] "POST /api/atlas/entities HTTP/1.1" 201 - "-" "Java/1.8.0_152"
127.0.0.1 - - [24/Dec/2017:17:47:30 +0000] "POST /api/atlas/entities HTTP/1.1" 201 - "-" "Java/1.8.0_152"
127.0.0.1 - - [24/Dec/2017:17:47:30 +0000] "GET /api/atlas/v2/types/typedef/name/PII_TraitPN7QdY1Xri
HTTP/1.1" 404 - "-" "Java/1.8.0_152"
127.0.0.1 - - [24/Dec/2017:17:47:30 +0000] "POST /api/atlas/types HTTP/1.1" 201 - "-" "Java/1.8.0_152"
127.0.0.1 - - [24/Dec/2017:17:47:30 +0000] "DELETE /api/atlas/entities/3cc872f3-bf1f-4e17-8ca5-50fda9261285/traits/PII_TraitPN7QdY1Xri
HTTP/1.1" 404 - "-" "Java/1.8.0_152"
127.0.0.1 - - [24/Dec/2017:17:47:30 +0000] "POST /api/atlas/entities HTTP/1.1" 201 - "-" "Java/1.8.0_152"
127.0.0.1 - - [24/Dec/2017:17:47:30 +0000] "POST /api/atlas/entities HTTP/1.1" 201 - "-" "Java/1.8.0_152"
127.0.0.1 - - [24/Dec/2017:17:47:30 +0000] "GET /api/atlas/v2/types/typedef/name/PII_TraitcbnDClHyWu
HTTP/1.1" 404 - "-" "Java/1.8.0_152"
127.0.0.1 - - [24/Dec/2017:17:47:30 +0000] "POST /api/atlas/types HTTP/1.1" 201 - "-" "Java/1.8.0_152"
127.0.0.1 - - [24/Dec/2017:17:47:30 +0000] "POST /api/atlas/entities/43b24dae-03f2-4ed9-8731-387b778b3440/traits
HTTP/1.1" 201 - "-" "Java/1.8.0_152"
127.0.0.1 - - [24/Dec/2017:17:47:30 +0000] "GET /api/atlas/entities/43b24dae-03f2-4ed9-8731-387b778b3440/audit?count=100
HTTP/1.1" 200 - "-" "Java/1.8.0_152"
127.0.0.1 - - [24/Dec/2017:17:47:30 +0000] "GET /api/atlas/entities?type=blah HTTP/1.1" 400
- "-" "Java/1.8.0_152"
127.0.0.1 - - [24/Dec/2017:17:47:30 +0000] "POST /api/atlas/entities HTTP/1.1" 201 - "-" "Java/1.8.0_152"
127.0.0.1 - - [24/Dec/2017:17:47:30 +0000] "POST /api/atlas/entities HTTP/1.1" 201 - "-" "Java/1.8.0_152"
127.0.0.1 - - [24/Dec/2017:17:47:30 +0000] "DELETE /api/atlas/entities/f8c2d05a-808c-4a8f-800a-8dc0f1e80953/traits/blah_trait
HTTP/1.1" 404 - "-" "Java/1.8.0_152"
127.0.0.1 - - [24/Dec/2017:17:47:30 +0000] "POST /api/atlas/entities HTTP/1.1" 201 - "-" "Java/1.8.0_152"
127.0.0.1 - - [24/Dec/2017:17:47:30 +0000] "DELETE /api/atlas/entities?type=hive_db&property=qualifiedName&value=ZqJZuLqvVi
HTTP/1.1" 200 - "-" "Java/1.8.0_152"
127.0.0.1 - - [24/Dec/2017:17:47:30 +0000] "GET /api/atlas/entities/d28b14c1-0c5e-4738-b6ef-683cc69bcf4b
HTTP/1.1" 200 - "-" "Java/1.8.0_152"
127.0.0.1 - - [24/Dec/2017:17:47:30 +0000] "POST /api/atlas/entities HTTP/1.1" 201 - "-" "Java/1.8.0_152"
127.0.0.1 - - [24/Dec/2017:17:47:30 +0000] "POST /api/atlas/entities HTTP/1.1" 201 - "-" "Java/1.8.0_152"
127.0.0.1 - - [24/Dec/2017:17:47:30 +0000] "GET /api/atlas/v2/types/typedef/name/PII_TraithiPrK5Lzbg
HTTP/1.1" 404 - "-" "Java/1.8.0_152"
127.0.0.1 - - [24/Dec/2017:17:47:30 +0000] "POST /api/atlas/types HTTP/1.1" 201 - "-" "Java/1.8.0_152"
127.0.0.1 - - [24/Dec/2017:17:47:30 +0000] "POST /api/atlas/entities/b6850f7d-9be1-4fa8-b98c-0ddcba9793a1/traits
HTTP/1.1" 201 - "-" "Java/1.8.0_152"
127.0.0.1 - - [24/Dec/2017:17:47:30 +0000] "GET /api/atlas/entities/b6850f7d-9be1-4fa8-b98c-0ddcba9793a1
HTTP/1.1" 200 - "-" "Java/1.8.0_152"
127.0.0.1 - - [24/Dec/2017:17:47:30 +0000] "POST /api/atlas/entities HTTP/1.1" 201 - "-" "Java/1.8.0_152"
127.0.0.1 - - [24/Dec/2017:17:47:30 +0000] "POST /api/atlas/entities HTTP/1.1" 201 - "-" "Java/1.8.0_152"
127.0.0.1 - - [24/Dec/2017:17:47:30 +0000] "PUT /api/atlas/entities HTTP/1.1" 200 - "-" "Java/1.8.0_152"
127.0.0.1 - - [24/Dec/2017:17:47:31 +0000] "GET /api/atlas/entities/d0298ce8-7923-46fd-a29e-8de4a4c1db9c
HTTP/1.1" 200 - "-" "Java/1.8.0_152"
127.0.0.1 - - [24/Dec/2017:17:47:31 +0000] "GET /api/atlas/v2/types/typedef/name/testiNpV7WFpCH
HTTP/1.1" 404 - "-" "Java/1.8.0_152"
127.0.0.1 - - [24/Dec/2017:17:47:31 +0000] "POST /api/atlas/types HTTP/1.1" 201 - "-" "Java/1.8.0_152"
127.0.0.1 - - [24/Dec/2017:17:47:31 +0000] "GET /api/atlas/entities?type=testiNpV7WFpCH HTTP/1.1"
200 - "-" "Java/1.8.0_152"
127.0.0.1 - - [24/Dec/2017:17:47:31 +0000] "POST /api/atlas/entities HTTP/1.1" 201 - "-" "Java/1.8.0_152"
127.0.0.1 - - [24/Dec/2017:17:47:31 +0000] "POST /api/atlas/entities HTTP/1.1" 201 - "-" "Java/1.8.0_152"
127.0.0.1 - - [24/Dec/2017:17:47:31 +0000] "GET /api/atlas/entities/54ca92e7-d0fe-44a3-a84d-31c5b0f297e5
HTTP/1.1" 200 - "-" "Java/1.8.0_152"
127.0.0.1 - - [24/Dec/2017:17:47:31 +0000] "POST /api/atlas/entities HTTP/1.1" 201 - "-" "Java/1.8.0_152"
127.0.0.1 - - [24/Dec/2017:17:47:31 +0000] "POST /api/atlas/entities HTTP/1.1" 201 - "-" "Java/1.8.0_152"
127.0.0.1 - - [24/Dec/2017:17:47:31 +0000] "POST /api/atlas/entities/95e8e159-a509-403f-9fbb-b8b5b83af0a0?property=description
HTTP/1.1" 200 - "-" "Java/1.8.0_152"
127.0.0.1 - - [24/Dec/2017:17:47:31 +0000] "GET /api/atlas/entities/95e8e159-a509-403f-9fbb-b8b5b83af0a0
HTTP/1.1" 200 - "-" "Java/1.8.0_152"
127.0.0.1 - - [24/Dec/2017:17:47:31 +0000] "POST /api/atlas/entities/95e8e159-a509-403f-9fbb-b8b5b83af0a0?property=invalid_property
HTTP/1.1" 400 - "-" "Java/1.8.0_152"
127.0.0.1 - - [24/Dec/2017:17:47:31 +0000] "GET /api/atlas/entities/95e8e159-a509-403f-9fbb-b8b5b83af0a0
HTTP/1.1" 200 - "-" "Java/1.8.0_152"
127.0.0.1 - - [24/Dec/2017:17:47:31 +0000] "GET /api/atlas/v2/search/fulltext?offset=0&query=dbnlDIB0GVHw&limit=10
HTTP/1.1" 200 - "-" "Java/1.8.0_152"
127.0.0.1 - - [24/Dec/2017:17:47:31 +0000] "GET /api/atlas/v2/search/fulltext?query=dbnlDIB0GVHw
HTTP/1.1" 200 - "-" "Java/1.8.0_152"
127.0.0.1 - - [24/Dec/2017:17:47:31 +0000] "GET /api/atlas/v2/search/fulltext?offset=0&query=dbnlDIB0GVHw&limit=10
HTTP/1.1" 200 - "-" "Java/1.8.0_152"
127.0.0.1 - - [24/Dec/2017:17:47:31 +0000] "GET /api/atlas/v2/search/fulltext?offset=1&query=dbnlDIB0GVHw&limit=10
HTTP/1.1" 200 - "-" "Java/1.8.0_152"
127.0.0.1 - - [24/Dec/2017:17:47:31 +0000] "GET /api/atlas/v2/search/fulltext?offset=0&query=dbnlDIB0GVHw&limit=1
HTTP/1.1" 200 - "-" "Java/1.8.0_152"
127.0.0.1 - - [24/Dec/2017:17:47:31 +0000] "GET /api/atlas/v2/search/fulltext?offset=2&query=dbnlDIB0GVHw&limit=1
HTTP/1.1" 200 - "-" "Java/1.8.0_152"
127.0.0.1 - - [24/Dec/2017:17:47:31 +0000] "POST /api/atlas/admin/import HTTP/1.1" 200 - "-"
"Java/1.8.0_152"
127.0.0.1 - - [24/Dec/2017:17:47:33 +0000] "GET /api/atlas/v2/types/typedef/name/fooTag HTTP/1.1"
404 - "-" "Java/1.8.0_152"
127.0.0.1 - - [24/Dec/2017:17:47:33 +0000] "POST /api/atlas/v2/types/typedefs HTTP/1.1" 200
- "-" "Java/1.8.0_152"
127.0.0.1 - - [24/Dec/2017:17:47:34 +0000] "GET /api/atlas/v2/entity/uniqueAttribute/type/hdfs_path?attr:qualifiedName=test%241test%2B%2B-%2B%26%26%2B%7C%7C%2B%21%2B%28%2B%29%2B%7B%2B%7D%2B%5B%2B%5D%2B%5E%2B%3C%2B%3E%2B%3B%2B%3A%2B%22%2B%25%2B*%2B%60%2B%7E
HTTP/1.1" 404 - "-" "Java/1.8.0_152"
127.0.0.1 - - [24/Dec/2017:17:47:34 +0000] "POST /api/atlas/v2/entity HTTP/1.1" 200 - "-"
"Java/1.8.0_152"
127.0.0.1 - - [24/Dec/2017:17:47:39 +0000] "POST /api/atlas/v2/search/basic HTTP/1.1" 200
- "-" "Java/1.8.0_152"
127.0.0.1 - - [24/Dec/2017:17:47:39 +0000] "POST /api/atlas/v2/search/basic HTTP/1.1" 200
- "-" "Java/1.8.0_152"
127.0.0.1 - - [24/Dec/2017:17:47:39 +0000] "POST /api/atlas/v2/search/basic HTTP/1.1" 200
- "-" "Java/1.8.0_152"
127.0.0.1 - - [24/Dec/2017:17:47:39 +0000] "POST /api/atlas/v2/search/basic HTTP/1.1" 200
- "-" "Java/1.8.0_152"
127.0.0.1 - - [24/Dec/2017:17:47:39 +0000] "POST /api/atlas/v2/search/basic HTTP/1.1" 200
- "-" "Java/1.8.0_152"
127.0.0.1 - - [24/Dec/2017:17:47:39 +0000] "POST /api/atlas/v2/search/basic HTTP/1.1" 200
- "-" "Java/1.8.0_152"
127.0.0.1 - - [24/Dec/2017:17:47:39 +0000] "POST /api/atlas/v2/search/basic HTTP/1.1" 200
- "-" "Java/1.8.0_152"
127.0.0.1 - - [24/Dec/2017:17:47:39 +0000] "POST /api/atlas/v2/search/basic HTTP/1.1" 200
- "-" "Java/1.8.0_152"
127.0.0.1 - - [24/Dec/2017:17:47:39 +0000] "POST /api/atlas/v2/search/basic HTTP/1.1" 200
- "-" "Java/1.8.0_152"
127.0.0.1 - - [24/Dec/2017:17:47:39 +0000] "POST /api/atlas/v2/search/basic HTTP/1.1" 200
- "-" "Java/1.8.0_152"
127.0.0.1 - - [24/Dec/2017:17:47:39 +0000] "POST /api/atlas/v2/search/basic HTTP/1.1" 200
- "-" "Java/1.8.0_152"
Tests run: 144, Failures: 3, Errors: 0, Skipped: 40, Time elapsed: 56.404 sec <<<
FAILURE! - in TestSuite
setUp(org.apache.atlas.notification.NotificationHookConsumerIT)  Time elapsed: 0.33 sec  <<<
FAILURE!
org.apache.atlas.AtlasException: Failed to start embedded kafka
	at sun.nio.ch.Net.bind0(Native Method)
	at sun.nio.ch.Net.bind(Net.java:433)
	at sun.nio.ch.Net.bind(Net.java:425)
	at sun.nio.ch.ServerSocketChannelImpl.bind(ServerSocketChannelImpl.java:223)
	at sun.nio.ch.ServerSocketAdaptor.bind(ServerSocketAdaptor.java:74)
	at sun.nio.ch.ServerSocketAdaptor.bind(ServerSocketAdaptor.java:67)
	at org.apache.zookeeper.server.NIOServerCnxnFactory.configure(NIOServerCnxnFactory.java:95)
	at org.apache.zookeeper.server.ServerCnxnFactory.createFactory(ServerCnxnFactory.java:126)
	at org.apache.atlas.kafka.EmbeddedKafkaServer.startZk(EmbeddedKafkaServer.java:113)
	at org.apache.atlas.kafka.EmbeddedKafkaServer.start(EmbeddedKafkaServer.java:77)
	at org.apache.atlas.web.integration.BaseResourceIT.initNotificationService(BaseResourceIT.java:699)
	at org.apache.atlas.notification.NotificationHookConsumerIT.setUp(NotificationHookConsumerIT.java:53)

testSubmit(org.apache.atlas.web.integration.TypesJerseyResourceIT)  Time elapsed: 0.154 sec
 <<< FAILURE!
org.apache.atlas.AtlasServiceException: Metadata service API org.apache.atlas.AtlasClient$API_V1@1ec28fe3
failed with status 400 (Bad Request) Response Body ({"error":"table.database: invalid inverseRef
constraint. Inverse attribute database.database does not exist"})
	at org.apache.atlas.AtlasBaseClient.callAPIWithResource(AtlasBaseClient.java:387)
	at org.apache.atlas.AtlasBaseClient.callAPIWithResource(AtlasBaseClient.java:320)
	at org.apache.atlas.AtlasBaseClient.callAPI(AtlasBaseClient.java:208)
	at org.apache.atlas.AtlasClient.callAPIWithBody(AtlasClient.java:942)
	at org.apache.atlas.web.integration.TypesJerseyResourceIT.testSubmit(TypesJerseyResourceIT.java:84)

testDiscoveryWithSearchParameters(org.apache.atlas.web.integration.BasicSearchIT)  Time elapsed:
0.248 sec  <<< FAILURE!
java.lang.AssertionError: expected [3] but found [21]
	at org.testng.Assert.fail(Assert.java:94)
	at org.testng.Assert.failNotEquals(Assert.java:496)
	at org.testng.Assert.assertEquals(Assert.java:125)
	at org.testng.Assert.assertEquals(Assert.java:372)
	at org.testng.Assert.assertEquals(Assert.java:382)
	at org.apache.atlas.web.integration.BasicSearchIT.testDiscoveryWithSearchParameters(BasicSearchIT.java:127)


Results :

Failed tests: 
  NotificationHookConsumerIT.setUp:53->BaseResourceIT.initNotificationService:699 »
Atlas
org.apache.atlas.web.integration.BasicSearchIT.testDiscoveryWithSearchParameters(org.apache.atlas.web.integration.BasicSearchIT)
  Run 1: BasicSearchIT.testDiscoveryWithSearchParameters:127 expected [3] but found [21]
  Run 2: PASS
  Run 3: PASS

  TypesJerseyResourceIT.testSubmit:84 » AtlasService Metadata service API org.ap...

Tests run: 142, Failures: 3, Errors: 0, Skipped: 40

[INFO] 
[INFO] --- jetty-maven-plugin:9.2.12.v20150709:stop (stop-jetty) @ atlas-webapp ---
[INFO] Waiting 10 seconds for jetty to stop
[INFO] Stopped ServerConnector@55c2b515{HTTP/1.1}{0.0.0.0:31000}
[INFO] Closing Spring root WebApplicationContext
[INFO] Shutting down log4j
[INFO] Not cleaning cached beans: no such field javax.el.BeanELResolver.properties
[INFO] Stopped o.e.j.m.p.JettyWebAppContext@3a4a7259{/,<https://builds.apache.org/job/Atlas-0.8-IntegrationTests/ws/webapp/target/atlas-webapp-0.8.2-SNAPSHOT/,UNAVAILABLE}{/home/jenkins/jenkins-slave/workspace/Atlas-0.8-IntegrationTests/webapp/target/atlas-webapp-0.8.2-SNAPSHOT.war}>
[INFO] Server reports itself as stopped
[INFO] 
[INFO] --- maven-source-plugin:2.4:jar-no-fork (attach-sources) @ atlas-webapp ---
[INFO] Building jar: <https://builds.apache.org/job/Atlas-0.8-IntegrationTests/ws/webapp/target/atlas-webapp-0.8.2-SNAPSHOT-sources.jar>
log4j:WARN No appenders could be found for logger (org.apache.zookeeper.ClientCnxn).
log4j:WARN Please initialize the log4j system properly.
log4j:WARN See http://logging.apache.org/log4j/1.2/faq.html#noconfig for more info.
[INFO] 
[INFO] --- maven-source-plugin:2.4:test-jar-no-fork (attach-sources) @ atlas-webapp ---
[INFO] Building jar: <https://builds.apache.org/job/Atlas-0.8-IntegrationTests/ws/webapp/target/atlas-webapp-0.8.2-SNAPSHOT-test-sources.jar>
[INFO] 
[INFO] --- maven-failsafe-plugin:2.18.1:verify (verify) @ atlas-webapp ---
[INFO] Failsafe report directory: <https://builds.apache.org/job/Atlas-0.8-IntegrationTests/ws/webapp/target/failsafe-reports>
[INFO] ------------------------------------------------------------------------
[INFO] Reactor Summary:
[INFO] 
[INFO] Apache Atlas Server Build Tools .................... SUCCESS [  0.575 s]
[INFO] apache-atlas ....................................... SUCCESS [  4.397 s]
[INFO] Apache Atlas Integration ........................... SUCCESS [ 19.929 s]
[INFO] Apache Atlas Common ................................ SUCCESS [  8.232 s]
[INFO] Apache Atlas Typesystem ............................ SUCCESS [ 44.849 s]
[INFO] Apache Atlas Client ................................ SUCCESS [  0.563 s]
[INFO] atlas-client-common ................................ SUCCESS [  6.856 s]
[INFO] atlas-client-v1 .................................... SUCCESS [  6.901 s]
[INFO] Apache Atlas Server API ............................ SUCCESS [  5.956 s]
[INFO] Apache Atlas Notification .......................... SUCCESS [  9.666 s]
[INFO] atlas-client-v2 .................................... SUCCESS [  5.787 s]
[INFO] Apache Atlas Graph Database Projects ............... SUCCESS [  0.447 s]
[INFO] Apache Atlas Graph Database API .................... SUCCESS [  4.661 s]
[INFO] Graph Database Common Code ......................... SUCCESS [  4.557 s]
[INFO] Apache Atlas Titan 1.0.0 GraphDB Impl .............. SUCCESS [ 34.253 s]
[INFO] Shaded version of Apache hbase client .............. SUCCESS [  7.488 s]
[INFO] Apache Atlas Titan 0.5.4 Graph DB Impl ............. SUCCESS [ 33.307 s]
[INFO] Apache Atlas Graph Database Implementation Dependencies SUCCESS [  0.596 s]
[INFO] Shaded version of Apache hbase server .............. SUCCESS [ 20.120 s]
[INFO] Apache Atlas Repository ............................ SUCCESS [01:11 min]
[INFO] Apache Atlas Authorization ......................... SUCCESS [  5.682 s]
[INFO] Apache Atlas Business Catalog ...................... SUCCESS [  9.078 s]
[INFO] Apache Atlas UI .................................... SUCCESS [01:04 min]
[INFO] Apache Atlas Web Application ....................... FAILURE [02:11 min]
[INFO] Apache Atlas Documentation ......................... SKIPPED
[INFO] Apache Atlas FileSystem Model ...................... SKIPPED
[INFO] Apache Atlas Plugin Classloader .................... SKIPPED
[INFO] Apache Atlas Hive Bridge Shim ...................... SKIPPED
[INFO] Apache Atlas Hive Bridge ........................... SKIPPED
[INFO] Apache Atlas Falcon Bridge Shim .................... SKIPPED
[INFO] Apache Atlas Falcon Bridge ......................... SKIPPED
[INFO] Apache Atlas Sqoop Bridge Shim ..................... SKIPPED
[INFO] Apache Atlas Sqoop Bridge .......................... SKIPPED
[INFO] Apache Atlas Storm Bridge Shim ..................... SKIPPED
[INFO] Apache Atlas Storm Bridge .......................... SKIPPED
[INFO] Apache Atlas Hbase Bridge Shim ..................... SKIPPED
[INFO] Apache Atlas Hbase Bridge .......................... SKIPPED
[INFO] Apache Atlas Distribution .......................... SKIPPED
[INFO] ------------------------------------------------------------------------
[INFO] BUILD FAILURE
[INFO] ------------------------------------------------------------------------
[INFO] Total time: 08:23 min
[INFO] Finished at: 2017-12-24T17:47:43Z
[INFO] Final Memory: 362M/3519M
[INFO] ------------------------------------------------------------------------
[ERROR] Failed to execute goal org.apache.maven.plugins:maven-failsafe-plugin:2.18.1:verify
(verify) on project atlas-webapp: There are test failures.
[ERROR] 
[ERROR] Please refer to <https://builds.apache.org/job/Atlas-0.8-IntegrationTests/ws/webapp/target/failsafe-reports>
for the individual test results.
[ERROR] -> [Help 1]
[ERROR] 
[ERROR] To see the full stack trace of the errors, re-run Maven with the -e switch.
[ERROR] Re-run Maven using the -X switch to enable full debug logging.
[ERROR] 
[ERROR] For more information about the errors and possible solutions, please read the following
articles:
[ERROR] [Help 1] http://cwiki.apache.org/confluence/display/MAVEN/MojoFailureException
[ERROR] 
[ERROR] After correcting the problems, you can resume the build with the command
[ERROR]   mvn <goals> -rf :atlas-webapp
Build step 'Execute shell' marked build as failure
[CHECKSTYLE] Collecting checkstyle analysis files...
[CHECKSTYLE] Searching for all files in <https://builds.apache.org/job/Atlas-0.8-IntegrationTests/ws/>
that match the pattern **/target/checkstyle-result.xml
[CHECKSTYLE] Parsing 22 files in <https://builds.apache.org/job/Atlas-0.8-IntegrationTests/ws/>
[CHECKSTYLE] Successfully parsed file <https://builds.apache.org/job/Atlas-0.8-IntegrationTests/ws/authorization/target/checkstyle-result.xml>
with 467 unique warnings and 0 duplicates.
[CHECKSTYLE] Successfully parsed file <https://builds.apache.org/job/Atlas-0.8-IntegrationTests/ws/catalog/target/checkstyle-result.xml>
with 2604 unique warnings and 0 duplicates.
[CHECKSTYLE] Successfully parsed file <https://builds.apache.org/job/Atlas-0.8-IntegrationTests/ws/client/client-v1/target/checkstyle-result.xml>
with 3480 unique warnings and 0 duplicates.
[CHECKSTYLE] Successfully parsed file <https://builds.apache.org/job/Atlas-0.8-IntegrationTests/ws/client/client-v2/target/checkstyle-result.xml>
with 3805 unique warnings and 0 duplicates.
[CHECKSTYLE] Successfully parsed file <https://builds.apache.org/job/Atlas-0.8-IntegrationTests/ws/client/common/target/checkstyle-result.xml>
with 4295 unique warnings and 0 duplicates.
[CHECKSTYLE] Successfully parsed file <https://builds.apache.org/job/Atlas-0.8-IntegrationTests/ws/client/target/checkstyle-result.xml>
with 4295 unique warnings and 0 duplicates.
[CHECKSTYLE] Successfully parsed file <https://builds.apache.org/job/Atlas-0.8-IntegrationTests/ws/common/target/checkstyle-result.xml>
with 5254 unique warnings and 0 duplicates.
[CHECKSTYLE] Successfully parsed file <https://builds.apache.org/job/Atlas-0.8-IntegrationTests/ws/dashboardv2/target/checkstyle-result.xml>
with 5254 unique warnings and 0 duplicates.
[CHECKSTYLE] Successfully parsed file <https://builds.apache.org/job/Atlas-0.8-IntegrationTests/ws/graphdb/api/target/checkstyle-result.xml>
with 5527 unique warnings and 0 duplicates.
[CHECKSTYLE] Successfully parsed file <https://builds.apache.org/job/Atlas-0.8-IntegrationTests/ws/graphdb/common/target/checkstyle-result.xml>
with 5714 unique warnings and 0 duplicates.
[CHECKSTYLE] Successfully parsed file <https://builds.apache.org/job/Atlas-0.8-IntegrationTests/ws/graphdb/graphdb-impls/target/checkstyle-result.xml>
with 5714 unique warnings and 0 duplicates.
[CHECKSTYLE] Successfully parsed file <https://builds.apache.org/job/Atlas-0.8-IntegrationTests/ws/graphdb/target/checkstyle-result.xml>
with 5714 unique warnings and 0 duplicates.
[CHECKSTYLE] Successfully parsed file <https://builds.apache.org/job/Atlas-0.8-IntegrationTests/ws/graphdb/titan0/target/checkstyle-result.xml>
with 8169 unique warnings and 0 duplicates.
[CHECKSTYLE] Successfully parsed file <https://builds.apache.org/job/Atlas-0.8-IntegrationTests/ws/graphdb/titan1/target/checkstyle-result.xml>
with 9136 unique warnings and 0 duplicates.
[CHECKSTYLE] Successfully parsed file <https://builds.apache.org/job/Atlas-0.8-IntegrationTests/ws/intg/target/checkstyle-result.xml>
with 15967 unique warnings and 0 duplicates.
[CHECKSTYLE] Successfully parsed file <https://builds.apache.org/job/Atlas-0.8-IntegrationTests/ws/notification/target/checkstyle-result.xml>
with 17556 unique warnings and 0 duplicates.
[CHECKSTYLE] Successfully parsed file <https://builds.apache.org/job/Atlas-0.8-IntegrationTests/ws/repository/target/checkstyle-result.xml>
with 36528 unique warnings and 0 duplicates.
[CHECKSTYLE] Successfully parsed file <https://builds.apache.org/job/Atlas-0.8-IntegrationTests/ws/server-api/target/checkstyle-result.xml>
with 36921 unique warnings and 0 duplicates.
[CHECKSTYLE] Successfully parsed file <https://builds.apache.org/job/Atlas-0.8-IntegrationTests/ws/shaded/hbase-client-shaded/target/checkstyle-result.xml>
with 36921 unique warnings and 0 duplicates.
[CHECKSTYLE] Successfully parsed file <https://builds.apache.org/job/Atlas-0.8-IntegrationTests/ws/shaded/hbase-server-shaded/target/checkstyle-result.xml>
with 36921 unique warnings and 0 duplicates.
[CHECKSTYLE] Successfully parsed file <https://builds.apache.org/job/Atlas-0.8-IntegrationTests/ws/target/checkstyle-result.xml>
with 36921 unique warnings and 0 duplicates.
[CHECKSTYLE] Successfully parsed file <https://builds.apache.org/job/Atlas-0.8-IntegrationTests/ws/typesystem/target/checkstyle-result.xml>
with 41139 unique warnings and 0 duplicates.
<Git Blamer> Using GitBlamer to create author and commit information for all warnings.
<Git Blamer> GIT_COMMIT=0de5783ab0e14a9bb76d3294c6e65a151730aca1, workspace=<https://builds.apache.org/job/Atlas-0.8-IntegrationTests/ws/>
 > git rev-parse 0de5783ab0e14a9bb76d3294c6e65a151730aca1^{commit} # timeout=10
<Git Blamer> Skipping file <https://builds.apache.org/job/Atlas-0.8-IntegrationTests/ws/typesystem/src/main/java/org/apache/atlas/typesystem/IStruct.java,>
no result found.
[FINDBUGS] Collecting findbugs analysis files...
[FINDBUGS] Searching for all files in <https://builds.apache.org/job/Atlas-0.8-IntegrationTests/ws/>
that match the pattern **/target/findbugs.xml
[FINDBUGS] Parsing 15 files in <https://builds.apache.org/job/Atlas-0.8-IntegrationTests/ws/>
[FINDBUGS] Successfully parsed file <https://builds.apache.org/job/Atlas-0.8-IntegrationTests/ws/authorization/target/findbugs.xml>
with 0 unique warnings and 0 duplicates.
[FINDBUGS] Successfully parsed file <https://builds.apache.org/job/Atlas-0.8-IntegrationTests/ws/catalog/target/findbugs.xml>
with 0 unique warnings and 0 duplicates.
[FINDBUGS] Successfully parsed file <https://builds.apache.org/job/Atlas-0.8-IntegrationTests/ws/client/client-v1/target/findbugs.xml>
with 0 unique warnings and 0 duplicates.
[FINDBUGS] Successfully parsed file <https://builds.apache.org/job/Atlas-0.8-IntegrationTests/ws/client/client-v2/target/findbugs.xml>
with 0 unique warnings and 0 duplicates.
[FINDBUGS] Successfully parsed file <https://builds.apache.org/job/Atlas-0.8-IntegrationTests/ws/client/common/target/findbugs.xml>
with 0 unique warnings and 0 duplicates.
[FINDBUGS] Successfully parsed file <https://builds.apache.org/job/Atlas-0.8-IntegrationTests/ws/common/target/findbugs.xml>
with 0 unique warnings and 0 duplicates.
[FINDBUGS] Successfully parsed file <https://builds.apache.org/job/Atlas-0.8-IntegrationTests/ws/graphdb/api/target/findbugs.xml>
with 0 unique warnings and 0 duplicates.
[FINDBUGS] Successfully parsed file <https://builds.apache.org/job/Atlas-0.8-IntegrationTests/ws/graphdb/common/target/findbugs.xml>
with 0 unique warnings and 0 duplicates.
[FINDBUGS] Successfully parsed file <https://builds.apache.org/job/Atlas-0.8-IntegrationTests/ws/graphdb/titan0/target/findbugs.xml>
with 0 unique warnings and 0 duplicates.
[FINDBUGS] Successfully parsed file <https://builds.apache.org/job/Atlas-0.8-IntegrationTests/ws/graphdb/titan1/target/findbugs.xml>
with 0 unique warnings and 0 duplicates.
[FINDBUGS] Successfully parsed file <https://builds.apache.org/job/Atlas-0.8-IntegrationTests/ws/intg/target/findbugs.xml>
with 0 unique warnings and 0 duplicates.
[FINDBUGS] Successfully parsed file <https://builds.apache.org/job/Atlas-0.8-IntegrationTests/ws/notification/target/findbugs.xml>
with 0 unique warnings and 0 duplicates.
[FINDBUGS] Successfully parsed file <https://builds.apache.org/job/Atlas-0.8-IntegrationTests/ws/repository/target/findbugs.xml>
with 0 unique warnings and 0 duplicates.
[FINDBUGS] Successfully parsed file <https://builds.apache.org/job/Atlas-0.8-IntegrationTests/ws/server-api/target/findbugs.xml>
with 0 unique warnings and 0 duplicates.
[FINDBUGS] Successfully parsed file <https://builds.apache.org/job/Atlas-0.8-IntegrationTests/ws/typesystem/target/findbugs.xml>
with 0 unique warnings and 0 duplicates.
<Git Blamer> Using GitBlamer to create author and commit information for all warnings.
<Git Blamer> GIT_COMMIT=0de5783ab0e14a9bb76d3294c6e65a151730aca1, workspace=<https://builds.apache.org/job/Atlas-0.8-IntegrationTests/ws/>
Archiving artifacts
[Fast Archiver] No prior successful build to compare, so performing full copy of artifacts
TestNG Reports Processing: START
Looking for TestNG results report in workspace using pattern: **/target/surefire-reports/testng-results.xml,**/target/failsafe-reports/testng-results.xml
Saving reports...
Processing '/x1/jenkins/jenkins-home/jobs/Atlas-0.8-IntegrationTests/builds/154/testng/testng-results.xml'
1.470588% of tests failed, which exceeded threshold of 0%. Marking build as UNSTABLE
TestNG Reports Processing: FINISH

Mime
View raw message