atlas-dev mailing list archives

Site index · List index
Message view « Date » · « Thread »
Top « Date » · « Thread »
From Apache Jenkins Server <jenk...@builds.apache.org>
Subject Build failed in Jenkins: Atlas-0.8-UnitTests #137
Date Tue, 28 Nov 2017 15:37:04 GMT
See <https://builds.apache.org/job/Atlas-0.8-UnitTests/137/display/redirect?page=changes>

Changes:

[madhan] ATLAS-2284: added jersey-multipart jar to Hive hook packaging

------------------------------------------
[...truncated 123.41 KB...]
[INFO] Including commons-io:commons-io:jar:2.4 in the shaded jar.
[INFO] Including commons-lang:commons-lang:jar:2.6 in the shaded jar.
[INFO] Including commons-logging:commons-logging:jar:1.2 in the shaded jar.
[INFO] Including com.google.guava:guava:jar:12.0.1 in the shaded jar.
[INFO] Including com.google.code.findbugs:jsr305:jar:1.3.9 in the shaded jar.
[INFO] Including com.google.protobuf:protobuf-java:jar:2.5.0 in the shaded jar.
[INFO] Including io.netty:netty-all:jar:4.0.23.Final in the shaded jar.
[INFO] Including org.apache.zookeeper:zookeeper:jar:3.4.6 in the shaded jar.
[INFO] Including org.apache.htrace:htrace-core:jar:3.1.0-incubating in the shaded jar.
[INFO] Including org.codehaus.jackson:jackson-mapper-asl:jar:1.9.13 in the shaded jar.
[INFO] Including org.codehaus.jackson:jackson-core-asl:jar:1.9.13 in the shaded jar.
[INFO] Including org.jruby.jcodings:jcodings:jar:1.0.8 in the shaded jar.
[INFO] Including org.jruby.joni:joni:jar:2.1.2 in the shaded jar.
[INFO] Including com.github.stephenc.findbugs:findbugs-annotations:jar:1.3.9-1 in the shaded
jar.
[INFO] Excluding org.slf4j:slf4j-api:jar:1.7.21 from the shaded jar.
[INFO] Excluding org.slf4j:slf4j-log4j12:jar:1.7.21 from the shaded jar.
[INFO] Including log4j:log4j:jar:1.2.17 in the shaded jar.
[INFO] Excluding org.slf4j:jul-to-slf4j:jar:1.7.21 from the shaded jar.
[INFO] Including cglib:cglib:jar:2.2.2 in the shaded jar.
[INFO] Including asm:asm:jar:3.3.1 in the shaded jar.
[INFO] Replacing original artifact with shaded artifact.
[INFO] Replacing <https://builds.apache.org/job/Atlas-0.8-UnitTests/ws/shaded/hbase-client-shaded/target/atlas-hbase-client-shaded-0.8.2-SNAPSHOT.jar>
with <https://builds.apache.org/job/Atlas-0.8-UnitTests/ws/shaded/hbase-client-shaded/target/atlas-hbase-client-shaded-0.8.2-SNAPSHOT-shaded.jar>
[INFO] Dependency-reduced POM written at: <https://builds.apache.org/job/Atlas-0.8-UnitTests/ws/shaded/hbase-client-shaded/dependency-reduced-pom.xml>
[INFO] 
[INFO] ------------------------------------------------------------------------
[INFO] Building Apache Atlas Titan 0.5.4 Graph DB Impl 0.8.2-SNAPSHOT
[INFO] ------------------------------------------------------------------------
[INFO] 
[INFO] --- maven-clean-plugin:2.5:clean (default-clean) @ atlas-graphdb-titan0 ---
[INFO] Deleting <https://builds.apache.org/job/Atlas-0.8-UnitTests/ws/graphdb/titan0>
(includes = [**/*.pyc], excludes = [])
[INFO] 
[INFO] --- buildnumber-maven-plugin:1.4:create (default) @ atlas-graphdb-titan0 ---
[INFO] Executing: /bin/sh -c cd '<https://builds.apache.org/job/Atlas-0.8-UnitTests/ws/graphdb/titan0'>
&& 'git' 'rev-parse' '--verify' 'HEAD'
[INFO] Working directory: <https://builds.apache.org/job/Atlas-0.8-UnitTests/ws/graphdb/titan0>
[INFO] Storing buildNumber: 7f52e13c4b580a38296096e85aedde1b4c39518e at timestamp: 1511883368811
[WARNING] Cannot get the branch information from the git repository: 
Detecting the current branch failed: fatal: ref HEAD is not a symbolic ref

[INFO] Executing: /bin/sh -c cd '<https://builds.apache.org/job/Atlas-0.8-UnitTests/ws/graphdb/titan0'>
&& 'git' 'rev-parse' '--verify' 'HEAD'
[INFO] Working directory: <https://builds.apache.org/job/Atlas-0.8-UnitTests/ws/graphdb/titan0>
[INFO] Storing buildScmBranch: UNKNOWN
[INFO] 
[INFO] --- apache-rat-plugin:0.7:check (rat-check) @ atlas-graphdb-titan0 ---
[INFO] Exclude: **/dependency-reduced-pom.xml
[INFO] Exclude: **/javax.script.ScriptEngineFactory
[INFO] Exclude: .reviewboardrc
[INFO] Exclude: 3party-licenses/**
[INFO] Exclude: **/.cache
[INFO] Exclude: **/.cache-main
[INFO] Exclude: **/.cache-tests
[INFO] Exclude: **/.checkstyle
[INFO] Exclude: *.txt
[INFO] Exclude: **/*.json
[INFO] Exclude: .pc/**
[INFO] Exclude: debian/**
[INFO] Exclude: .svn/**
[INFO] Exclude: .git/**
[INFO] Exclude: .gitignore
[INFO] Exclude: **/.idea/**
[INFO] Exclude: **/*.twiki
[INFO] Exclude: **/*.iml
[INFO] Exclude: **/*.json
[INFO] Exclude: **/*.log
[INFO] Exclude: **/target/**
[INFO] Exclude: **/target*/**
[INFO] Exclude: **/build/**
[INFO] Exclude: **/*.patch
[INFO] Exclude: derby.log
[INFO] Exclude: **/logs/**
[INFO] Exclude: **/.classpath
[INFO] Exclude: **/.project
[INFO] Exclude: **/.settings/**
[INFO] Exclude: **/test-output/**
[INFO] Exclude: **/mock/**
[INFO] Exclude: **/data/**
[INFO] Exclude: **/maven-eclipse.xml
[INFO] Exclude: **/.externalToolBuilders/**
[INFO] Exclude: **/build.log
[INFO] Exclude: **/.bowerrc
[INFO] Exclude: *.json
[INFO] Exclude: **/overlays/**
[INFO] Exclude: dev-support/**
[INFO] Exclude: **/users-credentials.properties
[INFO] Exclude: **/public/css/animate.min.css
[INFO] Exclude: **/public/css/bootstrap-sidebar.css
[INFO] Exclude: **/public/js/external_lib/**
[INFO] Exclude: **/node_modules/**
[INFO] Exclude: **/public/js/libs/**
[INFO] Exclude: **/atlas.data/**
[INFO] Exclude: **/${sys:atlas.data}/**
[INFO] Exclude: **/policy-store.txt
[INFO] Exclude: **/*rebel*.xml
[INFO] Exclude: **/*rebel*.xml.bak
[INFO] 
[INFO] --- maven-remote-resources-plugin:1.5:process (default) @ atlas-graphdb-titan0 ---
[INFO] 
[INFO] --- maven-resources-plugin:2.7:resources (default-resources) @ atlas-graphdb-titan0
---
[INFO] Using 'UTF-8' encoding to copy filtered resources.
[INFO] skip non existing resourceDirectory <https://builds.apache.org/job/Atlas-0.8-UnitTests/ws/graphdb/titan0/src/main/resources>
[INFO] Copying 0 resource to META-INF
[INFO] Copying 3 resources
[INFO] 
[INFO] --- maven-compiler-plugin:3.1:compile (default-compile) @ atlas-graphdb-titan0 ---
[INFO] Changes detected - recompiling the module!
[INFO] Compiling 37 source files to <https://builds.apache.org/job/Atlas-0.8-UnitTests/ws/graphdb/titan0/target/classes>
[WARNING] <https://builds.apache.org/job/Atlas-0.8-UnitTests/ws/graphdb/titan0/src/main/java/com/thinkaurelius/titan/diskstorage/hbase/HConnection0_98.java>:
Some input files use or override a deprecated API.
[WARNING] <https://builds.apache.org/job/Atlas-0.8-UnitTests/ws/graphdb/titan0/src/main/java/com/thinkaurelius/titan/diskstorage/hbase/HConnection0_98.java>:
Recompile with -Xlint:deprecation for details.
[WARNING] <https://builds.apache.org/job/Atlas-0.8-UnitTests/ws/graphdb/titan0/src/main/java/org/apache/atlas/repository/graphdb/titan0/Titan0Element.java>:
Some input files use unchecked or unsafe operations.
[WARNING] <https://builds.apache.org/job/Atlas-0.8-UnitTests/ws/graphdb/titan0/src/main/java/org/apache/atlas/repository/graphdb/titan0/Titan0Element.java>:
Recompile with -Xlint:unchecked for details.
[INFO] 
[INFO] --- maven-resources-plugin:2.7:testResources (default-testResources) @ atlas-graphdb-titan0
---
[INFO] Using 'UTF-8' encoding to copy filtered resources.
[INFO] Copying 1 resource
[INFO] skip non existing resourceDirectory <https://builds.apache.org/job/Atlas-0.8-UnitTests/ws/graphdb/titan0/typesystem/src/test/resources>
[INFO] Copying 3 resources
[INFO] 
[INFO] --- maven-compiler-plugin:3.1:testCompile (default-testCompile) @ atlas-graphdb-titan0
---
[INFO] Changes detected - recompiling the module!
[INFO] Compiling 6 source files to <https://builds.apache.org/job/Atlas-0.8-UnitTests/ws/graphdb/titan0/target/test-classes>
[WARNING] <https://builds.apache.org/job/Atlas-0.8-UnitTests/ws/graphdb/titan0/src/test/java/org/apache/atlas/repository/graphdb/titan0/AbstractGraphDatabaseTest.java>:
Some input files use unchecked or unsafe operations.
[WARNING] <https://builds.apache.org/job/Atlas-0.8-UnitTests/ws/graphdb/titan0/src/test/java/org/apache/atlas/repository/graphdb/titan0/AbstractGraphDatabaseTest.java>:
Recompile with -Xlint:unchecked for details.
[INFO] 
[INFO] --- maven-surefire-plugin:2.18.1:test (default-test) @ atlas-graphdb-titan0 ---
[INFO] Surefire report directory: <https://builds.apache.org/job/Atlas-0.8-UnitTests/ws/graphdb/titan0/target/surefire-reports>
[INFO] Using configured provider org.apache.maven.surefire.testng.TestNGProvider
[WARNING] file.encoding cannot be set as system property, use <argLine>-Dfile.encoding=...<argLine>
instead

-------------------------------------------------------
 T E S T S
-------------------------------------------------------
Java HotSpot(TM) 64-Bit Server VM warning: ignoring option MaxPermSize=512m; support was removed
in 8.0
Java HotSpot(TM) 64-Bit Server VM warning: ignoring option MaxPermSize=512m; support was removed
in 8.0
Java HotSpot(TM) 64-Bit Server VM warning: ignoring option MaxPermSize=512m; support was removed
in 8.0
Java HotSpot(TM) 64-Bit Server VM warning: ignoring option MaxPermSize=512m; support was removed
in 8.0
Java HotSpot(TM) 64-Bit Server VM warning: ignoring option MaxPermSize=512m; support was removed
in 8.0
Java HotSpot(TM) 64-Bit Server VM warning: ignoring option MaxPermSize=512m; support was removed
in 8.0
Running org.apache.atlas.repository.graphdb.titan0.Titan0DatabaseValidationTest
Running org.apache.atlas.repository.graphdb.titan0.Titan0DatabaseTest
Running org.apache.atlas.repository.graphdb.titan0.GraphQueryTest
Running com.thinkaurelius.titan.diskstorage.locking.LocalLockMediatorTest
Running com.thinkaurelius.titan.diskstorage.hbase.HBaseKeyColumnValueStoreTest
Running org.apache.atlas.repository.graphdb.titan0.AbstractGraphDatabaseTest
Tests run: 0, Failures: 0, Errors: 0, Skipped: 0, Time elapsed: 0.547 sec - in org.apache.atlas.repository.graphdb.titan0.AbstractGraphDatabaseTest
Tests run: 1, Failures: 1, Errors: 0, Skipped: 0, Time elapsed: 1.045 sec <<< FAILURE!
- in com.thinkaurelius.titan.diskstorage.locking.LocalLockMediatorTest
testLock(com.thinkaurelius.titan.diskstorage.locking.LocalLockMediatorTest)  Time elapsed:
0.026 sec  <<< FAILURE!
java.lang.AssertionError: expected [true] but found [false]
	at org.testng.Assert.fail(Assert.java:94)
	at org.testng.Assert.failNotEquals(Assert.java:496)
	at org.testng.Assert.assertTrue(Assert.java:42)
	at org.testng.Assert.assertTrue(Assert.java:52)
	at com.thinkaurelius.titan.diskstorage.locking.LocalLockMediatorTest.testLock(LocalLockMediatorTest.java:46)

Tests run: 3, Failures: 0, Errors: 0, Skipped: 0, Time elapsed: 1.241 sec - in com.thinkaurelius.titan.diskstorage.hbase.HBaseKeyColumnValueStoreTest
Tests run: 1, Failures: 0, Errors: 0, Skipped: 0, Time elapsed: 11.382 sec - in org.apache.atlas.repository.graphdb.titan0.Titan0DatabaseValidationTest
Tests run: 10, Failures: 0, Errors: 0, Skipped: 0, Time elapsed: 14.811 sec - in org.apache.atlas.repository.graphdb.titan0.Titan0DatabaseTest
Tests run: 9, Failures: 0, Errors: 0, Skipped: 0, Time elapsed: 38.583 sec - in org.apache.atlas.repository.graphdb.titan0.GraphQueryTest

Results :

Failed tests: 
  LocalLockMediatorTest.testLock:46 expected [true] but found [false]

Tests run: 24, Failures: 1, Errors: 0, Skipped: 0

[INFO] ------------------------------------------------------------------------
[INFO] Reactor Summary:
[INFO] 
[INFO] Apache Atlas Server Build Tools .................... SUCCESS [  0.641 s]
[INFO] apache-atlas ....................................... SUCCESS [  2.291 s]
[INFO] Apache Atlas Integration ........................... SUCCESS [ 13.931 s]
[INFO] Apache Atlas Common ................................ SUCCESS [  1.972 s]
[INFO] Apache Atlas Typesystem ............................ SUCCESS [ 37.979 s]
[INFO] Apache Atlas Client ................................ SUCCESS [  0.149 s]
[INFO] atlas-client-common ................................ SUCCESS [  0.720 s]
[INFO] atlas-client-v1 .................................... SUCCESS [  3.195 s]
[INFO] Apache Atlas Server API ............................ SUCCESS [  0.644 s]
[INFO] Apache Atlas Notification .......................... SUCCESS [  9.837 s]
[INFO] atlas-client-v2 .................................... SUCCESS [  0.655 s]
[INFO] Apache Atlas Graph Database Projects ............... SUCCESS [  0.109 s]
[INFO] Apache Atlas Graph Database API .................... SUCCESS [  0.523 s]
[INFO] Graph Database Common Code ......................... SUCCESS [  0.685 s]
[INFO] Apache Atlas Titan 1.0.0 GraphDB Impl .............. SUCCESS [ 29.839 s]
[INFO] Shaded version of Apache hbase client .............. SUCCESS [  7.208 s]
[INFO] Apache Atlas Titan 0.5.4 Graph DB Impl ............. FAILURE [ 43.881 s]
[INFO] Apache Atlas Graph Database Implementation Dependencies SKIPPED
[INFO] Shaded version of Apache hbase server .............. SKIPPED
[INFO] Apache Atlas Repository ............................ SKIPPED
[INFO] Apache Atlas Authorization ......................... SKIPPED
[INFO] Apache Atlas Business Catalog ...................... SKIPPED
[INFO] Apache Atlas UI .................................... SKIPPED
[INFO] Apache Atlas Web Application ....................... SKIPPED
[INFO] Apache Atlas Documentation ......................... SKIPPED
[INFO] Apache Atlas FileSystem Model ...................... SKIPPED
[INFO] Apache Atlas Plugin Classloader .................... SKIPPED
[INFO] Apache Atlas Hive Bridge Shim ...................... SKIPPED
[INFO] Apache Atlas Hive Bridge ........................... SKIPPED
[INFO] Apache Atlas Falcon Bridge Shim .................... SKIPPED
[INFO] Apache Atlas Falcon Bridge ......................... SKIPPED
[INFO] Apache Atlas Sqoop Bridge Shim ..................... SKIPPED
[INFO] Apache Atlas Sqoop Bridge .......................... SKIPPED
[INFO] Apache Atlas Storm Bridge Shim ..................... SKIPPED
[INFO] Apache Atlas Storm Bridge .......................... SKIPPED
[INFO] Apache Atlas Hbase Bridge Shim ..................... SKIPPED
[INFO] Apache Atlas Hbase Bridge .......................... SKIPPED
[INFO] Apache Atlas Distribution .......................... SKIPPED
[INFO] ------------------------------------------------------------------------
[INFO] BUILD FAILURE
[INFO] ------------------------------------------------------------------------
[INFO] Total time: 02:35 min
[INFO] Finished at: 2017-11-28T15:36:51Z
[INFO] Final Memory: 126M/2054M
[INFO] ------------------------------------------------------------------------
[ERROR] Failed to execute goal org.apache.maven.plugins:maven-surefire-plugin:2.18.1:test
(default-test) on project atlas-graphdb-titan0: There are test failures.
[ERROR] 
[ERROR] Please refer to <https://builds.apache.org/job/Atlas-0.8-UnitTests/ws/graphdb/titan0/target/surefire-reports>
for the individual test results.
[ERROR] -> [Help 1]
[ERROR] 
[ERROR] To see the full stack trace of the errors, re-run Maven with the -e switch.
[ERROR] Re-run Maven using the -X switch to enable full debug logging.
[ERROR] 
[ERROR] For more information about the errors and possible solutions, please read the following
articles:
[ERROR] [Help 1] http://cwiki.apache.org/confluence/display/MAVEN/MojoFailureException
[ERROR] 
[ERROR] After correcting the problems, you can resume the build with the command
[ERROR]   mvn <goals> -rf :atlas-graphdb-titan0
Build step 'Execute shell' marked build as failure
[CHECKSTYLE] Collecting checkstyle analysis files...
[CHECKSTYLE] Searching for all files in <https://builds.apache.org/job/Atlas-0.8-UnitTests/ws/>
that match the pattern **/target/checkstyle-result.xml
[CHECKSTYLE] No files found. Configuration error?
<Git Blamer> Using GitBlamer to create author and commit information for all warnings.
<Git Blamer> GIT_COMMIT=7f52e13c4b580a38296096e85aedde1b4c39518e, workspace=<https://builds.apache.org/job/Atlas-0.8-UnitTests/ws/>
[CHECKSTYLE] Computing warning deltas based on reference build #136
[FINDBUGS] Collecting findbugs analysis files...
[FINDBUGS] Searching for all files in <https://builds.apache.org/job/Atlas-0.8-UnitTests/ws/>
that match the pattern **/target/findbugs.xml
[FINDBUGS] No files found. Configuration error?
<Git Blamer> Using GitBlamer to create author and commit information for all warnings.
<Git Blamer> GIT_COMMIT=7f52e13c4b580a38296096e85aedde1b4c39518e, workspace=<https://builds.apache.org/job/Atlas-0.8-UnitTests/ws/>
[FINDBUGS] Computing warning deltas based on reference build #136
Archiving artifacts
TestNG Reports Processing: START
Looking for TestNG results report in workspace using pattern: **/target/surefire-reports/testng-results.xml,**/target/failsafe-reports/testng-results.xml
Saving reports...
Processing '/x1/jenkins/jenkins-home/jobs/Atlas-0.8-UnitTests/builds/137/testng/testng-results-1.xml'
Processing '/x1/jenkins/jenkins-home/jobs/Atlas-0.8-UnitTests/builds/137/testng/testng-results-2.xml'
Processing '/x1/jenkins/jenkins-home/jobs/Atlas-0.8-UnitTests/builds/137/testng/testng-results-3.xml'
Processing '/x1/jenkins/jenkins-home/jobs/Atlas-0.8-UnitTests/builds/137/testng/testng-results-4.xml'
Processing '/x1/jenkins/jenkins-home/jobs/Atlas-0.8-UnitTests/builds/137/testng/testng-results-5.xml'
Processing '/x1/jenkins/jenkins-home/jobs/Atlas-0.8-UnitTests/builds/137/testng/testng-results.xml'
TestNG Reports Processing: FINISH

Mime
View raw message