atlas-dev mailing list archives

Site index · List index
Message view « Date » · « Thread »
Top « Date » · « Thread »
From Apache Jenkins Server <jenk...@builds.apache.org>
Subject Build failed in Jenkins: Atlas-master-IntegrationTests #178
Date Tue, 07 Nov 2017 12:51:18 GMT
See <https://builds.apache.org/job/Atlas-master-IntegrationTests/178/display/redirect?page=changes>

Changes:

[kbhatt] ATLAS-2250: Upgrade JQuery version to 3.*

------------------------------------------
[...truncated 547.50 KB...]
127.0.0.1 - - [07/Nov/2017:12:45:38 +0000] "POST /api/atlas/entities HTTP/1.1" 201 2269 "-"
"Java/1.8.0_152"
127.0.0.1 - - [07/Nov/2017:12:45:38 +0000] "GET /api/atlas/entities/dd7f649d-4a60-45a7-86fa-653b61a1d9b3
HTTP/1.1" 200 2074 "-" "Java/1.8.0_152"
127.0.0.1 - - [07/Nov/2017:12:45:38 +0000] "POST /api/atlas/entities HTTP/1.1" 201 862 "-"
"Java/1.8.0_152"
127.0.0.1 - - [07/Nov/2017:12:45:38 +0000] "POST /api/atlas/entities HTTP/1.1" 201 2269 "-"
"Java/1.8.0_152"
127.0.0.1 - - [07/Nov/2017:12:45:38 +0000] "GET /api/atlas/entities?type=hive_table HTTP/1.1"
200 742 "-" "Java/1.8.0_152"
127.0.0.1 - - [07/Nov/2017:12:45:38 +0000] "GET /api/atlas/entities?type=blah HTTP/1.1" 400
34 "-" "Java/1.8.0_152"
127.0.0.1 - - [07/Nov/2017:12:45:38 +0000] "GET /api/atlas/v2/types/typedef/name/testlHwcINKS8c
HTTP/1.1" 404 91 "-" "Java/1.8.0_152"
127.0.0.1 - - [07/Nov/2017:12:45:38 +0000] "POST /api/atlas/types HTTP/1.1" 201 107 "-" "Java/1.8.0_152"
127.0.0.1 - - [07/Nov/2017:12:45:39 +0000] "GET /api/atlas/entities?type=testlHwcINKS8c HTTP/1.1"
200 122 "-" "Java/1.8.0_152"
127.0.0.1 - - [07/Nov/2017:12:45:39 +0000] "GET /api/atlas/entities/blah HTTP/1.1" 404 72
"-" "Java/1.8.0_152"
127.0.0.1 - - [07/Nov/2017:12:45:39 +0000] "POST /api/atlas/entities HTTP/1.1" 201 862 "-"
"Java/1.8.0_152"
127.0.0.1 - - [07/Nov/2017:12:45:39 +0000] "POST /api/atlas/entities HTTP/1.1" 201 2269 "-"
"Java/1.8.0_152"
127.0.0.1 - - [07/Nov/2017:12:45:39 +0000] "GET /api/atlas/v2/types/typedef/name/PII_TraitPNJI4v4M1S
HTTP/1.1" 404 96 "-" "Java/1.8.0_152"
127.0.0.1 - - [07/Nov/2017:12:45:39 +0000] "POST /api/atlas/types HTTP/1.1" 201 112 "-" "Java/1.8.0_152"
127.0.0.1 - - [07/Nov/2017:12:45:39 +0000] "POST /api/atlas/entities/35f58225-2aee-4f6d-8eef-0fbd51feb2b4/traits
HTTP/1.1" 201 71 "-" "Java/1.8.0_152"
127.0.0.1 - - [07/Nov/2017:12:45:39 +0000] "GET /api/atlas/entities/35f58225-2aee-4f6d-8eef-0fbd51feb2b4/traitDefinitions/PII_TraitPNJI4v4M1S
HTTP/1.1" 200 205 "-" "Java/1.8.0_152"
127.0.0.1 - - [07/Nov/2017:12:45:39 +0000] "GET /api/atlas/entities/35f58225-2aee-4f6d-8eef-0fbd51feb2b4/traitDefinitions
HTTP/1.1" 200 1034 "-" "Java/1.8.0_152"
127.0.0.1 - - [07/Nov/2017:12:45:39 +0000] "POST /api/atlas/entities HTTP/1.1" 201 862 "-"
"Java/1.8.0_152"
127.0.0.1 - - [07/Nov/2017:12:45:39 +0000] "POST /api/atlas/entities HTTP/1.1" 201 2269 "-"
"Java/1.8.0_152"
127.0.0.1 - - [07/Nov/2017:12:45:40 +0000] "GET /api/atlas/entities/f6452751-d1cf-4a40-8c20-5442f8cda8c9/traits
HTTP/1.1" 200 174 "-" "Java/1.8.0_152"
127.0.0.1 - - [07/Nov/2017:12:45:40 +0000] "POST /api/atlas/entities HTTP/1.1" 201 862 "-"
"Java/1.8.0_152"
127.0.0.1 - - [07/Nov/2017:12:45:40 +0000] "POST /api/atlas/entities HTTP/1.1" 201 2269 "-"
"Java/1.8.0_152"
127.0.0.1 - - [07/Nov/2017:12:45:40 +0000] "POST /api/atlas/entities/e2709a00-03c7-4412-949e-c7309a95342d
HTTP/1.1" 200 1134 "-" "Java/1.8.0_152"
127.0.0.1 - - [07/Nov/2017:12:45:40 +0000] "GET /api/atlas/entities/e2709a00-03c7-4412-949e-c7309a95342d
HTTP/1.1" 200 2887 "-" "Java/1.8.0_152"
127.0.0.1 - - [07/Nov/2017:12:45:40 +0000] "POST /api/atlas/entities HTTP/1.1" 201 862 "-"
"Java/1.8.0_152"
127.0.0.1 - - [07/Nov/2017:12:45:40 +0000] "POST /api/atlas/entities HTTP/1.1" 201 2269 "-"
"Java/1.8.0_152"
127.0.0.1 - - [07/Nov/2017:12:45:40 +0000] "POST /api/atlas/entities/qualifiedName?type=hive_table&property=qualifiedName&value=tableHfVrQdG4sk
HTTP/1.1" 200 1131 "-" "Java/1.8.0_152"
127.0.0.1 - - [07/Nov/2017:12:45:40 +0000] "GET /api/atlas/entities/057e1131-3835-4d16-a782-866e8b86df28
HTTP/1.1" 200 2884 "-" "Java/1.8.0_152"
127.0.0.1 - - [07/Nov/2017:12:45:40 +0000] "POST /api/atlas/entities HTTP/1.1" 201 855 "-"
"Java/1.8.0_152"
127.0.0.1 - - [07/Nov/2017:12:45:41 +0000] "GET /api/atlas/entities/d53bbf3c-4e44-4c8b-9d86-58950361fce5/audit?count=10
HTTP/1.1" 200 1608 "-" "Java/1.8.0_152"
127.0.0.1 - - [07/Nov/2017:12:45:41 +0000] "POST /api/atlas/entities HTTP/1.1" 201 862 "-"
"Java/1.8.0_152"
127.0.0.1 - - [07/Nov/2017:12:45:41 +0000] "POST /api/atlas/entities HTTP/1.1" 201 2269 "-"
"Java/1.8.0_152"
127.0.0.1 - - [07/Nov/2017:12:45:41 +0000] "POST /api/atlas/entities HTTP/1.1" 201 862 "-"
"Java/1.8.0_152"
127.0.0.1 - - [07/Nov/2017:12:45:41 +0000] "POST /api/atlas/entities HTTP/1.1" 400 62 "-"
"Java/1.8.0_152"
127.0.0.1 - - [07/Nov/2017:12:45:41 +0000] "POST /api/atlas/entities HTTP/1.1" 201 855 "-"
"Java/1.8.0_152"
127.0.0.1 - - [07/Nov/2017:12:45:41 +0000] "GET /api/atlas/v2/types/typedef/name/u1OQdtywA9
HTTP/1.1" 404 87 "-" "Java/1.8.0_152"
127.0.0.1 - - [07/Nov/2017:12:45:41 +0000] "POST /api/atlas/types HTTP/1.1" 201 103 "-" "Java/1.8.0_152"
127.0.0.1 - - [07/Nov/2017:12:45:42 +0000] "POST /api/atlas/entities HTTP/1.1" 201 758 "-"
"Java/1.8.0_152"
127.0.0.1 - - [07/Nov/2017:12:45:42 +0000] "GET /api/atlas/entities/8b1a307b-9e16-43e2-8454-fe46f03b22c5
HTTP/1.1" 200 614 "-" "Java/1.8.0_152"
127.0.0.1 - - [07/Nov/2017:12:45:42 +0000] "GET /api/atlas/v2/types/typedef/name/PII_TraitCjiVOsbpFX
HTTP/1.1" 404 96 "-" "Java/1.8.0_152"
127.0.0.1 - - [07/Nov/2017:12:45:42 +0000] "POST /api/atlas/v2/types/typedefs HTTP/1.1" 200
411 "-" "Java/1.8.0_152"
127.0.0.1 - - [07/Nov/2017:12:45:42 +0000] "POST /api/atlas/v2/entity/guid/ae3ff6d1-877f-4e1f-a5d8-475f45fd3d70/classifications
HTTP/1.1" 204 0 "-" "Java/1.8.0_152"
127.0.0.1 - - [07/Nov/2017:12:45:42 +0000] "GET /api/atlas/entities/ae3ff6d1-877f-4e1f-a5d8-475f45fd3d70/audit?count=100
HTTP/1.1" 200 44666 "-" "Java/1.8.0_152"
127.0.0.1 - - [07/Nov/2017:12:45:42 +0000] "GET /api/atlas/v2/types/typedef/name/PII_TraitHX8ObmEeyA
HTTP/1.1" 404 96 "-" "Java/1.8.0_152"
127.0.0.1 - - [07/Nov/2017:12:45:42 +0000] "POST /api/atlas/v2/types/typedefs HTTP/1.1" 200
579 "-" "Java/1.8.0_152"
127.0.0.1 - - [07/Nov/2017:12:45:43 +0000] "POST /api/atlas/v2/entity/guid/ae3ff6d1-877f-4e1f-a5d8-475f45fd3d70/classifications
HTTP/1.1" 204 0 "-" "Java/1.8.0_152"
127.0.0.1 - - [07/Nov/2017:12:45:43 +0000] "GET /api/atlas/v2/entity/guid/ae3ff6d1-877f-4e1f-a5d8-475f45fd3d70
HTTP/1.1" 200 1554 "-" "Java/1.8.0_152"
127.0.0.1 - - [07/Nov/2017:12:45:43 +0000] "DELETE /api/atlas/v2/entity/guid/ae3ff6d1-877f-4e1f-a5d8-475f45fd3d70/classification/PII_TraitCjiVOsbpFX
HTTP/1.1" 204 0 "-" "Java/1.8.0_152"
127.0.0.1 - - [07/Nov/2017:12:45:43 +0000] "GET /api/atlas/entities/ae3ff6d1-877f-4e1f-a5d8-475f45fd3d70/audit?count=100
HTTP/1.1" 200 51897 "-" "Java/1.8.0_152"
127.0.0.1 - - [07/Nov/2017:12:45:43 +0000] "POST /api/atlas/types HTTP/1.1" 201 103 "-" "Java/1.8.0_152"
127.0.0.1 - - [07/Nov/2017:12:45:43 +0000] "POST /api/atlas/types HTTP/1.1" 409 48 "-" "Java/1.8.0_152"
127.0.0.1 - - [07/Nov/2017:12:45:43 +0000] "GET /api/atlas/types/blah HTTP/1.1" 404 43 "-"
"Java/1.8.0_152"
127.0.0.1 - - [07/Nov/2017:12:45:43 +0000] "GET /api/atlas/v2/types/typedef/name/class_trait
HTTP/1.1" 404 88 "-" "Java/1.8.0_152"
127.0.0.1 - - [07/Nov/2017:12:45:43 +0000] "POST /api/atlas/types HTTP/1.1" 201 104 "-" "Java/1.8.0_152"
127.0.0.1 - - [07/Nov/2017:12:45:44 +0000] "GET /api/atlas/v2/types/typedef/name/secure_trait
HTTP/1.1" 404 89 "-" "Java/1.8.0_152"
127.0.0.1 - - [07/Nov/2017:12:45:44 +0000] "POST /api/atlas/types HTTP/1.1" 201 105 "-" "Java/1.8.0_152"
127.0.0.1 - - [07/Nov/2017:12:45:44 +0000] "GET /api/atlas/v2/types/typedef/name/pii_trait
HTTP/1.1" 404 86 "-" "Java/1.8.0_152"
127.0.0.1 - - [07/Nov/2017:12:45:44 +0000] "POST /api/atlas/types HTTP/1.1" 201 102 "-" "Java/1.8.0_152"
127.0.0.1 - - [07/Nov/2017:12:45:44 +0000] "GET /api/atlas/v2/types/typedef/name/ssn_trait
HTTP/1.1" 404 86 "-" "Java/1.8.0_152"
127.0.0.1 - - [07/Nov/2017:12:45:44 +0000] "POST /api/atlas/types HTTP/1.1" 201 102 "-" "Java/1.8.0_152"
127.0.0.1 - - [07/Nov/2017:12:45:44 +0000] "GET /api/atlas/v2/types/typedef/name/salary_trait
HTTP/1.1" 404 89 "-" "Java/1.8.0_152"
127.0.0.1 - - [07/Nov/2017:12:45:44 +0000] "POST /api/atlas/types HTTP/1.1" 201 105 "-" "Java/1.8.0_152"
127.0.0.1 - - [07/Nov/2017:12:45:44 +0000] "GET /api/atlas/v2/types/typedef/name/sox_trait
HTTP/1.1" 404 86 "-" "Java/1.8.0_152"
127.0.0.1 - - [07/Nov/2017:12:45:44 +0000] "POST /api/atlas/types HTTP/1.1" 201 102 "-" "Java/1.8.0_152"
127.0.0.1 - - [07/Nov/2017:12:45:45 +0000] "GET /api/atlas/types?type=TRAIT HTTP/1.1" 200
1412 "-" "Java/1.8.0_152"
127.0.0.1 - - [07/Nov/2017:12:45:45 +0000] "GET /api/atlas/v2/types/typedef/name/APPJSNVV4yU
HTTP/1.1" 404 88 "-" "Java/1.8.0_152"
127.0.0.1 - - [07/Nov/2017:12:45:45 +0000] "POST /api/atlas/types HTTP/1.1" 201 104 "-" "Java/1.8.0_152"
127.0.0.1 - - [07/Nov/2017:12:45:45 +0000] "GET /api/atlas/v2/types/typedef/name/A1kbKkOuqpP8
HTTP/1.1" 404 89 "-" "Java/1.8.0_152"
127.0.0.1 - - [07/Nov/2017:12:45:45 +0000] "POST /api/atlas/types HTTP/1.1" 201 105 "-" "Java/1.8.0_152"
127.0.0.1 - - [07/Nov/2017:12:45:45 +0000] "GET /api/atlas/v2/types/typedef/name/BiUUoawxbhg
HTTP/1.1" 404 88 "-" "Java/1.8.0_152"
127.0.0.1 - - [07/Nov/2017:12:45:45 +0000] "POST /api/atlas/types HTTP/1.1" 201 104 "-" "Java/1.8.0_152"
127.0.0.1 - - [07/Nov/2017:12:45:45 +0000] "GET /api/atlas/v2/types/typedef/name/CMf4FluV44h
HTTP/1.1" 404 88 "-" "Java/1.8.0_152"
127.0.0.1 - - [07/Nov/2017:12:45:45 +0000] "POST /api/atlas/types HTTP/1.1" 201 104 "-" "Java/1.8.0_152"
127.0.0.1 - - [07/Nov/2017:12:45:46 +0000] "GET /api/atlas/types?type=CLASS&supertype=APPJSNVV4yU&notsupertype=BiUUoawxbhg
HTTP/1.1" 200 108 "-" "Java/1.8.0_152"
127.0.0.1 - - [07/Nov/2017:12:45:46 +0000] "GET /api/atlas/types/database HTTP/1.1" 200 664
"-" "Java/1.8.0_152"
127.0.0.1 - - [07/Nov/2017:12:45:46 +0000] "GET /api/atlas/types/table HTTP/1.1" 200 1446
"-" "Java/1.8.0_152"
127.0.0.1 - - [07/Nov/2017:12:45:46 +0000] "GET /api/atlas/types/fetl HTTP/1.1" 200 494 "-"
"Java/1.8.0_152"
127.0.0.1 - - [07/Nov/2017:12:45:46 +0000] "POST /api/atlas/types HTTP/1.1" 201 103 "-" "Java/1.8.0_152"
127.0.0.1 - - [07/Nov/2017:12:45:46 +0000] "PUT /api/atlas/types HTTP/1.1" 200 103 "-" "Java/1.8.0_152"
127.0.0.1 - - [07/Nov/2017:12:45:46 +0000] "GET /api/atlas/types/JpEvy1Rwww HTTP/1.1" 200
671 "-" "Java/1.8.0_152"
127.0.0.1 - - [07/Nov/2017:12:45:46 +0000] "GET /api/atlas/types/database HTTP/1.1" 200 664
"-" "Java/1.8.0_152"
127.0.0.1 - - [07/Nov/2017:12:45:46 +0000] "GET /api/atlas/types/table HTTP/1.1" 200 1446
"-" "Java/1.8.0_152"
127.0.0.1 - - [07/Nov/2017:12:45:46 +0000] "GET /api/atlas/types/fetl HTTP/1.1" 200 494 "-"
"Java/1.8.0_152"
127.0.0.1 - - [07/Nov/2017:12:45:46 +0000] "GET /api/atlas/types HTTP/1.1" 200 3936 "-" "Java/1.8.0_152"
Tests run: 136, Failures: 2, Errors: 0, Skipped: 0, Time elapsed: 213.422 sec <<<
FAILURE! - in TestSuite
testLineageIsMaintained(org.apache.atlas.examples.QuickStartIT)  Time elapsed: 2.169 sec 
<<< FAILURE!
java.lang.AssertionError: 
	at org.testng.AssertJUnit.fail(AssertJUnit.java:59)
	at org.testng.AssertJUnit.assertTrue(AssertJUnit.java:24)
	at org.testng.AssertJUnit.assertTrue(AssertJUnit.java:33)
	at org.apache.atlas.examples.QuickStartIT.testLineageIsMaintained(QuickStartIT.java:130)

testSimpleLoginAndAuthorizationWithValidCrendentialsAndInvalidAccessToResource(org.apache.atlas.web.filters.AtlasAuthenticationSimpleFilterIT)
 Time elapsed: 0.012 sec  <<< FAILURE!
java.lang.AssertionError: expected [403] but found [500]
	at org.testng.Assert.fail(Assert.java:94)
	at org.testng.Assert.failNotEquals(Assert.java:496)
	at org.testng.Assert.assertEquals(Assert.java:125)
	at org.testng.Assert.assertEquals(Assert.java:372)
	at org.testng.Assert.assertEquals(Assert.java:382)
	at org.apache.atlas.web.filters.AtlasAuthenticationSimpleFilterIT.testSimpleLoginAndAuthorizationWithValidCrendentialsAndInvalidAccessToResource(AtlasAuthenticationSimpleFilterIT.java:74)


Results :

Failed tests: 
  QuickStartIT.testLineageIsMaintained:130 
  AtlasAuthenticationSimpleFilterIT.testSimpleLoginAndAuthorizationWithValidCrendentialsAndInvalidAccessToResource:74
expected [403] but found [500]

Tests run: 136, Failures: 2, Errors: 0, Skipped: 0

[INFO] 
[INFO] --- jetty-maven-plugin:9.4.0.v20161208:stop (stop-jetty) @ atlas-webapp ---
[INFO] Waiting 10 seconds for jetty to stop
[INFO] Stopped ServerConnector@731f9e7b{HTTP/1.1,[http/1.1]}{0.0.0.0:31000}
[INFO] Stopped scavenging
[INFO] Closing Spring root WebApplicationContext
[INFO] Shutting down log4j
[INFO] Stopped o.e.j.m.p.JettyWebAppContext@7b743288{/,file://<https://builds.apache.org/job/Atlas-master-IntegrationTests/ws/webapp/target/atlas-webapp-1.0.0-SNAPSHOT/,UNAVAILABLE}{/home/jenkins/jenkins-slave/workspace/Atlas-master-IntegrationTests/webapp/target/atlas-webapp-1.0.0-SNAPSHOT.war}>
[INFO] Server reports itself as stopped
[INFO] 
[INFO] --- maven-source-plugin:2.4:jar-no-fork (attach-sources) @ atlas-webapp ---
[INFO] Building jar: <https://builds.apache.org/job/Atlas-master-IntegrationTests/ws/webapp/target/atlas-webapp-1.0.0-SNAPSHOT-sources.jar>
log4j:WARN No appenders could be found for logger (org.apache.zookeeper.ClientCnxn).
log4j:WARN Please initialize the log4j system properly.
log4j:WARN See http://logging.apache.org/log4j/1.2/faq.html#noconfig for more info.
[INFO] 
[INFO] --- maven-source-plugin:2.4:test-jar-no-fork (attach-sources) @ atlas-webapp ---
[INFO] Building jar: <https://builds.apache.org/job/Atlas-master-IntegrationTests/ws/webapp/target/atlas-webapp-1.0.0-SNAPSHOT-test-sources.jar>
[INFO] 
[INFO] --- maven-failsafe-plugin:2.18.1:verify (verify) @ atlas-webapp ---
[INFO] Failsafe report directory: <https://builds.apache.org/job/Atlas-master-IntegrationTests/ws/webapp/target/failsafe-reports>
[INFO] ------------------------------------------------------------------------
[INFO] Reactor Summary:
[INFO] 
[INFO] Apache Atlas Server Build Tools .................... SUCCESS [  0.834 s]
[INFO] apache-atlas ....................................... SUCCESS [  4.889 s]
[INFO] Apache Atlas Integration ........................... SUCCESS [ 24.587 s]
[INFO] Apache Atlas Common ................................ SUCCESS [  9.343 s]
[INFO] Apache Atlas Typesystem ............................ SUCCESS [ 52.409 s]
[INFO] Apache Atlas Client ................................ SUCCESS [  1.072 s]
[INFO] atlas-client-common ................................ SUCCESS [  8.559 s]
[INFO] atlas-client-v1 .................................... SUCCESS [  8.987 s]
[INFO] Apache Atlas Server API ............................ SUCCESS [  6.980 s]
[INFO] Apache Atlas Notification .......................... SUCCESS [ 11.663 s]
[INFO] atlas-client-v2 .................................... SUCCESS [  6.624 s]
[INFO] Apache Atlas Graph Database Projects ............... SUCCESS [  0.506 s]
[INFO] Apache Atlas Graph Database API .................... SUCCESS [  5.974 s]
[INFO] Graph Database Common Code ......................... SUCCESS [  6.087 s]
[INFO] Shaded version of Apache hbase client .............. SUCCESS [ 10.019 s]
[INFO] Apache Atlas Titan 0.5.4 Graph DB Impl ............. SUCCESS [ 46.295 s]
[INFO] Apache Atlas Graph Database Implementation Dependencies SUCCESS [  0.634 s]
[INFO] Apache Atlas Titan 1.0.0 GraphDB Impl .............. SUCCESS [ 34.483 s]
[INFO] Apache Atlas JanusGraph DB Impl .................... SUCCESS [ 25.007 s]
[INFO] Shaded version of Apache hbase server .............. SUCCESS [ 23.176 s]
[INFO] Apache Atlas Repository ............................ SUCCESS [01:27 min]
[INFO] Apache Atlas Authorization ......................... SUCCESS [  8.336 s]
[INFO] Apache Atlas UI .................................... SUCCESS [01:11 min]
[INFO] Apache Atlas Web Application ....................... FAILURE [05:07 min]
[INFO] Apache Atlas Documentation ......................... SKIPPED
[INFO] Apache Atlas FileSystem Model ...................... SKIPPED
[INFO] Apache Atlas Plugin Classloader .................... SKIPPED
[INFO] Apache Atlas Hive Bridge Shim ...................... SKIPPED
[INFO] Apache Atlas Hive Bridge ........................... SKIPPED
[INFO] Apache Atlas Falcon Bridge Shim .................... SKIPPED
[INFO] Apache Atlas Falcon Bridge ......................... SKIPPED
[INFO] Apache Atlas Sqoop Bridge Shim ..................... SKIPPED
[INFO] Apache Atlas Sqoop Bridge .......................... SKIPPED
[INFO] Apache Atlas Storm Bridge Shim ..................... SKIPPED
[INFO] Apache Atlas Storm Bridge .......................... SKIPPED
[INFO] Apache Atlas Hbase Bridge Shim ..................... SKIPPED
[INFO] Apache Atlas Hbase Bridge .......................... SKIPPED
[INFO] Apache Atlas Distribution .......................... SKIPPED
[INFO] ------------------------------------------------------------------------
[INFO] BUILD FAILURE
[INFO] ------------------------------------------------------------------------
[INFO] Total time: 12:44 min
[INFO] Finished at: 2017-11-07T12:46:06Z
[INFO] Final Memory: 393M/2359M
[INFO] ------------------------------------------------------------------------
[ERROR] Failed to execute goal org.apache.maven.plugins:maven-failsafe-plugin:2.18.1:verify
(verify) on project atlas-webapp: There are test failures.
[ERROR] 
[ERROR] Please refer to <https://builds.apache.org/job/Atlas-master-IntegrationTests/ws/webapp/target/failsafe-reports>
for the individual test results.
[ERROR] -> [Help 1]
[ERROR] 
[ERROR] To see the full stack trace of the errors, re-run Maven with the -e switch.
[ERROR] Re-run Maven using the -X switch to enable full debug logging.
[ERROR] 
[ERROR] For more information about the errors and possible solutions, please read the following
articles:
[ERROR] [Help 1] http://cwiki.apache.org/confluence/display/MAVEN/MojoFailureException
[ERROR] 
[ERROR] After correcting the problems, you can resume the build with the command
[ERROR]   mvn <goals> -rf :atlas-webapp
Build step 'Execute shell' marked build as failure
[CHECKSTYLE] Collecting checkstyle analysis files...
[CHECKSTYLE] Searching for all files in <https://builds.apache.org/job/Atlas-master-IntegrationTests/ws/>
that match the pattern **/target/checkstyle-result.xml
[CHECKSTYLE] Parsing 22 files in <https://builds.apache.org/job/Atlas-master-IntegrationTests/ws/>
[CHECKSTYLE] Successfully parsed file <https://builds.apache.org/job/Atlas-master-IntegrationTests/ws/authorization/target/checkstyle-result.xml>
with 461 unique warnings and 0 duplicates.
[CHECKSTYLE] Successfully parsed file <https://builds.apache.org/job/Atlas-master-IntegrationTests/ws/client/client-v1/target/checkstyle-result.xml>
with 1336 unique warnings and 0 duplicates.
[CHECKSTYLE] Successfully parsed file <https://builds.apache.org/job/Atlas-master-IntegrationTests/ws/client/client-v2/target/checkstyle-result.xml>
with 1676 unique warnings and 0 duplicates.
[CHECKSTYLE] Successfully parsed file <https://builds.apache.org/job/Atlas-master-IntegrationTests/ws/client/common/target/checkstyle-result.xml>
with 2166 unique warnings and 0 duplicates.
[CHECKSTYLE] Successfully parsed file <https://builds.apache.org/job/Atlas-master-IntegrationTests/ws/client/target/checkstyle-result.xml>
with 2166 unique warnings and 0 duplicates.
[CHECKSTYLE] Successfully parsed file <https://builds.apache.org/job/Atlas-master-IntegrationTests/ws/common/target/checkstyle-result.xml>
with 3131 unique warnings and 0 duplicates.
[CHECKSTYLE] Successfully parsed file <https://builds.apache.org/job/Atlas-master-IntegrationTests/ws/dashboardv2/target/checkstyle-result.xml>
with 3131 unique warnings and 0 duplicates.
[CHECKSTYLE] Successfully parsed file <https://builds.apache.org/job/Atlas-master-IntegrationTests/ws/graphdb/api/target/checkstyle-result.xml>
with 3404 unique warnings and 0 duplicates.
[CHECKSTYLE] Successfully parsed file <https://builds.apache.org/job/Atlas-master-IntegrationTests/ws/graphdb/common/target/checkstyle-result.xml>
with 3597 unique warnings and 0 duplicates.
[CHECKSTYLE] Successfully parsed file <https://builds.apache.org/job/Atlas-master-IntegrationTests/ws/graphdb/graphdb-impls/target/checkstyle-result.xml>
with 3597 unique warnings and 0 duplicates.
[CHECKSTYLE] Successfully parsed file <https://builds.apache.org/job/Atlas-master-IntegrationTests/ws/graphdb/janus/target/checkstyle-result.xml>
with 4588 unique warnings and 0 duplicates.
[CHECKSTYLE] Successfully parsed file <https://builds.apache.org/job/Atlas-master-IntegrationTests/ws/graphdb/target/checkstyle-result.xml>
with 4588 unique warnings and 0 duplicates.
[CHECKSTYLE] Successfully parsed file <https://builds.apache.org/job/Atlas-master-IntegrationTests/ws/graphdb/titan0/target/checkstyle-result.xml>
with 7047 unique warnings and 0 duplicates.
[CHECKSTYLE] Successfully parsed file <https://builds.apache.org/job/Atlas-master-IntegrationTests/ws/graphdb/titan1/target/checkstyle-result.xml>
with 8018 unique warnings and 0 duplicates.
[CHECKSTYLE] Successfully parsed file <https://builds.apache.org/job/Atlas-master-IntegrationTests/ws/intg/target/checkstyle-result.xml>
with 16224 unique warnings and 0 duplicates.
[CHECKSTYLE] Successfully parsed file <https://builds.apache.org/job/Atlas-master-IntegrationTests/ws/notification/target/checkstyle-result.xml>
with 17789 unique warnings and 0 duplicates.
[CHECKSTYLE] Successfully parsed file <https://builds.apache.org/job/Atlas-master-IntegrationTests/ws/repository/target/checkstyle-result.xml>
with 38123 unique warnings and 0 duplicates.
[CHECKSTYLE] Successfully parsed file <https://builds.apache.org/job/Atlas-master-IntegrationTests/ws/server-api/target/checkstyle-result.xml>
with 38516 unique warnings and 0 duplicates.
[CHECKSTYLE] Successfully parsed file <https://builds.apache.org/job/Atlas-master-IntegrationTests/ws/shaded/hbase-client-shaded/target/checkstyle-result.xml>
with 38516 unique warnings and 0 duplicates.
[CHECKSTYLE] Successfully parsed file <https://builds.apache.org/job/Atlas-master-IntegrationTests/ws/shaded/hbase-server-shaded/target/checkstyle-result.xml>
with 38516 unique warnings and 0 duplicates.
[CHECKSTYLE] Successfully parsed file <https://builds.apache.org/job/Atlas-master-IntegrationTests/ws/target/checkstyle-result.xml>
with 38516 unique warnings and 0 duplicates.
[CHECKSTYLE] Successfully parsed file <https://builds.apache.org/job/Atlas-master-IntegrationTests/ws/typesystem/target/checkstyle-result.xml>
with 42734 unique warnings and 0 duplicates.
<Git Blamer> Using GitBlamer to create author and commit information for all warnings.
<Git Blamer> GIT_COMMIT=af51fbcf2d8c94659ed454d78f1b5551c56d052a, workspace=<https://builds.apache.org/job/Atlas-master-IntegrationTests/ws/>
 > git rev-parse af51fbcf2d8c94659ed454d78f1b5551c56d052a^{commit} # timeout=10
[FINDBUGS] Collecting findbugs analysis files...
[FINDBUGS] Searching for all files in <https://builds.apache.org/job/Atlas-master-IntegrationTests/ws/>
that match the pattern **/target/findbugs.xml
[FINDBUGS] Parsing 15 files in <https://builds.apache.org/job/Atlas-master-IntegrationTests/ws/>
[FINDBUGS] Successfully parsed file <https://builds.apache.org/job/Atlas-master-IntegrationTests/ws/authorization/target/findbugs.xml>
with 0 unique warnings and 0 duplicates.
[FINDBUGS] Successfully parsed file <https://builds.apache.org/job/Atlas-master-IntegrationTests/ws/client/client-v1/target/findbugs.xml>
with 0 unique warnings and 0 duplicates.
[FINDBUGS] Successfully parsed file <https://builds.apache.org/job/Atlas-master-IntegrationTests/ws/client/client-v2/target/findbugs.xml>
with 0 unique warnings and 0 duplicates.
[FINDBUGS] Successfully parsed file <https://builds.apache.org/job/Atlas-master-IntegrationTests/ws/client/common/target/findbugs.xml>
with 0 unique warnings and 0 duplicates.
[FINDBUGS] Successfully parsed file <https://builds.apache.org/job/Atlas-master-IntegrationTests/ws/common/target/findbugs.xml>
with 0 unique warnings and 0 duplicates.
[FINDBUGS] Successfully parsed file <https://builds.apache.org/job/Atlas-master-IntegrationTests/ws/graphdb/api/target/findbugs.xml>
with 0 unique warnings and 0 duplicates.
[FINDBUGS] Successfully parsed file <https://builds.apache.org/job/Atlas-master-IntegrationTests/ws/graphdb/common/target/findbugs.xml>
with 0 unique warnings and 0 duplicates.
[FINDBUGS] Successfully parsed file <https://builds.apache.org/job/Atlas-master-IntegrationTests/ws/graphdb/janus/target/findbugs.xml>
with 0 unique warnings and 0 duplicates.
[FINDBUGS] Successfully parsed file <https://builds.apache.org/job/Atlas-master-IntegrationTests/ws/graphdb/titan0/target/findbugs.xml>
with 0 unique warnings and 0 duplicates.
[FINDBUGS] Successfully parsed file <https://builds.apache.org/job/Atlas-master-IntegrationTests/ws/graphdb/titan1/target/findbugs.xml>
with 0 unique warnings and 0 duplicates.
[FINDBUGS] Successfully parsed file <https://builds.apache.org/job/Atlas-master-IntegrationTests/ws/intg/target/findbugs.xml>
with 0 unique warnings and 0 duplicates.
[FINDBUGS] Successfully parsed file <https://builds.apache.org/job/Atlas-master-IntegrationTests/ws/notification/target/findbugs.xml>
with 0 unique warnings and 0 duplicates.
[FINDBUGS] Successfully parsed file <https://builds.apache.org/job/Atlas-master-IntegrationTests/ws/repository/target/findbugs.xml>
with 0 unique warnings and 0 duplicates.
[FINDBUGS] Successfully parsed file <https://builds.apache.org/job/Atlas-master-IntegrationTests/ws/server-api/target/findbugs.xml>
with 0 unique warnings and 0 duplicates.
[FINDBUGS] Successfully parsed file <https://builds.apache.org/job/Atlas-master-IntegrationTests/ws/typesystem/target/findbugs.xml>
with 0 unique warnings and 0 duplicates.
<Git Blamer> Using GitBlamer to create author and commit information for all warnings.
<Git Blamer> GIT_COMMIT=af51fbcf2d8c94659ed454d78f1b5551c56d052a, workspace=<https://builds.apache.org/job/Atlas-master-IntegrationTests/ws/>
Archiving artifacts
[Fast Archiver] No prior successful build to compare, so performing full copy of artifacts
TestNG Reports Processing: START
Looking for TestNG results report in workspace using pattern: **/target/surefire-reports/testng-results.xml,**/target/failsafe-reports/testng-results.xml
Saving reports...
Processing '/x1/jenkins/jenkins-home/jobs/Atlas-master-IntegrationTests/builds/178/testng/testng-results.xml'
1.470588% of tests failed, which exceeded threshold of 0%. Marking build as UNSTABLE
TestNG Reports Processing: FINISH

Mime
View raw message