atlas-dev mailing list archives

Site index · List index
Message view « Date » · « Thread »
Top « Date » · « Thread »
From Apache Jenkins Server <jenk...@builds.apache.org>
Subject Build failed in Jenkins: Atlas-master-UnitTests #171
Date Mon, 20 Nov 2017 19:49:53 GMT
See <https://builds.apache.org/job/Atlas-master-UnitTests/171/display/redirect?page=changes>

Changes:

[madhan] ATLAS-2269: Error in the Area 0 and 3 model files

------------------------------------------
[...truncated 164.02 KB...]
[INFO] Exclude: *.json
[INFO] Exclude: **/overlays/**
[INFO] Exclude: dev-support/**
[INFO] Exclude: **/users-credentials.properties
[INFO] Exclude: **/public/css/animate.min.css
[INFO] Exclude: **/public/css/bootstrap-sidebar.css
[INFO] Exclude: **/public/js/external_lib/**
[INFO] Exclude: **/node_modules/**
[INFO] Exclude: **/public/js/libs/**
[INFO] Exclude: **/atlas.data/**
[INFO] Exclude: **/${sys:atlas.data}/**
[INFO] Exclude: **/policy-store.txt
[INFO] Exclude: **/*rebel*.xml
[INFO] Exclude: **/*rebel*.xml.bak
[INFO] 
[INFO] --- maven-remote-resources-plugin:1.5:process (default) @ atlas-repository ---
[INFO] 
[INFO] --- maven-resources-plugin:2.7:resources (default-resources) @ atlas-repository ---
[INFO] Using 'UTF-8' encoding to copy filtered resources.
[INFO] skip non existing resourceDirectory <https://builds.apache.org/job/Atlas-master-UnitTests/ws/repository/src/main/resources>
[INFO] Copying 2 resources to META-INF
[INFO] Copying 3 resources
[INFO] 
[INFO] --- maven-compiler-plugin:3.7.0:compile (default-compile) @ atlas-repository ---
[INFO] Changes detected - recompiling the module!
[INFO] Compiling 109 source files to <https://builds.apache.org/job/Atlas-master-UnitTests/ws/repository/target/classes>
[INFO] <https://builds.apache.org/job/Atlas-master-UnitTests/ws/repository/src/main/java/org/apache/atlas/repository/converters/AtlasInstanceConverter.java>:
Some input files use or override a deprecated API.
[INFO] <https://builds.apache.org/job/Atlas-master-UnitTests/ws/repository/src/main/java/org/apache/atlas/repository/converters/AtlasInstanceConverter.java>:
Recompile with -Xlint:deprecation for details.
[INFO] <https://builds.apache.org/job/Atlas-master-UnitTests/ws/repository/src/main/java/org/apache/atlas/repository/graph/GraphHelper.java>:
Some input files use unchecked or unsafe operations.
[INFO] <https://builds.apache.org/job/Atlas-master-UnitTests/ws/repository/src/main/java/org/apache/atlas/repository/graph/GraphHelper.java>:
Recompile with -Xlint:unchecked for details.
[INFO] 
[INFO] --- maven-dependency-plugin:2.10:unpack (unpack) @ atlas-repository ---
[INFO] Configured Artifact: org.apache.atlas:atlas-common:1.0.0-SNAPSHOT:test-jar
[INFO] Unpacking <https://builds.apache.org/job/Atlas-master-UnitTests/ws/common/target/atlas-common-1.0.0-SNAPSHOT-tests.jar>
to <https://builds.apache.org/job/Atlas-master-UnitTests/ws/repository/target/local_solr>
with includes "" and excludes "org/**,META-INF/**"
[INFO] 
[INFO] --- maven-resources-plugin:2.7:testResources (default-testResources) @ atlas-repository
---
[INFO] Using 'UTF-8' encoding to copy filtered resources.
[INFO] Copying 21 resources
[INFO] Copying 3 resources
[INFO] 
[INFO] --- maven-compiler-plugin:3.7.0:testCompile (default-testCompile) @ atlas-repository
---
[INFO] Changes detected - recompiling the module!
[INFO] Compiling 32 source files to <https://builds.apache.org/job/Atlas-master-UnitTests/ws/repository/target/test-classes>
[INFO] <https://builds.apache.org/job/Atlas-master-UnitTests/ws/repository/src/test/java/org/apache/atlas/repository/store/graph/v1/InverseReferenceUpdateV1Test.java>:
Some input files use unchecked or unsafe operations.
[INFO] <https://builds.apache.org/job/Atlas-master-UnitTests/ws/repository/src/test/java/org/apache/atlas/repository/store/graph/v1/InverseReferenceUpdateV1Test.java>:
Recompile with -Xlint:unchecked for details.
[INFO] 
[INFO] --- maven-surefire-plugin:2.20.1:test (default-test) @ atlas-repository ---
[INFO] 
[INFO] -------------------------------------------------------
[INFO]  T E S T S
[INFO] -------------------------------------------------------
[INFO] Running org.apache.atlas.repository.impexp.UniqueListTest
[INFO] Running org.apache.atlas.repository.impexp.ExportServiceTest
[INFO] Running org.apache.atlas.repository.impexp.ImportTransformsTest
[INFO] Running org.apache.atlas.services.MetricsServiceTest
[INFO] Running org.apache.atlas.repository.impexp.ZipSourceTest
[INFO] Running org.apache.atlas.repository.impexp.LocalSolrTest
[INFO] Running org.apache.atlas.repository.impexp.ImportTransformerTest
[INFO] Running org.apache.atlas.repository.impexp.ImportTransformerJSONTest
[INFO] Running org.apache.atlas.repository.impexp.AtlasImportRequestTest
[INFO] Running org.apache.atlas.repository.store.graph.v1.AtlasRelationshipDefStoreV1Test
[INFO] Running org.apache.atlas.repository.store.graph.v1.InverseReferenceUpdateHardDeleteV1Test
[INFO] Running org.apache.atlas.utils.TestResourceFileUtils
[INFO] Running org.apache.atlas.repository.store.graph.v1.AtlasEntityStoreV1Test
[INFO] Running org.apache.atlas.repository.store.graph.v1.AtlasRelationshipStoreSoftDeleteV1Test
[INFO] Running org.apache.atlas.repository.impexp.ZipSinkTest
[INFO] Running org.apache.atlas.repository.impexp.ImportServiceTest
[INFO] Running org.apache.atlas.TestModules
[INFO] Running org.apache.atlas.repository.store.graph.v1.AtlasRelationshipStoreV1Test
[INFO] Running org.apache.atlas.repository.audit.InMemoryAuditRepositoryTest
[INFO] Running org.apache.atlas.repository.impexp.TypeAttributeDifferenceTest
[INFO] Running org.apache.atlas.utils.ObjectUpdateSynchronizerTest
[INFO] Running org.apache.atlas.repository.userprofile.UserProfileServiceTest
[INFO] Running org.apache.atlas.repository.store.graph.v1.InverseReferenceUpdateSoftDeleteV1Test
[INFO] Running org.apache.atlas.repository.store.graph.AtlasTypeDefGraphStoreTest
[INFO] Running org.apache.atlas.repository.store.graph.v1.InverseReferenceUpdateV1Test
[INFO] Running org.apache.atlas.repository.store.graph.v1.AtlasEntityStoreV1BulkImportPercentTest
[INFO] Running org.apache.atlas.repository.store.graph.v1.AtlasRelationshipStoreHardDeleteV1Test
[INFO] Running org.apache.atlas.repository.store.graph.v1.AtlasEntityDefStoreV1Test
[INFO] Tests run: 0, Failures: 0, Errors: 0, Skipped: 0, Time elapsed: 8.344 s - in org.apache.atlas.repository.store.graph.v1.InverseReferenceUpdateV1Test
[INFO] Tests run: 0, Failures: 0, Errors: 0, Skipped: 0, Time elapsed: 9.143 s - in org.apache.atlas.utils.TestResourceFileUtils
[INFO] Tests run: 4, Failures: 0, Errors: 0, Skipped: 0, Time elapsed: 9.502 s - in org.apache.atlas.repository.impexp.UniqueListTest
[INFO] Tests run: 0, Failures: 0, Errors: 0, Skipped: 0, Time elapsed: 9.387 s - in org.apache.atlas.repository.store.graph.v1.AtlasRelationshipStoreV1Test
[WARNING] ForkStarter IOException: org.apache.maven.surefire.report.SafeThrowable.<init>(Ljava/lang/String;)V.
See the dump file <https://builds.apache.org/job/Atlas-master-UnitTests/ws/repository/target/surefire-reports/2017-11-20T19-44-56_928-jvmRun30.dumpstream>
[INFO] Tests run: 3, Failures: 0, Errors: 0, Skipped: 0, Time elapsed: 9.762 s - in org.apache.atlas.repository.audit.InMemoryAuditRepositoryTest
[INFO] Tests run: 0, Failures: 0, Errors: 0, Skipped: 0, Time elapsed: 9.968 s - in org.apache.atlas.TestModules
[INFO] Tests run: 8, Failures: 0, Errors: 0, Skipped: 0, Time elapsed: 10.16 s - in org.apache.atlas.repository.impexp.ImportTransformerTest
[WARNING] ForkStarter IOException: org.apache.maven.surefire.report.SafeThrowable.<init>(Ljava/lang/String;)V.
See the dump file <https://builds.apache.org/job/Atlas-master-UnitTests/ws/repository/target/surefire-reports/2017-11-20T19-44-56_928-jvmRun5.dumpstream>
[WARNING] ForkStarter IOException: org.apache.maven.surefire.report.SafeThrowable.<init>(Ljava/lang/String;)V.
See the dump file <https://builds.apache.org/job/Atlas-master-UnitTests/ws/repository/target/surefire-reports/2017-11-20T19-44-56_928-jvmRun2.dumpstream>
[INFO] Tests run: 6, Failures: 0, Errors: 0, Skipped: 0, Time elapsed: 10.701 s - in org.apache.atlas.repository.impexp.TypeAttributeDifferenceTest
[WARNING] ForkStarter IOException: org.apache.maven.surefire.report.SafeThrowable.<init>(Ljava/lang/String;)V.
See the dump file <https://builds.apache.org/job/Atlas-master-UnitTests/ws/repository/target/surefire-reports/2017-11-20T19-44-56_928-jvmRun7.dumpstream>
[INFO] Tests run: 9, Failures: 0, Errors: 0, Skipped: 0, Time elapsed: 10.767 s - in org.apache.atlas.utils.ObjectUpdateSynchronizerTest
[WARNING] ForkStarter IOException: org.apache.maven.surefire.report.SafeThrowable.<init>(Ljava/lang/String;)V.
See the dump file <https://builds.apache.org/job/Atlas-master-UnitTests/ws/repository/target/surefire-reports/2017-11-20T19-44-56_928-jvmRun8.dumpstream>
[INFO] Tests run: 9, Failures: 0, Errors: 0, Skipped: 0, Time elapsed: 11.26 s - in org.apache.atlas.repository.store.graph.v1.AtlasEntityStoreV1BulkImportPercentTest
[INFO] Tests run: 1, Failures: 0, Errors: 0, Skipped: 0, Time elapsed: 22.534 s - in org.apache.atlas.services.MetricsServiceTest
[INFO] Tests run: 1, Failures: 0, Errors: 0, Skipped: 0, Time elapsed: 25.975 s - in org.apache.atlas.repository.impexp.LocalSolrTest
[INFO] 
[INFO] Results:
[INFO] 
[INFO] Tests run: 41, Failures: 0, Errors: 0, Skipped: 0
[INFO] 
[INFO] ------------------------------------------------------------------------
[INFO] Reactor Summary:
[INFO] 
[INFO] Apache Atlas Server Build Tools .................... SUCCESS [  0.563 s]
[INFO] apache-atlas ....................................... SUCCESS [  1.578 s]
[INFO] Apache Atlas Integration ........................... SUCCESS [ 35.538 s]
[INFO] Apache Atlas Common ................................ SUCCESS [  7.167 s]
[INFO] Apache Atlas Client ................................ SUCCESS [  0.186 s]
[INFO] atlas-client-common ................................ SUCCESS [  0.899 s]
[INFO] atlas-client-v1 .................................... SUCCESS [  3.986 s]
[INFO] Apache Atlas Server API ............................ SUCCESS [  1.668 s]
[INFO] Apache Atlas Notification .......................... SUCCESS [  8.376 s]
[INFO] atlas-client-v2 .................................... SUCCESS [  0.604 s]
[INFO] Apache Atlas Graph Database Projects ............... SUCCESS [  0.098 s]
[INFO] Apache Atlas Graph Database API .................... SUCCESS [  1.504 s]
[INFO] Graph Database Common Code ......................... SUCCESS [  1.635 s]
[INFO] Apache Atlas JanusGraph DB Impl .................... SUCCESS [01:56 min]
[INFO] Apache Atlas Graph Database Implementation Dependencies SUCCESS [  1.615 s]
[INFO] Shaded version of Apache hbase client .............. SUCCESS [  7.185 s]
[INFO] Apache Atlas Titan 0.5.4 Graph DB Impl ............. SUCCESS [ 25.163 s]
[INFO] Apache Atlas Titan 1.0.0 GraphDB Impl .............. SUCCESS [ 21.235 s]
[INFO] Shaded version of Apache hbase server .............. SUCCESS [ 18.650 s]
[INFO] Apache Atlas Repository ............................ FAILURE [ 31.881 s]
[INFO] Apache Atlas Authorization ......................... SKIPPED
[INFO] Apache Atlas UI .................................... SKIPPED
[INFO] Apache Atlas Web Application ....................... SKIPPED
[INFO] Apache Atlas Documentation ......................... SKIPPED
[INFO] Apache Atlas FileSystem Model ...................... SKIPPED
[INFO] Apache Atlas Plugin Classloader .................... SKIPPED
[INFO] Apache Atlas Hive Bridge Shim ...................... SKIPPED
[INFO] Apache Atlas Hive Bridge ........................... SKIPPED
[INFO] Apache Atlas Falcon Bridge Shim .................... SKIPPED
[INFO] Apache Atlas Falcon Bridge ......................... SKIPPED
[INFO] Apache Atlas Sqoop Bridge Shim ..................... SKIPPED
[INFO] Apache Atlas Sqoop Bridge .......................... SKIPPED
[INFO] Apache Atlas Storm Bridge Shim ..................... SKIPPED
[INFO] Apache Atlas Storm Bridge .......................... SKIPPED
[INFO] Apache Atlas Hbase Bridge Shim ..................... SKIPPED
[INFO] Apache Atlas Hbase Bridge .......................... SKIPPED
[INFO] Apache Atlas Distribution .......................... SKIPPED
[INFO] ------------------------------------------------------------------------
[INFO] BUILD FAILURE
[INFO] ------------------------------------------------------------------------
[INFO] Total time: 04:47 min
[INFO] Finished at: 2017-11-20T19:49:35Z
[INFO] Final Memory: 137M/2101M
[INFO] ------------------------------------------------------------------------
[ERROR] Failed to execute goal org.apache.maven.plugins:maven-surefire-plugin:2.20.1:test
(default-test) on project atlas-repository: There are test failures.
[ERROR] 
[ERROR] Please refer to <https://builds.apache.org/job/Atlas-master-UnitTests/ws/repository/target/surefire-reports>
for the individual test results.
[ERROR] Please refer to dump files (if any exist) [date]-jvmRun[N].dump, [date].dumpstream
and [date]-jvmRun[N].dumpstream.
[ERROR] ExecutionException org.apache.maven.surefire.report.SafeThrowable.<init>(Ljava/lang/String;)V
[ERROR] ExecutionException org.apache.maven.surefire.report.SafeThrowable.<init>(Ljava/lang/String;)V
[ERROR] ExecutionException org.apache.maven.surefire.report.SafeThrowable.<init>(Ljava/lang/String;)V
[ERROR] ExecutionException org.apache.maven.surefire.report.SafeThrowable.<init>(Ljava/lang/String;)V
[ERROR] ExecutionException org.apache.maven.surefire.report.SafeThrowable.<init>(Ljava/lang/String;)V
[ERROR] ExecutionException org.apache.maven.surefire.report.SafeThrowable.<init>(Ljava/lang/String;)V
[ERROR] ExecutionException org.apache.maven.surefire.report.SafeThrowable.<init>(Ljava/lang/String;)V
[ERROR] ExecutionException org.apache.maven.surefire.report.SafeThrowable.<init>(Ljava/lang/String;)V
[ERROR] ExecutionException org.apache.maven.surefire.report.SafeThrowable.<init>(Ljava/lang/String;)V
[ERROR] ExecutionException org.apache.maven.surefire.report.SafeThrowable.<init>(Ljava/lang/String;)V
[ERROR] ExecutionException org.apache.maven.surefire.report.SafeThrowable.<init>(Ljava/lang/String;)V
[ERROR] org.apache.maven.surefire.booter.SurefireBooterForkException: ExecutionException org.apache.maven.surefire.report.SafeThrowable.<init>(Ljava/lang/String;)V
[ERROR] ExecutionException org.apache.maven.surefire.report.SafeThrowable.<init>(Ljava/lang/String;)V
[ERROR] ExecutionException org.apache.maven.surefire.report.SafeThrowable.<init>(Ljava/lang/String;)V
[ERROR] ExecutionException org.apache.maven.surefire.report.SafeThrowable.<init>(Ljava/lang/String;)V
[ERROR] ExecutionException org.apache.maven.surefire.report.SafeThrowable.<init>(Ljava/lang/String;)V
[ERROR] ExecutionException org.apache.maven.surefire.report.SafeThrowable.<init>(Ljava/lang/String;)V
[ERROR] ExecutionException org.apache.maven.surefire.report.SafeThrowable.<init>(Ljava/lang/String;)V
[ERROR] ExecutionException org.apache.maven.surefire.report.SafeThrowable.<init>(Ljava/lang/String;)V
[ERROR] ExecutionException org.apache.maven.surefire.report.SafeThrowable.<init>(Ljava/lang/String;)V
[ERROR] ExecutionException org.apache.maven.surefire.report.SafeThrowable.<init>(Ljava/lang/String;)V
[ERROR] ExecutionException org.apache.maven.surefire.report.SafeThrowable.<init>(Ljava/lang/String;)V
[ERROR] 	at org.apache.maven.plugin.surefire.booterclient.ForkStarter.awaitResultsDone(ForkStarter.java:496)
[ERROR] 	at org.apache.maven.plugin.surefire.booterclient.ForkStarter.runSuitesForkPerTestSet(ForkStarter.java:443)
[ERROR] 	at org.apache.maven.plugin.surefire.booterclient.ForkStarter.run(ForkStarter.java:295)
[ERROR] 	at org.apache.maven.plugin.surefire.booterclient.ForkStarter.run(ForkStarter.java:246)
[ERROR] 	at org.apache.maven.plugin.surefire.AbstractSurefireMojo.executeProvider(AbstractSurefireMojo.java:1124)
[ERROR] 	at org.apache.maven.plugin.surefire.AbstractSurefireMojo.executeAfterPreconditionsChecked(AbstractSurefireMojo.java:954)
[ERROR] 	at org.apache.maven.plugin.surefire.AbstractSurefireMojo.execute(AbstractSurefireMojo.java:832)
[ERROR] 	at org.apache.maven.plugin.DefaultBuildPluginManager.executeMojo(DefaultBuildPluginManager.java:134)
[ERROR] 	at org.apache.maven.lifecycle.internal.MojoExecutor.execute(MojoExecutor.java:208)
[ERROR] 	at org.apache.maven.lifecycle.internal.MojoExecutor.execute(MojoExecutor.java:154)
[ERROR] 	at org.apache.maven.lifecycle.internal.MojoExecutor.execute(MojoExecutor.java:146)
[ERROR] 	at org.apache.maven.lifecycle.internal.LifecycleModuleBuilder.buildProject(LifecycleModuleBuilder.java:117)
[ERROR] 	at org.apache.maven.lifecycle.internal.LifecycleModuleBuilder.buildProject(LifecycleModuleBuilder.java:81)
[ERROR] 	at org.apache.maven.lifecycle.internal.builder.singlethreaded.SingleThreadedBuilder.build(SingleThreadedBuilder.java:51)
[ERROR] 	at org.apache.maven.lifecycle.internal.LifecycleStarter.execute(LifecycleStarter.java:128)
[ERROR] 	at org.apache.maven.DefaultMaven.doExecute(DefaultMaven.java:309)
[ERROR] 	at org.apache.maven.DefaultMaven.doExecute(DefaultMaven.java:194)
[ERROR] 	at org.apache.maven.DefaultMaven.execute(DefaultMaven.java:107)
[ERROR] 	at org.apache.maven.cli.MavenCli.execute(MavenCli.java:955)
[ERROR] 	at org.apache.maven.cli.MavenCli.doMain(MavenCli.java:290)
[ERROR] 	at org.apache.maven.cli.MavenCli.main(MavenCli.java:194)
[ERROR] 	at sun.reflect.NativeMethodAccessorImpl.invoke0(Native Method)
[ERROR] 	at sun.reflect.NativeMethodAccessorImpl.invoke(NativeMethodAccessorImpl.java:62)
[ERROR] 	at sun.reflect.DelegatingMethodAccessorImpl.invoke(DelegatingMethodAccessorImpl.java:43)
[ERROR] 	at java.lang.reflect.Method.invoke(Method.java:498)
[ERROR] 	at org.codehaus.plexus.classworlds.launcher.Launcher.launchEnhanced(Launcher.java:289)
[ERROR] 	at org.codehaus.plexus.classworlds.launcher.Launcher.launch(Launcher.java:229)
[ERROR] 	at org.codehaus.plexus.classworlds.launcher.Launcher.mainWithExitCode(Launcher.java:415)
[ERROR] 	at org.codehaus.plexus.classworlds.launcher.Launcher.main(Launcher.java:356)
[ERROR] Caused by: java.lang.NoSuchMethodError: org.apache.maven.surefire.report.SafeThrowable.<init>(Ljava/lang/String;)V
[ERROR] 	at org.apache.maven.plugin.surefire.booterclient.output.DeserializedStacktraceWriter.getThrowable(DeserializedStacktraceWriter.java:71)
[ERROR] 	at org.apache.maven.plugin.surefire.booterclient.ForkStarter.fork(ForkStarter.java:673)
[ERROR] 	at org.apache.maven.plugin.surefire.booterclient.ForkStarter.fork(ForkStarter.java:535)
[ERROR] 	at org.apache.maven.plugin.surefire.booterclient.ForkStarter.access$700(ForkStarter.java:116)
[ERROR] 	at org.apache.maven.plugin.surefire.booterclient.ForkStarter$2.call(ForkStarter.java:431)
[ERROR] 	at org.apache.maven.plugin.surefire.booterclient.ForkStarter$2.call(ForkStarter.java:408)
[ERROR] 	at java.util.concurrent.FutureTask.run(FutureTask.java:266)
[ERROR] 	at java.util.concurrent.ThreadPoolExecutor.runWorker(ThreadPoolExecutor.java:1149)
[ERROR] 	at java.util.concurrent.ThreadPoolExecutor$Worker.run(ThreadPoolExecutor.java:624)
[ERROR] 	at java.lang.Thread.run(Thread.java:748)
[ERROR] 
[ERROR] -> [Help 1]
[ERROR] 
[ERROR] To see the full stack trace of the errors, re-run Maven with the -e switch.
[ERROR] Re-run Maven using the -X switch to enable full debug logging.
[ERROR] 
[ERROR] For more information about the errors and possible solutions, please read the following
articles:
[ERROR] [Help 1] http://cwiki.apache.org/confluence/display/MAVEN/MojoExecutionException
[ERROR] 
[ERROR] After correcting the problems, you can resume the build with the command
[ERROR]   mvn <goals> -rf :atlas-repository
Build step 'Execute shell' marked build as failure
[CHECKSTYLE] Collecting checkstyle analysis files...
[CHECKSTYLE] Searching for all files in <https://builds.apache.org/job/Atlas-master-UnitTests/ws/>
that match the pattern **/target/checkstyle-result.xml
[CHECKSTYLE] No files found. Configuration error?
<Git Blamer> Using GitBlamer to create author and commit information for all warnings.
<Git Blamer> GIT_COMMIT=4a8777b40e641584c088e6e9bc14145f72f681c0, workspace=<https://builds.apache.org/job/Atlas-master-UnitTests/ws/>
[CHECKSTYLE] Computing warning deltas based on reference build #166
[FINDBUGS] Collecting findbugs analysis files...
[FINDBUGS] Searching for all files in <https://builds.apache.org/job/Atlas-master-UnitTests/ws/>
that match the pattern **/target/findbugs.xml
[FINDBUGS] No files found. Configuration error?
<Git Blamer> Using GitBlamer to create author and commit information for all warnings.
<Git Blamer> GIT_COMMIT=4a8777b40e641584c088e6e9bc14145f72f681c0, workspace=<https://builds.apache.org/job/Atlas-master-UnitTests/ws/>
[FINDBUGS] Computing warning deltas based on reference build #166
Archiving artifacts
TestNG Reports Processing: START
Looking for TestNG results report in workspace using pattern: **/target/surefire-reports/testng-results.xml,**/target/failsafe-reports/testng-results.xml
Saving reports...
Processing '/x1/jenkins/jenkins-home/jobs/Atlas-master-UnitTests/builds/171/testng/testng-results-1.xml'
Processing '/x1/jenkins/jenkins-home/jobs/Atlas-master-UnitTests/builds/171/testng/testng-results-2.xml'
Processing '/x1/jenkins/jenkins-home/jobs/Atlas-master-UnitTests/builds/171/testng/testng-results-3.xml'
Processing '/x1/jenkins/jenkins-home/jobs/Atlas-master-UnitTests/builds/171/testng/testng-results-4.xml'
Processing '/x1/jenkins/jenkins-home/jobs/Atlas-master-UnitTests/builds/171/testng/testng-results-5.xml'
Processing '/x1/jenkins/jenkins-home/jobs/Atlas-master-UnitTests/builds/171/testng/testng-results.xml'
TestNG Reports Processing: FINISH

Mime
View raw message